<svg width="150" height="150" viewBox="0 0 150 150" fill="none" xmlns="http://www.w3.org/2000/svg">
<rect x="4" y="4" width="141.765" height="141.765" rx="36" stroke="white" stroke-width="8"/>
<rect x="52" y="62.0663" width="46.1726" height="46.1726" rx="12" fill="white" stroke="white" stroke-width="6"/>
<path d="M87.238 56.288C87.238 61.1142 87.2226 69.9567 85.3349 77.5464C84.3904 81.3438 83.0506 84.5044 81.2695 86.656C79.5918 88.6827 77.5289 89.8336 74.6849 89.8336C71.8409 89.8336 69.778 88.6827 68.1003 86.656C66.3193 84.5044 64.9795 81.3438 64.035 77.5464C62.1473 69.9567 62.1318 61.1142 62.1318 56.288C62.1318 48.4243 67.9918 42.5 74.6849 42.5C81.3781 42.5 87.238 48.4243 87.238 56.288Z" stroke="white" stroke-width="7"/>
<circle cx="74.6848" cy="82.3433" r="7.2239" fill="#3CD9C6"/>
<path d="M73.2265 84.6307C73.9127 82.9964 76.2284 82.9964 76.9146 84.6307L80.8339 93.9647C81.3873 95.2827 80.4193 96.739 78.9898 96.739H71.1513C69.7218 96.739 68.7538 95.2827 69.3073 93.9647L73.2265 84.6307Z" fill="#3CD9C6"/>
</svg>
