<svg width="1440" height="839" viewBox="0 0 1440 839" fill="none" xmlns="http://www.w3.org/2000/svg">
<rect x="-217" y="126.217" width="1809.39" height="713.983" transform="rotate(-4 -217 126.217)" fill="#3CD9C6"/>
</svg>
