<svg width="151" height="150" viewBox="0 0 151 150" fill="none" xmlns="http://www.w3.org/2000/svg">
<rect x="4.64697" y="4" width="141.765" height="141.765" rx="36" stroke="white" stroke-width="8"/>
<path d="M42.0898 78.5469C42.2591 80.3828 42.7995 81.7044 43.7109 82.5117C44.6224 83.306 45.944 83.7031 47.6758 83.7031C49.5898 83.7031 51.0091 83.0716 51.9336 81.8086C52.8581 80.5326 53.3919 78.651 53.5352 76.1641H44.5508V71.418H53.5156C53.3594 68.8789 52.7865 66.9974 51.7969 65.7734C50.8203 64.5365 49.4206 63.918 47.5977 63.918C45.8268 63.918 44.4987 64.3411 43.6133 65.1875C42.7279 66.0208 42.2135 67.3685 42.0703 69.2305H36.2109C36.4974 66.1185 37.6302 63.6641 39.6094 61.8672C41.6016 60.0703 44.2643 59.1719 47.5977 59.1719C49.9674 59.1719 52.0443 59.7318 53.8281 60.8516C55.625 61.9583 57.0052 63.5534 57.9688 65.6367C58.9323 67.707 59.4141 70.1224 59.4141 72.8828V74.7383C59.4141 78.931 58.3659 82.2578 56.2695 84.7188C54.1862 87.1667 51.3216 88.3906 47.6758 88.3906C44.3164 88.3906 41.6211 87.5052 39.5898 85.7344C37.5716 83.9505 36.4518 81.5547 36.2305 78.5469H42.0898ZM74.832 76.3789H71.4531V88H65.5938V59.5625H71.4531V70.9492H74.1289L81.082 59.5625H88.2305L79.4609 73.0195L89.1484 88H82.1562L74.832 76.3789ZM116.148 74.4258C116.148 77.2253 115.654 79.6797 114.664 81.7891C113.674 83.8984 112.255 85.526 110.406 86.6719C108.57 87.8177 106.461 88.3906 104.078 88.3906C101.721 88.3906 99.6185 87.8242 97.7695 86.6914C95.9206 85.5586 94.4883 83.944 93.4727 81.8477C92.457 79.7383 91.9427 77.3164 91.9297 74.582V73.1758C91.9297 70.3763 92.431 67.9154 93.4336 65.793C94.4492 63.6576 95.875 62.0234 97.7109 60.8906C99.5599 59.7448 101.669 59.1719 104.039 59.1719C106.409 59.1719 108.512 59.7448 110.348 60.8906C112.197 62.0234 113.622 63.6576 114.625 65.793C115.641 67.9154 116.148 70.3698 116.148 73.1562V74.4258ZM110.211 73.1367C110.211 70.1549 109.677 67.8893 108.609 66.3398C107.542 64.7904 106.018 64.0156 104.039 64.0156C102.073 64.0156 100.556 64.7839 99.4883 66.3203C98.4206 67.8438 97.8802 70.0833 97.8672 73.0391V74.4258C97.8672 77.3294 98.401 79.582 99.4688 81.1836C100.536 82.7852 102.073 83.5859 104.078 83.5859C106.044 83.5859 107.555 82.8177 108.609 81.2812C109.664 79.7318 110.198 77.4792 110.211 74.5234V73.1367Z" fill="white"/>
</svg>
