<svg width="151" height="150" viewBox="0 0 151 150" fill="none" xmlns="http://www.w3.org/2000/svg">
<path d="M91.2101 95.6364L88.2025 78.579L74.9342 89.7125L91.2101 95.6364ZM73.4674 76.825L81.3834 86.259L83.6816 84.3306L75.7655 74.8967L73.4674 76.825Z" fill="white"/>
<path d="M75 49L66.3397 64H83.6603L75 49ZM76.5 75V62.5H73.5V75H76.5Z" fill="white"/>
<path d="M111.5 75.5C111.5 95.3409 95.2 111.5 75 111.5C54.8 111.5 38.5 95.3409 38.5 75.5C38.5 55.6591 54.8 39.5 75 39.5C95.2 39.5 111.5 55.6591 111.5 75.5Z" stroke="white" stroke-width="7"/>
<rect x="4.58838" y="4" width="141.765" height="141.765" rx="36" stroke="white" stroke-width="8"/>
<circle cx="75" cy="75" r="4" fill="white"/>
</svg>
