<svg width="274" height="50" viewBox="0 0 274 50" fill="none" xmlns="http://www.w3.org/2000/svg">
<path d="M14.4756 40.8445C15.9733 40.8445 17.1902 40.4181 18.1263 39.5653C19.0623 38.7125 19.5491 37.5787 19.5865 36.1638H27.1967C27.178 38.2958 26.6164 40.2534 25.5118 42.0365C24.4073 43.8002 22.8908 45.1763 20.9625 46.1648C19.053 47.1338 16.9375 47.6184 14.616 47.6184C10.2727 47.6184 6.84673 46.1938 4.33809 43.3447C1.82944 40.4762 0.575116 36.5224 0.575116 31.4832V30.9308C0.575116 26.0854 1.82008 22.2187 4.31 19.3309C6.79993 16.443 10.2166 14.9991 14.5599 14.9991C18.3603 14.9991 21.4025 16.1232 23.6865 18.3715C25.9892 20.6004 27.1593 23.5754 27.1967 27.2967H19.5865C19.5491 25.6687 19.0623 24.3507 18.1263 23.3429C17.1902 22.3156 15.9546 21.802 14.4195 21.802C12.5286 21.802 11.0965 22.5191 10.1229 23.9534C9.16816 25.3682 8.69077 27.6747 8.69077 30.8726V31.7448C8.69077 34.9815 9.16816 37.3073 10.1229 38.7222C11.0777 40.1371 12.5286 40.8445 14.4756 40.8445Z" fill="#1F1F1F"/>
<path d="M43.2708 47.0369H35.127V2.38162H43.2708V47.0369Z" fill="#1F1F1F"/>
<path d="M66.8427 47.6184C62.387 47.6184 58.7551 46.2035 55.9469 43.3738C53.1575 40.5441 51.7627 36.7743 51.7627 32.0646V31.2506C51.7627 28.0914 52.3524 25.2713 53.5319 22.7905C54.7113 20.2903 56.3775 18.3715 58.5304 17.0341C60.7021 15.6774 63.1733 14.9991 65.9441 14.9991C70.1002 14.9991 73.367 16.3558 75.7446 19.0692C78.1409 21.7826 79.3391 25.6299 79.3391 30.611V34.0415H59.9907C60.2528 36.096 61.0391 37.7434 62.3496 38.9839C63.6788 40.2243 65.3543 40.8445 67.3762 40.8445C70.5027 40.8445 72.9458 39.6719 74.7056 37.3267L78.6932 41.9492C77.4763 43.7324 75.8289 45.1278 73.7508 46.1357C71.6728 47.1241 69.37 47.6184 66.8427 47.6184ZM65.916 21.802C64.306 21.802 62.9955 22.3641 61.9845 23.4882C60.9923 24.6124 60.3558 26.221 60.075 28.3143H71.3639V27.6456C71.3264 25.785 70.8397 24.3507 69.9036 23.3429C68.9675 22.3156 67.6383 21.802 65.916 21.802Z" fill="#1F1F1F"/>
<path d="M104.456 47.0369C104.081 46.281 103.81 45.341 103.641 44.2169C101.675 46.4846 99.12 47.6184 95.9748 47.6184C92.9981 47.6184 90.5269 46.7268 88.5612 44.9437C86.6142 43.1606 85.6407 40.9123 85.6407 38.1989C85.6407 34.8653 86.8295 32.3069 89.2071 30.5238C91.6034 28.7407 95.0575 27.8394 99.5693 27.82H103.304V26.0175C103.304 24.5639 102.939 23.401 102.209 22.5288C101.498 21.6567 100.365 21.2206 98.8111 21.2206C97.4444 21.2206 96.3679 21.5598 95.5816 22.2381C94.8141 22.9165 94.4303 23.8468 94.4303 25.0291H86.3146C86.3146 23.2072 86.8576 21.521 87.9434 19.9705C89.0292 18.4199 90.5644 17.2086 92.5488 16.3364C94.5333 15.4448 96.7611 14.9991 99.2323 14.9991C102.977 14.9991 105.944 15.9778 108.134 17.9354C110.343 19.8736 111.448 22.6064 111.448 26.1338V39.7688C111.467 42.7536 111.869 45.0116 112.655 46.5427V47.0369H104.456ZM97.7439 41.1934C98.9421 41.1934 100.047 40.922 101.058 40.3793C102.069 39.8173 102.817 39.0711 103.304 38.1408V32.7333H100.271C96.2088 32.7333 94.0465 34.1869 93.7844 37.0941L93.7563 37.5884C93.7563 38.635 94.112 39.4975 94.8234 40.1758C95.5348 40.8542 96.5084 41.1934 97.7439 41.1934Z" fill="#1F1F1F"/>
<path d="M128.027 15.5805L128.28 19.2146C130.452 16.4042 133.363 14.9991 137.014 14.9991C140.234 14.9991 142.63 15.9778 144.203 17.9354C145.775 19.8929 146.58 22.8196 146.618 26.7153V47.0369H138.502V26.9188C138.502 25.1357 138.128 23.8468 137.379 23.0521C136.63 22.2381 135.385 21.8311 133.644 21.8311C131.36 21.8311 129.647 22.8389 128.505 24.8546V47.0369H120.389V15.5805H128.027Z" fill="#1F1F1F"/>
<path fill-rule="evenodd" clip-rule="evenodd" d="M19.027 35.5684H27.7771L27.7718 36.1692C27.7521 38.4126 27.1593 40.4798 25.9959 42.3579L25.9944 42.3604C24.8302 44.2193 23.2329 45.6654 21.2177 46.6983L21.2157 46.6994C19.2203 47.712 17.0171 48.2138 14.616 48.2138C10.1405 48.2138 6.54908 46.7396 3.91306 43.7458L3.91175 43.7444C1.2813 40.7366 0 36.6243 0 31.4832V30.9308C0 25.9773 1.27498 21.9568 3.88095 18.9344C6.49801 15.8991 10.0819 14.4037 14.5599 14.4037C18.4746 14.4037 21.669 15.565 24.081 17.9382C26.5139 20.294 27.733 23.4325 27.7718 27.2905L27.7779 27.8921H19.0249L19.0116 27.3109C18.977 25.8056 18.5318 24.6385 17.7117 23.7555L17.7079 23.7515C16.8947 22.859 15.8181 22.3974 14.4195 22.3974C12.6907 22.3974 11.4458 23.0403 10.5939 24.2952C9.74359 25.5558 9.26589 27.7077 9.26589 30.8726V31.7448C9.26589 34.951 9.74434 37.1215 10.5944 38.3812C11.4224 39.6082 12.6803 40.2491 14.4756 40.2491C15.863 40.2491 16.9355 39.857 17.7463 39.1183C18.5501 38.386 18.9781 37.4148 19.0116 36.1475L19.027 35.5684ZM10.1229 23.9534C11.0965 22.5191 12.5286 21.802 14.4195 21.802C15.9546 21.802 17.1902 22.3156 18.1263 23.3429C19.0623 24.3507 19.5491 25.6687 19.5865 27.2967H27.1967C27.1947 27.0961 27.1894 26.8976 27.1808 26.7013C27.0298 23.2568 25.865 20.4802 23.6865 18.3715C21.4025 16.1232 18.3603 14.9991 14.5599 14.9991C10.2166 14.9991 6.79993 16.443 4.31 19.3309C1.82008 22.2187 0.575116 26.0854 0.575116 30.9308V31.4832C0.575116 36.5224 1.82944 40.4762 4.33809 43.3447C6.84673 46.1938 10.2727 47.6184 14.616 47.6184C16.9375 47.6184 19.053 47.1338 20.9625 46.1648C22.8908 45.1763 24.4073 43.8002 25.5118 42.0365C26.5127 40.4206 27.0678 38.6616 27.1771 36.7592C27.1884 36.5623 27.195 36.3638 27.1967 36.1638H19.5865C19.5491 37.5787 19.0623 38.7125 18.1263 39.5653C17.1902 40.4181 15.9733 40.8445 14.4756 40.8445C12.5286 40.8445 11.0777 40.1371 10.1229 38.7222C9.16816 37.3073 8.69077 34.9815 8.69077 31.7448V30.8726C8.69077 27.6747 9.16816 25.3682 10.1229 23.9534ZM43.8459 47.6323H34.5519V1.78621H43.8459V47.6323ZM55.5458 43.8005L55.5444 43.7991C52.6263 40.8388 51.1876 36.9058 51.1876 32.0646V31.2506C51.1876 28.0133 51.7923 25.1013 53.0158 22.5278C54.2404 19.9324 55.9799 17.9241 58.2346 16.5236C60.5038 15.1063 63.0791 14.4037 65.9441 14.4037C70.2314 14.4037 73.6648 15.8094 76.1706 18.6692C78.6928 21.5262 79.9142 25.5357 79.9142 30.611V34.6369H60.6697C60.9885 36.2521 61.6818 37.5444 62.7361 38.543C63.9456 39.671 65.4775 40.2491 67.3762 40.2491C70.3435 40.2491 72.6114 39.1471 74.2514 36.9615L74.6748 36.3972L79.4269 41.9059L79.1629 42.2928C77.8835 44.1676 76.155 45.6272 73.9948 46.6749L73.9909 46.6767C71.83 47.7046 69.4441 48.2138 66.8427 48.2138C62.2594 48.2138 58.4763 46.7534 55.5458 43.8005ZM62.3496 38.9839C61.1682 37.8656 60.4128 36.4167 60.0834 34.6369C60.0474 34.4424 60.0165 34.244 59.9907 34.0415H79.3391V30.611C79.3391 25.6299 78.1409 21.7826 75.7446 19.0692C73.367 16.3558 70.1002 14.9991 65.9441 14.9991C63.1733 14.9991 60.7021 15.6774 58.5304 17.0341C56.3775 18.3715 54.7113 20.2903 53.5319 22.7905C52.3524 25.2713 51.7627 28.0914 51.7627 31.2506V32.0646C51.7627 36.7743 53.1575 40.5441 55.9469 43.3738C58.7551 46.2035 62.387 47.6184 66.8427 47.6184C69.37 47.6184 71.6728 47.1241 73.7508 46.1357C75.8289 45.1278 77.4763 43.7324 78.6932 41.9492L74.7056 37.3267C74.5853 37.487 74.4618 37.6418 74.3352 37.7912C72.6086 39.8267 70.289 40.8445 67.3762 40.8445C65.3543 40.8445 63.6788 40.2243 62.3496 38.9839ZM69.489 23.7555L69.4852 23.7515C68.6849 22.8731 67.5242 22.3974 65.916 22.3974C64.4514 22.3974 63.2993 22.9011 62.4073 23.8919C61.6221 24.7824 61.0586 26.0433 60.7516 27.7189H70.7887V27.652C70.7524 25.8934 70.2947 24.623 69.489 23.7555ZM71.3639 27.6456V28.3143H60.075C60.1022 28.1112 60.1328 27.9128 60.1667 27.7189C60.4826 25.9135 61.0885 24.5033 61.9845 23.4882C62.9955 22.3641 64.306 21.802 65.916 21.802C67.6383 21.802 68.9675 22.3156 69.9036 23.3429C70.8397 24.3507 71.3264 25.785 71.3639 27.6456ZM104.104 47.6323L103.944 47.3086C103.672 46.7594 103.454 46.1322 103.288 45.4316C101.323 47.2887 98.873 48.2138 95.9748 48.2138C92.8793 48.2138 90.2673 47.283 88.1822 45.3915L88.1801 45.3897C86.1086 43.4925 85.0656 41.0813 85.0656 38.1989C85.0656 34.6959 86.3267 31.9487 88.8697 30.0416L88.8714 30.0403C91.4039 28.1558 94.9948 27.2443 99.5669 27.2246L99.5693 27.2246L102.729 27.2246V26.0175C102.729 24.6688 102.392 23.6569 101.774 22.9188L101.77 22.913C101.207 22.2229 100.268 21.816 98.8111 21.816C97.5353 21.816 96.605 22.1315 95.9524 22.6933C95.3323 23.2427 95.0054 23.9969 95.0054 25.0291V25.6245H85.7395V25.0291C85.7395 23.075 86.3246 21.2676 87.4778 19.621C88.6342 17.9697 90.2586 16.6964 92.3223 15.7891C94.388 14.8615 96.6945 14.4037 99.2323 14.4037C103.072 14.4037 106.186 15.4087 108.508 17.4833C110.868 19.5548 112.023 22.4668 112.023 26.1338L112.023 39.7649C112.023 39.7654 112.023 39.7659 112.023 39.7663C112.042 42.7144 112.442 44.8579 113.163 46.2632L113.231 46.3943V47.6323H104.104ZM111.448 39.7688V26.1338C111.448 22.6064 110.343 19.8736 108.134 17.9354C105.944 15.9778 102.977 14.9991 99.2323 14.9991C96.7611 14.9991 94.5333 15.4448 92.5488 16.3364C90.5644 17.2086 89.0292 18.4199 87.9434 19.9705C86.9768 21.3507 86.4405 22.8384 86.3343 24.4337C86.3212 24.6305 86.3146 24.829 86.3146 25.0291H94.4303C94.4303 23.8468 94.8141 22.9165 95.5816 22.2381C96.3679 21.5598 97.4444 21.2206 98.8111 21.2206C100.365 21.2206 101.498 21.6567 102.209 22.5288C102.939 23.401 103.304 24.5639 103.304 26.0175V27.82H99.5693C95.0575 27.8394 91.6034 28.7407 89.2071 30.5238C86.8295 32.3069 85.6407 34.8653 85.6407 38.1989C85.6407 40.9123 86.6142 43.1606 88.5612 44.9437C90.5269 46.7268 92.9981 47.6184 95.9748 47.6184C98.8623 47.6184 101.253 46.6628 103.146 44.7515C103.315 44.5809 103.48 44.4027 103.641 44.2169C103.679 44.4694 103.722 44.7126 103.77 44.9465C103.937 45.754 104.165 46.4508 104.456 47.0369H112.655V46.5427C112.638 46.5093 112.621 46.4756 112.605 46.4415C111.852 44.9128 111.466 42.6885 111.448 39.7688ZM100.789 39.8528C99.8652 40.3479 98.8534 40.598 97.7439 40.598C96.6112 40.598 95.7913 40.2892 95.2131 39.7379C94.6295 39.1814 94.3352 38.486 94.3315 37.6053L94.3579 37.1394C94.4762 35.8529 94.9998 34.9387 95.9159 34.3229C96.8645 33.6852 98.2925 33.3287 100.271 33.3287H102.729V37.9849C102.302 38.7419 101.663 39.3661 100.789 39.8528ZM103.304 38.1408C102.817 39.0711 102.069 39.8173 101.058 40.3793C100.047 40.922 98.9421 41.1934 97.7439 41.1934C96.5084 41.1934 95.5348 40.8542 94.8234 40.1758C94.112 39.4975 93.7563 38.635 93.7563 37.5884L93.7844 37.0941C94.0465 34.1869 96.2088 32.7333 100.271 32.7333H103.304V38.1408ZM128.563 14.9851L128.756 17.7704C130.926 15.5258 133.691 14.4037 137.014 14.4037C140.348 14.4037 142.931 15.4217 144.645 17.5547C146.337 19.6607 147.155 22.7458 147.193 26.7094L147.193 26.7153L147.193 47.6323H137.927V26.9188C137.927 25.2009 137.563 24.1003 136.967 23.4679L136.962 23.4628C136.372 22.8214 135.319 22.4265 133.644 22.4265C131.613 22.4265 130.115 23.2805 129.08 25.0198V47.6323H119.814V14.9851H128.563ZM128.505 24.8546C129.647 22.8389 131.36 21.8311 133.644 21.8311C135.385 21.8311 136.63 22.2381 137.379 23.0521C138.128 23.8468 138.502 25.1357 138.502 26.9188V47.0369H146.618V26.7153C146.58 22.8196 145.775 19.8929 144.203 17.9354C142.63 15.9778 140.234 14.9991 137.014 14.9991C133.653 14.9991 130.919 16.1897 128.812 18.5711C128.63 18.7767 128.453 18.9912 128.28 19.2146L128.027 15.5805H120.389V47.0369H128.505V24.8546ZM43.2708 47.0369V2.38162H35.127V47.0369H43.2708Z" fill="#1F1F1F"/>
<path fill-rule="evenodd" clip-rule="evenodd" d="M156.62 17.9229L156.623 17.9189C159.215 14.3882 162.819 12.6175 167.188 12.6175C169.008 12.6175 170.692 12.9812 172.217 13.7009V0H184.962V49.4185H173.294L173.174 48.3965C171.391 49.4575 169.367 50 167.132 50C162.85 50 159.302 48.2099 156.691 44.7145L156.686 44.7075L156.681 44.7005C154.119 41.2188 152.981 36.5825 152.981 31.0761C152.981 25.8332 154.112 21.3695 156.617 17.9269L156.62 17.9229ZM172.865 45.7692C173.614 45.206 174.305 44.5141 174.939 43.6936L175.332 47.0369H182.661V2.38162H174.518V18.4296C173.818 17.6004 173.052 16.9215 172.217 16.393C170.75 15.4637 169.074 14.9991 167.188 14.9991C163.5 14.9991 160.589 16.4527 158.455 19.3599C156.339 22.2672 155.281 26.1726 155.281 31.0761C155.281 36.2704 156.358 40.3309 158.511 43.2575C160.683 46.1648 163.556 47.6184 167.132 47.6184C169.317 47.6184 171.228 47.002 172.865 45.7692ZM165.698 31.6867C165.698 34.4124 166.166 36.137 166.81 37.1566C167.356 38.0197 168.055 38.4338 169.21 38.4338C170.139 38.4338 170.78 38.2332 171.238 37.95C171.591 37.7317 171.922 37.4101 172.217 36.9233V25.7134C171.927 25.2257 171.601 24.9063 171.257 24.6908C170.811 24.4121 170.183 24.2127 169.266 24.2127C168.06 24.2127 167.357 24.647 166.823 25.5449C166.175 26.632 165.698 28.5688 165.698 31.6867ZM174.518 25.1163V37.5302C173.488 39.7204 171.719 40.8154 169.21 40.8154C167.319 40.8154 165.878 40.0305 164.885 38.4606C163.893 36.8906 163.397 34.6327 163.397 31.6867C163.397 25.1163 165.353 21.8311 169.266 21.8311C171.756 21.8311 173.507 22.9262 174.518 25.1163ZM196.131 14.9559L196.135 14.9536C198.724 13.3724 201.675 12.6175 204.913 12.6175C209.52 12.6175 213.465 14.0958 216.538 17.183C219.625 20.2658 221.255 24.388 221.586 29.3119L221.59 29.3623L221.648 31.5963V31.6285C221.648 36.9179 220.209 41.4145 217.137 44.8705L217.131 44.8763C214.029 48.342 209.889 50 204.969 50C200.049 50 195.904 48.3422 192.785 44.8825L192.782 44.8794L192.779 44.8763C189.688 41.4219 188.263 36.8332 188.263 31.3959V31.018C188.263 27.5865 188.903 24.4368 190.24 21.6227C191.589 18.7845 193.557 16.5412 196.127 14.9582L196.131 14.9559ZM214.939 18.8948C212.355 16.2976 209.013 14.9991 204.913 14.9991C202.03 14.9991 199.493 15.6677 197.303 17.0051C195.131 18.3424 193.465 20.2321 192.305 22.6742C191.144 25.1163 190.563 27.8976 190.563 31.018V31.3959C190.563 36.3964 191.865 40.3503 194.467 43.2575C197.088 46.1648 200.589 47.6184 204.969 47.6184C209.35 47.6184 212.842 46.1648 215.444 43.2575C218.046 40.3309 219.347 36.4546 219.347 31.6285L219.291 29.4772C218.992 25.0194 217.541 21.4919 214.939 18.8948ZM202.19 25.5848L202.186 25.5903C201.51 26.5791 200.98 28.4509 200.98 31.6285C200.98 34.3635 201.485 36.0859 202.184 37.1109C202.796 37.9923 203.621 38.4629 204.969 38.4629C206.25 38.4629 207.077 38.0097 207.719 37.1107C208.389 36.1552 208.931 34.2794 208.931 31.018C208.931 28.3593 208.423 26.6485 207.7 25.5949C207.052 24.6514 206.216 24.1836 204.913 24.1836C203.638 24.1836 202.826 24.6427 202.194 25.5792L202.19 25.5848ZM209.575 38.5187C208.47 40.0692 206.935 40.8445 204.969 40.8445C202.948 40.8445 201.394 40.0595 200.308 38.4896C199.222 36.9003 198.679 34.6133 198.679 31.6285C198.679 28.2755 199.222 25.8043 200.308 24.215C201.394 22.6064 202.929 21.802 204.913 21.802C206.916 21.802 208.47 22.6064 209.575 24.215C210.679 25.8237 211.232 28.0914 211.232 31.018C211.232 34.4486 210.679 36.9488 209.575 38.5187ZM237.24 16.9978C236.453 17.5735 235.734 18.2737 235.084 19.0983L234.832 15.5805H227.222V47.0369H235.337V24.7965C236.367 22.8196 238.033 21.8311 240.336 21.8311C242.002 21.8311 243.181 22.2381 243.874 23.0521C244.567 23.8662 244.913 25.1841 244.913 27.006V47.0369H253.029L253.001 25.4361C253.937 23.0328 255.622 21.8311 258.055 21.8311C259.759 21.8311 260.948 22.2478 261.622 23.0812C262.296 23.8952 262.633 25.1938 262.633 26.9769V47.0369H270.776V26.9479C270.776 22.9552 269.971 19.9705 268.361 17.9935C266.751 15.9972 264.299 14.9991 261.004 14.9991C257.958 14.9991 255.452 15.9498 253.486 17.8511C252.902 18.4156 252.366 19.0639 251.877 19.796C251.508 18.9861 251.059 18.2788 250.532 17.674C248.978 15.8907 246.74 14.9991 243.818 14.9991C241.256 14.9991 239.063 15.6653 237.24 16.9978ZM252.107 15.9291C254.484 13.7225 257.492 12.6175 261.004 12.6175C264.751 12.6175 267.949 13.7694 270.123 16.4621C272.227 19.0481 273.077 22.6868 273.077 26.9479V49.4185H260.332V26.9769C260.332 25.4132 260.021 24.807 259.875 24.6312L259.866 24.6207L259.858 24.6101C259.832 24.5782 259.495 24.2127 258.055 24.2127C257.214 24.2127 256.662 24.4151 256.271 24.6936C255.94 24.9302 255.601 25.31 255.302 25.9379L255.332 49.4185H242.613V27.006C242.613 25.3993 242.29 24.7935 242.148 24.6265C242.094 24.5629 241.725 24.2127 240.336 24.2127C239.506 24.2127 238.924 24.3887 238.503 24.6388C238.197 24.8202 237.905 25.0817 237.638 25.4674V49.4185H224.921V13.1989H236.967L237.048 14.3151C239.027 13.1798 241.301 12.6175 243.818 12.6175C246.073 12.6175 248.142 13.0787 249.914 14.1336C250.74 14.6253 251.47 15.2275 252.107 15.9291Z" fill="#1F1F1F"/>
</svg>
