module github.com/tsirysndr/mg-geojson

go 1.14

require (
	github.com/mitchellh/go-homedir v1.1.0
	github.com/rs/xid v1.2.1
	github.com/spf13/cobra v0.0.6
	github.com/spf13/viper v1.6.2
	github.com/vmihailenco/msgpack v4.0.4+incompatible
)
