%YAML 1.1
%TAG !u! tag:unity3d.com,2011:
--- !u!21 &2100000
Material:
  serializedVersion: 6
  m_ObjectHideFlags: 0
  m_CorrespondingSourceObject: {fileID: 0}
  m_PrefabInstance: {fileID: 0}
  m_PrefabAsset: {fileID: 0}
  m_Name: skin1
  m_Shader: {fileID: -6465566751694194690, guid: 62c93cfd59430b848bc67204bb3b8039, type: 3}
  m_ShaderKeywords: BOOLEAN_USENORMAL_ON BOOLEAN_USERIM_ON
  m_LightmapFlags: 4
  m_EnableInstancingVariants: 0
  m_DoubleSidedGI: 0
  m_CustomRenderQueue: -1
  stringTagMap: {}
  disabledShaderPasses: []
  m_SavedProperties:
    serializedVersion: 3
    m_TexEnvs:
    - _Albedo:
        m_Texture: {fileID: 2800000, guid: cc51a9a8397e3c5498dda60419ad3ec9, type: 3}
        m_Scale: {x: 1, y: 1}
        m_Offset: {x: 0, y: 0}
    - _AmbientOcclusion:
        m_Texture: {fileID: 2800000, guid: d0bbcc28006dcfa4a9989d24dfbad868, type: 3}
        m_Scale: {x: 1, y: 1}
        m_Offset: {x: 0, y: 0}
    - _Emission:
        m_Texture: {fileID: 0}
        m_Scale: {x: 1, y: 1}
        m_Offset: {x: 0, y: 0}
    - _FalloffSampler:
        m_Texture: {fileID: 2800000, guid: a1d5b2277eb3f6245900378e6fa97575, type: 3}
        m_Scale: {x: 1, y: 1}
        m_Offset: {x: 0, y: 0}
    - _MainTex:
        m_Texture: {fileID: 2800000, guid: cc51a9a8397e3c5498dda60419ad3ec9, type: 3}
        m_Scale: {x: 1, y: 1}
        m_Offset: {x: 0, y: 0}
    - _Metallic:
        m_Texture: {fileID: 0}
        m_Scale: {x: 1, y: 1}
        m_Offset: {x: 0, y: 0}
    - _MetallicTexture:
        m_Texture: {fileID: 0}
        m_Scale: {x: 1, y: 1}
        m_Offset: {x: 0, y: 0}
    - _Normal:
        m_Texture: {fileID: 2800000, guid: 5682ce9963d3f404892ce746c1817ce4, type: 3}
        m_Scale: {x: 1, y: 1}
        m_Offset: {x: 0, y: 0}
    - _RimLightSampler:
        m_Texture: {fileID: 2800000, guid: a18067604964b5a4d8fd5552ed0d789e, type: 3}
        m_Scale: {x: 1, y: 1}
        m_Offset: {x: 0, y: 0}
    - _Smoothness:
        m_Texture: {fileID: 0}
        m_Scale: {x: 1, y: 1}
        m_Offset: {x: 0, y: 0}
    - _SmoothnessTexture:
        m_Texture: {fileID: 0}
        m_Scale: {x: 1, y: 1}
        m_Offset: {x: 0, y: 0}
    - _Specular:
        m_Texture: {fileID: 0}
        m_Scale: {x: 1, y: 1}
        m_Offset: {x: 0, y: 0}
    - unity_Lightmaps:
        m_Texture: {fileID: 0}
        m_Scale: {x: 1, y: 1}
        m_Offset: {x: 0, y: 0}
    - unity_LightmapsInd:
        m_Texture: {fileID: 0}
        m_Scale: {x: 1, y: 1}
        m_Offset: {x: 0, y: 0}
    - unity_ShadowMasks:
        m_Texture: {fileID: 0}
        m_Scale: {x: 1, y: 1}
        m_Offset: {x: 0, y: 0}
    m_Floats:
    - BOOLEAN_USENORMAL: 1
    - BOOLEAN_USERIM: 1
    - ENUM_SURFACESCATTERING: 0
    - _EdgeThickness: 0.5
    - _FalloffPower: 1
    - _HighlightStrength: 0.25
    - _Metallic: 0
    - _MetallicStrength: 0
    - _NormalRotation: 0
    - _NormalStrength: 4
    - _Rim: 0.5
    - _RimBool: 1
    - _Saturation: 0.4
    - _Smoothness: 0.5
    - _SmoothnessStrength: 0.3
    - _SpecularStrength: 0
    m_Colors:
    - _AlbedoHDRColor: {r: 1, g: 0.5896226, b: 0.5896226, a: 0}
    - _Color: {r: 1, g: 1, b: 1, a: 1}
    - _NormalTiling: {r: 30, g: 30, b: 0, a: 0}
    - _RimHDRColor: {r: 0.1, g: 0.1, b: 0.1, a: 0}
    - _ShadowColor: {r: 0.8, g: 0.8, b: 1, a: 1}
  m_BuildTextureStacks: []
