﻿CONTENTS				
ID	LIMA	GRAMMA	IMAGE
1	Αθηνά	Α	Athina.jpg
1a	Αίγυπτος	Α	egypt.jpg
2	Ακρόπολη	Α	Acropolis.jpg
3	Αξιός	Α	axios.jpg
4	Απόλλωνας	Α	Apollonas.jpg
5	Άρης	Α	Aris.jpg
6	αρκούδα	Α	bear.jpg
7	Αφροδίτη	Α	Afroditi.jpg
20	γαλατάς	Γ	galatas.jpg
23	γεωργός	Γ	georgos.jpg
22	δάσκαλος	Δ	daskalos.jpg
8	Δήμητρα	Δ	Dimitra.jpg
9	Ερμής	Ε	Ermis.jpg
10	Ζαγοροχώρια	Ζ	zagorohoria.jpg
11	Ικτίνος	Ι	iktinos.jpg
24	κουρέας	Κ	koureas.jpg
25	κρεοπώλης	Κ	kreopolis.jpg
12	μαντινάδα	Μ	mantinada.jpg
12b	Μεσοποταμία	Μ	mesopotamia.jpg
12a	Μίνωας	Μ	minoas.jpg
19	μοδίστρα	Μ	modistra.jpg
13	Όλυμπος	Ο	Olumpos.jpg
14	πάπυρος	Π	papyros.jpg
15	Παρθενώνας	Π	Parthenonas.jpg
16	περγαμηνή	Π	pergamini.jpg
16a	Φαιστός	Φ	faistos.jpg
17	Φειδίας	Φ	feidias.jpg
17a	Φοίνικες	Φ	finikes.jpg
21	φούρναρης	Φ	furnaris.jpg
18	χελώνα καρέτα-καρέτα	Χ	xelona.jpg