PAIXNIDI				
ARTHRO	SOMA	KATALIKSI	LEKSI	DRASTHRIOTHTA
ο	κατ	ής	ο κατής	paramithi
του	κατ	ή	του κατή	paramithi
τον	κατ	ή	τον κατή	paramithi
	κατ	ή	 κατής	paramithi
οι	κατ	ήδες	οι κατήδες	paramithi
των	κατ	ήδων	των κατήδων	paramithi
τους	κατ	ήδες	τους κατήδες	paramithi
	κατ	ήδες	 κατήδες	paramithi
ο	συγγεν	ής	ο συγγενής	the_bear
του	συγγεν	ή	του συγγενή	the_bear
τον	συγγεν	ή	τον συγγενή	the_bear
	συγγεν	ή	 συγγενή	the_bear
οι	συγγεν	είς	οι συγγενείς	the_bear
των	συγγεν	ών	των συγγενών	the_bear
τους	συγγεν	είς	τους συγγενείς	the_bear
	συγγεν	είς	 συγγενείς	the_bear
ο	κάτοικ	ος	ο κάτοικος	EgataleleimenaXoria
του	κατοίκ	ου	του κατοίκου	EgataleleimenaXoria
τον	κάτοικ	ο	τον κάτοικο	EgataleleimenaXoria
	κάτοικ	ε	 κάτοικε	EgataleleimenaXoria
οι	κάτοικ	οι	οι κάτοικοι	EgataleleimenaXoria
των	κατοίκ	ων	των κατοίκων	EgataleleimenaXoria
τους	κατοίκ	ους	τους κατοίκους	EgataleleimenaXoria
	κάτοικ	οι	 κάτοικοι	EgataleleimenaXoria
ο	ψαρ	άς	ο ψαράς	Krhth
του	ψαρ	ά	του ψαρά	Krhth
τον	ψαρ	ά	τον ψαρά	Krhth
	ψαρ	ά	 ψαρά	Krhth
οι	ψαρ	άδες	οι ψαράδες	Krhth
των	ψαρ	άδων	των ψαράδων	Krhth
τους	ψαρ	άδες	τους ψαράδες	Krhth
	ψαρ	άδες	 ψαράδες	Krhth
η	οδ	ός	η οδός	Thessaloniki
της	οδ	ού	της οδού	Thessaloniki
την	οδ	ό	την οδό	Thessaloniki
	οδ	ό	 οδό	Thessaloniki
οι	οδ	οί	οι οδοί	Thessaloniki
των	οδ	ών	των οδών	Thessaloniki
τις	οδ	ούς	τις οδούς	Thessaloniki
	οδ	οί	 οδοί	Thessaloniki
η	θε	ά	η θεά	Olympos
της	θε	άς	της θεάς	Olympos
τη	θε	ά	τη θεά	Olympos
	θε	ά	 θεά	Olympos
οι	θε	ές	οι θεές	Olympos
των	θε	ών	των θεών	Olympos
τις	θε	ές	τις θεές	Olympos
	θε	ές	 θεές	Olympos
το	λιμάν	ι	το λιμάνι	alexandroupoli
του	λιμαν	ιού	του λιμανιού	alexandroupoli
	λιμάν	ι	 λιμάνι	alexandroupoli
τα	λιμάν	ια	τα λιμάνια	alexandroupoli
των	λιμαν	ιών	των λιμανιών	alexandroupoli
	λιμάν	ια	 λιμάνια	alexandroupoli
το	ράμφ	ος	το ράμφος	DeltaAksiou
του	ράμφ	ους	του ράμφους	DeltaAksiou
	ράμφ	ος	 ράμφος	DeltaAksiou
τα	ράμφ	η	τα ράμφη	DeltaAksiou
των	ραμφ	ών	των ραμφών	DeltaAksiou
	ράμφ	η	 ράμφη	DeltaAksiou
το	χωρι	ό	το χωριό	zagorohoria
του	χωρι	ού	του χωριού	zagorohoria
	χωρι	ό	 χωριό	zagorohoria
τα	χωρι	ά	τα χωριά	zagorohoria
των	χωρι	ών	των χωριών	zagorohoria
	χωρι	ά	 χωριά	zagorohoria
το	κρέ	ας	το κρέας	volos2
του	κρέ	ατος	του κρέατος	volos2
	κρέ	ας	 κρέας	volos2
τα	κρέ	ατα	τα κρέατα	volos2
των	κρε	άτων	των κρεάτων	volos2
	κρέ	ατα	 κρέατα	volos2
το	μέλλ	ον	το μέλλον	Athina
του	μέλλ	οντος	του μέλλοντος	Athina
	μέλλ	ον	 μέλλον	Athina
τα	μέλλ	οντα	τα μέλλοντα	Athina
των	μελλ	όντων	των μελλόντων	Athina
	μέλλ	οντα	 μέλλοντα	Athina
το	φ	ως	το φως	Zakinthos
του	φ	ωτός	του φωτός	Zakinthos
	φ	ως	 φως	Zakinthos
τα	φ	ώτα	τα φώτα	Zakinthos
των	φ	ώτων	των φώτων	Zakinthos
	φ	ώτα	 φώτα	Zakinthos
ο	πατρ	ινός	ο πατρινός	Patra
του	πατρ	ινού	του πατρινού	Patra
τον	πατρ	ινό	τον πατρινό	Patra
	πατρ	ινέ	 πατρινέ	Patra
οι	πατρ	ινοί	οι πατρινοί	Patra
των	πατρ	ινών	των πατρινών	Patra
τους	πατρ	ινούς	τους πατρινούς	Patra
	πατρ	ινοί	 πατρινοί	Patra
ο	νόστ	ιμος	ο νόστιμος	Mikines
του	νόστ	ιμου	του νόστιμου	Mikines
τον	νόστ	ιμο	τον νόστιμο	Mikines
	νόστ	ιμε	 νόστιμε	Mikines
οι	νόστ	ιμοι	οι νόστιμοι	Mikines
των	νόστ	ιμων	των νόστιμων	Mikines
τους	νόστ	ιμους	τους νόστιμους	Mikines
	νόστ	ιμοι	 νόστιμοι	Mikines
η	βροχ	ή	η βροχή	FysikoTopio
της	βροχ	ής	της βροχής	FysikoTopio
τη	βροχ	ή	τη βροχή	FysikoTopio
	βροχ	ή	 βροχή	FysikoTopio
οι	βροχ	ές	οι βροχές	FysikoTopio
των	βροχ	ών	των βροχών	FysikoTopio
τις	βροχ	ές	τις βροχές	FysikoTopio
	βροχ	ές	 βροχές	FysikoTopio
το	κρέ	ας	το κρέας	Volos
του	κρέ	ατος	του κρέατος	Volos
το	κρέ	ας	το κρέας	Volos
	κρέ	ας	 κρέας	Volos
τα	κρέ	ατα	τα κρέατα	Volos
των	κρε	άτων	των κρεάτων	Volos
τα	κρέ	ατα	τα κρέατα	Volos
	κρέ	ατα	 κρέατα	Volos
