Φ
id	word	file
310	φακός	fakos.mp3
311	φανάρι	fanari.mp3
312	Φάνης	fanhs.mp3
313	φεγγάρι	feggari.mp3
314	φίδι	fidi.mp3
315	φόρεμα	forema.mp3
316	φούστα	fousta.mp3
317	φράουλα	fraoyla.mp3
318	φύλλο	fillo.mp3
319	φωλιά	folia.mp3
320	Φωτεινή	foteini.mp3
321	φωτιά	fotia.mp3
322	φ	F.mp3