TH
id	word	file
77	θάμνος	thamnos.mp3
78	θερμάστρα	thermastra.mp3
79	θερμόμετρο	thermometro.mp3
80	θερμοφόρα	thermofora.mp3
81	θυμός	thimos.mp3
82	Θωμάς	thomas.mp3
83	θ	TH.mp3
84	θ_name	nameTH.mp3