{
	"id": "df5ba56e-cd1e-ca7a-16a4-bb8f69686423",
	"name": "Explore California API's",
	"description": "These are examples on how to invoke the Explore California Application RESTful API's",
	"order": [],
	"folders": [
		{
			"id": "60d77d20-a9a1-c03a-a3f1-ac862743f3fe",
			"name": "Introduction",
			"description": "",
			"order": [
				"9285bb82-6983-27c1-db1e-7ee461ff9eeb",
				"08d7882b-8094-9bd0-0624-3fdeff7bfc09",
				"385a4131-150e-1b49-8801-56369b205db8",
				"d08aa76e-2d5b-d84e-d23a-93cb7f0e451c",
				"338c7c69-47c3-4631-52d3-ecbf6de52268",
				"f45cfa73-aa9b-560c-17a5-267a81aac93d",
				"96c0a1dc-cf58-c037-5c30-7559d9a36cfb",
				"b609a9b2-35a1-95a0-febd-17bf64496066",
				"01d450d0-b6cb-c668-0e31-fb146c848ad2",
				"cd188cc8-4d11-c585-07fc-e3ee5b442344",
				"713fabeb-fe65-1acc-0575-238eb4f40824",
				"7a9335d8-ab4e-f7c8-eacb-59dbe633867d",
				"37567dd6-3428-f28d-ff91-133c2d6a5fbb",
				"13d43fa1-c597-b711-7b31-f4b4e1c0fc1f",
				"3a750031-8c54-5a2a-33a8-7a8c0a38c253",
				"e13cf3cf-fae9-1083-01ad-3bd320d186ad"
			],
			"folders_order": [],
			"owner": "2336236",
			"collectionId": "df5ba56e-cd1e-ca7a-16a4-bb8f69686423"
		}
	],
	"folders_order": [
		"60d77d20-a9a1-c03a-a3f1-ac862743f3fe"
	],
	"timestamp": 0,
	"owner": "2336236",
	"public": false,
	"requests": [
		{
			"id": "01d450d0-b6cb-c668-0e31-fb146c848ad2",
			"name": "User Signin",
			"description": "",
			"collectionId": "df5ba56e-cd1e-ca7a-16a4-bb8f69686423",
			"method": "POST",
			"headers": "Content-Type: application/json\nAuthorization: Bearer  eyJhbGciOiJIUzI1NiJ9.eyJzdWIiOiJjc3JfamFuZSIsImF1dGgiOlt7ImF1dGhvcml0eSI6IlJPTEVfQ1NSIn1dLCJpYXQiOjE1Mjc1NTc1NDIsImV4cCI6MTUyNzU1ODE0Mn0.9y1HlZwh_aGV1dVTBu0uDAzC80YX8pB1naX06eApfEQ",
			"dataMode": "raw",
			"data": [],
			"rawModeData": "{\n    \"score\":5,\n    \"comment\":\"I thought it was ok\",\n    \"customerId\":8\n}",
			"pathVariables": {},
			"url": "http://localhost:8080/tours/1/ratings",
			"responses": [],
			"pathVariableData": [],
			"queryParams": [],
			"headerData": [
				{
					"key": "Content-Type",
					"value": "application/json"
				},
				{
					"key": "Authorization",
					"value": "Bearer  eyJhbGciOiJIUzI1NiJ9.eyJzdWIiOiJjc3JfamFuZSIsImF1dGgiOlt7ImF1dGhvcml0eSI6IlJPTEVfQ1NSIn1dLCJpYXQiOjE1Mjc1NTc1NDIsImV4cCI6MTUyNzU1ODE0Mn0.9y1HlZwh_aGV1dVTBu0uDAzC80YX8pB1naX06eApfEQ"
				}
			],
			"collection_id": "df5ba56e-cd1e-ca7a-16a4-bb8f69686423",
			"folder": "60d77d20-a9a1-c03a-a3f1-ac862743f3fe",
			"isFromCollection": true,
			"collectionRequestId": "b609a9b2-35a1-95a0-febd-17bf64496066"
		},
		{
			"id": "08d7882b-8094-9bd0-0624-3fdeff7bfc09",
			"name": "Get All Tours  (mysql 8181)",
			"description": "",
			"collectionId": "df5ba56e-cd1e-ca7a-16a4-bb8f69686423",
			"method": "GET",
			"headers": "",
			"dataMode": "raw",
			"data": [],
			"rawModeData": "",
			"pathVariables": {},
			"url": "http://localhost:8080/tours",
			"responses": [],
			"pathVariableData": [],
			"queryParams": [],
			"headerData": [],
			"collection_id": "df5ba56e-cd1e-ca7a-16a4-bb8f69686423",
			"folder": "60d77d20-a9a1-c03a-a3f1-ac862743f3fe",
			"isFromCollection": true,
			"collectionRequestId": "9285bb82-6983-27c1-db1e-7ee461ff9eeb"
		},
		{
			"id": "13d43fa1-c597-b711-7b31-f4b4e1c0fc1f",
			"name": "Create Several Tour Rating  for one tour",
			"description": "",
			"collectionId": "df5ba56e-cd1e-ca7a-16a4-bb8f69686423",
			"method": "GET",
			"headers": "",
			"dataMode": "raw",
			"data": [],
			"rawModeData": "",
			"pathVariables": {},
			"url": "http://localhost:8080/tours/1/ratings",
			"responses": [],
			"pathVariableData": [],
			"queryParams": [],
			"headerData": [],
			"collection_id": "df5ba56e-cd1e-ca7a-16a4-bb8f69686423",
			"folder": "60d77d20-a9a1-c03a-a3f1-ac862743f3fe",
			"isFromCollection": true,
			"collectionRequestId": "cd188cc8-4d11-c585-07fc-e3ee5b442344"
		},
		{
			"id": "338c7c69-47c3-4631-52d3-ecbf6de52268",
			"name": "Get Roles",
			"description": "",
			"collectionId": "df5ba56e-cd1e-ca7a-16a4-bb8f69686423",
			"method": "GET",
			"headers": "",
			"dataMode": "raw",
			"data": [],
			"rawModeData": "",
			"pathVariables": {},
			"url": "http://localhost:8080/tours",
			"responses": [],
			"pathVariableData": [],
			"queryParams": [],
			"headerData": [],
			"collection_id": "df5ba56e-cd1e-ca7a-16a4-bb8f69686423",
			"folder": "60d77d20-a9a1-c03a-a3f1-ac862743f3fe",
			"isFromCollection": true,
			"collectionRequestId": "9285bb82-6983-27c1-db1e-7ee461ff9eeb"
		},
		{
			"id": "37567dd6-3428-f28d-ff91-133c2d6a5fbb",
			"name": "Get Ratings Single",
			"description": "",
			"collectionId": "df5ba56e-cd1e-ca7a-16a4-bb8f69686423",
			"method": "GET",
			"headers": "",
			"dataMode": "raw",
			"data": [],
			"rawModeData": "",
			"pathVariables": {},
			"url": "http://localhost:8080/tours/1/ratings",
			"responses": [],
			"pathVariableData": [],
			"queryParams": [],
			"headerData": [],
			"collection_id": "df5ba56e-cd1e-ca7a-16a4-bb8f69686423",
			"folder": "60d77d20-a9a1-c03a-a3f1-ac862743f3fe",
			"isFromCollection": true,
			"collectionRequestId": "cd188cc8-4d11-c585-07fc-e3ee5b442344"
		},
		{
			"id": "385a4131-150e-1b49-8801-56369b205db8",
			"name": "Get All Tours  (docker 8282)",
			"description": "",
			"collectionId": "df5ba56e-cd1e-ca7a-16a4-bb8f69686423",
			"method": "GET",
			"headers": "",
			"dataMode": "raw",
			"data": [],
			"rawModeData": "",
			"pathVariables": {},
			"url": "http://localhost:8080/tours",
			"responses": [],
			"pathVariableData": [],
			"queryParams": [],
			"headerData": [],
			"collection_id": "df5ba56e-cd1e-ca7a-16a4-bb8f69686423",
			"folder": "60d77d20-a9a1-c03a-a3f1-ac862743f3fe",
			"isFromCollection": true,
			"collectionRequestId": "08d7882b-8094-9bd0-0624-3fdeff7bfc09"
		},
		{
			"id": "3a750031-8c54-5a2a-33a8-7a8c0a38c253",
			"name": "Lookup Average Score",
			"description": "",
			"collectionId": "df5ba56e-cd1e-ca7a-16a4-bb8f69686423",
			"method": "GET",
			"headers": "",
			"dataMode": "raw",
			"data": [],
			"rawModeData": "",
			"url": "http://localhost:8080/tours/1/ratings/average",
			"responses": [],
			"pathVariableData": [],
			"queryParams": [],
			"headerData": [],
			"collection_id": "df5ba56e-cd1e-ca7a-16a4-bb8f69686423",
			"folder": "60d77d20-a9a1-c03a-a3f1-ac862743f3fe"
		},
		{
			"id": "713fabeb-fe65-1acc-0575-238eb4f40824",
			"name": "Get Ratings",
			"description": "",
			"collectionId": "df5ba56e-cd1e-ca7a-16a4-bb8f69686423",
			"method": "GET",
			"headers": "",
			"dataMode": "raw",
			"data": [],
			"rawModeData": "",
			"pathVariables": {},
			"url": "http://localhost:8080/tours/1/ratings",
			"responses": [],
			"pathVariableData": [],
			"queryParams": [],
			"headerData": [],
			"collection_id": "df5ba56e-cd1e-ca7a-16a4-bb8f69686423",
			"folder": "60d77d20-a9a1-c03a-a3f1-ac862743f3fe",
			"isFromCollection": true,
			"collectionRequestId": "cd188cc8-4d11-c585-07fc-e3ee5b442344"
		},
		{
			"id": "7a9335d8-ab4e-f7c8-eacb-59dbe633867d",
			"name": "Get Ratings Paging",
			"description": "",
			"collectionId": "df5ba56e-cd1e-ca7a-16a4-bb8f69686423",
			"method": "GET",
			"headers": "",
			"dataMode": "raw",
			"data": [],
			"rawModeData": "",
			"pathVariables": {},
			"url": "http://localhost:8080/tours/1/ratings",
			"responses": [],
			"pathVariableData": [],
			"queryParams": [],
			"headerData": [],
			"collection_id": "df5ba56e-cd1e-ca7a-16a4-bb8f69686423",
			"folder": "60d77d20-a9a1-c03a-a3f1-ac862743f3fe",
			"isFromCollection": true,
			"collectionRequestId": "713fabeb-fe65-1acc-0575-238eb4f40824"
		},
		{
			"id": "9285bb82-6983-27c1-db1e-7ee461ff9eeb",
			"name": "Get All Tours",
			"description": "",
			"collectionId": "df5ba56e-cd1e-ca7a-16a4-bb8f69686423",
			"method": "GET",
			"headers": "",
			"dataMode": "raw",
			"data": [],
			"rawModeData": "",
			"url": "http://localhost:8080/tours",
			"responses": [],
			"pathVariableData": [],
			"queryParams": [],
			"headerData": [],
			"collection_id": "df5ba56e-cd1e-ca7a-16a4-bb8f69686423",
			"folder": "60d77d20-a9a1-c03a-a3f1-ac862743f3fe"
		},
		{
			"id": "96c0a1dc-cf58-c037-5c30-7559d9a36cfb",
			"name": "Lookup Backpack California Tours",
			"description": "",
			"collectionId": "df5ba56e-cd1e-ca7a-16a4-bb8f69686423",
			"method": "GET",
			"headers": "",
			"dataMode": "raw",
			"data": [],
			"rawModeData": "",
			"url": "http://localhost:8080/tours/search/findByTourPackageCode?code=BC",
			"responses": [],
			"pathVariableData": [],
			"queryParams": [
				{
					"key": "code",
					"value": "BC"
				}
			],
			"headerData": [],
			"collection_id": "df5ba56e-cd1e-ca7a-16a4-bb8f69686423",
			"folder": "60d77d20-a9a1-c03a-a3f1-ac862743f3fe"
		},
		{
			"id": "b609a9b2-35a1-95a0-febd-17bf64496066",
			"name": "Create Rating ",
			"description": "",
			"collectionId": "df5ba56e-cd1e-ca7a-16a4-bb8f69686423",
			"method": "POST",
			"headers": "Content-Type: application/json\nAuthorization: Bearer  eyJhbGciOiJIUzI1NiJ9.eyJzdWIiOiJjc3JfamFuZSIsImF1dGgiOlt7ImF1dGhvcml0eSI6IlJPTEVfQ1NSIn1dLCJpYXQiOjE1Mjc1NTc1NDIsImV4cCI6MTUyNzU1ODE0Mn0.9y1HlZwh_aGV1dVTBu0uDAzC80YX8pB1naX06eApfEQ",
			"dataMode": "raw",
			"data": [],
			"rawModeData": "{\n    \"score\":5,\n    \"comment\":\"I thought it was ok\",\n    \"customerId\":8\n}",
			"url": "http://localhost:8080/tours/1/ratings",
			"responses": [],
			"pathVariableData": [],
			"queryParams": [],
			"headerData": [
				{
					"key": "Content-Type",
					"value": "application/json"
				},
				{
					"key": "Authorization",
					"value": "Bearer  eyJhbGciOiJIUzI1NiJ9.eyJzdWIiOiJjc3JfamFuZSIsImF1dGgiOlt7ImF1dGhvcml0eSI6IlJPTEVfQ1NSIn1dLCJpYXQiOjE1Mjc1NTc1NDIsImV4cCI6MTUyNzU1ODE0Mn0.9y1HlZwh_aGV1dVTBu0uDAzC80YX8pB1naX06eApfEQ"
				}
			],
			"collection_id": "df5ba56e-cd1e-ca7a-16a4-bb8f69686423",
			"folder": "60d77d20-a9a1-c03a-a3f1-ac862743f3fe"
		},
		{
			"id": "cd188cc8-4d11-c585-07fc-e3ee5b442344",
			"name": "Lookup Rating ",
			"description": "",
			"collectionId": "df5ba56e-cd1e-ca7a-16a4-bb8f69686423",
			"method": "GET",
			"headers": "",
			"dataMode": "raw",
			"data": [],
			"rawModeData": "",
			"url": "http://localhost:8080/tours/1/ratings",
			"responses": [],
			"pathVariableData": [],
			"queryParams": [],
			"headerData": [],
			"collection_id": "df5ba56e-cd1e-ca7a-16a4-bb8f69686423",
			"folder": "60d77d20-a9a1-c03a-a3f1-ac862743f3fe"
		},
		{
			"id": "d08aa76e-2d5b-d84e-d23a-93cb7f0e451c",
			"name": "Get Users",
			"description": "",
			"collectionId": "df5ba56e-cd1e-ca7a-16a4-bb8f69686423",
			"method": "GET",
			"headers": "",
			"dataMode": "raw",
			"data": [],
			"rawModeData": "",
			"pathVariables": {},
			"url": "http://localhost:8080/tours",
			"responses": [],
			"pathVariableData": [],
			"queryParams": [],
			"headerData": [],
			"collection_id": "df5ba56e-cd1e-ca7a-16a4-bb8f69686423",
			"folder": "60d77d20-a9a1-c03a-a3f1-ac862743f3fe",
			"isFromCollection": true,
			"collectionRequestId": "9285bb82-6983-27c1-db1e-7ee461ff9eeb"
		},
		{
			"id": "e13cf3cf-fae9-1083-01ad-3bd320d186ad",
			"name": "Update a Rating",
			"description": "",
			"collectionId": "df5ba56e-cd1e-ca7a-16a4-bb8f69686423",
			"method": "PUT",
			"headers": "Content-Type: application/json",
			"dataMode": "raw",
			"data": [],
			"rawModeData": "{\n    \"score\":1,\n    \"comment\":\"I thought it was stupid\",\n    \"customerId\":4\n}\n",
			"url": "http://localhost:8080/tours/1/ratings",
			"responses": [],
			"pathVariableData": [],
			"queryParams": [],
			"headerData": [
				{
					"key": "Content-Type",
					"value": "application/json"
				}
			],
			"collection_id": "df5ba56e-cd1e-ca7a-16a4-bb8f69686423",
			"folder": "60d77d20-a9a1-c03a-a3f1-ac862743f3fe"
		},
		{
			"id": "f45cfa73-aa9b-560c-17a5-267a81aac93d",
			"name": "Get All Tour Packages",
			"description": "",
			"collectionId": "df5ba56e-cd1e-ca7a-16a4-bb8f69686423",
			"method": "GET",
			"headers": "",
			"dataMode": "raw",
			"data": [],
			"rawModeData": "",
			"url": "http://localhost:8080/packages",
			"responses": [],
			"pathVariableData": [],
			"queryParams": [],
			"headerData": [],
			"collection_id": "df5ba56e-cd1e-ca7a-16a4-bb8f69686423",
			"folder": "60d77d20-a9a1-c03a-a3f1-ac862743f3fe"
		}
	]
}