{
	"type": "service_account",
	"project_id": "stage-cochat",
	"private_key_id": "68e18c02efc7d898ac820007c79c5a390d9a20c5",
	"private_key": "-----BEGIN PRIVATE KEY-----\nMIIEuwIBADANBgkqhkiG9w0BAQEFAASCBKUwggShAgEAAoIBAQCT8TiKYj8wMoGJ\nh3XpISqEpNVeSWkj4y3hvj65hyDqMyCmvhxiq6mwQ4HVLzRaS7RpPySjfrUDZXUN\nk9Oh3S/On/mHyVfE/EZXSsMZhrwu0dYV3uvonE4VtdGQmcgeYCVOcDeC35RidZBJ\nFk/f5L4sMwXv3guZfz5TaD5RiwvC7KzUk+KV+mH2RzSIuPiLAvB48o36REbrQKA9\n4Y+XI4fqa2KzS89il4mhnp3SbXH43dCLfBLxOZJxHneZhlXK1y3Dd+goOGDULS38\nL3A6wA7Sm3GyUxsFduu1Zjm2APbq/Ay1hGoLP41q2ZvX4y6uD7qgvS3nQLk1ORt7\nGoPLD07JAgMBAAECgf9agxq0j6dZNY1LNzVMjJ4WyUJBjWhmLHfFxT9bAvGAWAeB\n/I4hUCVhUev9IgRFukuGmLsxzDOzAD+9LtQsE8dMA1QHX4fzXOUsQvFajLRVcMwq\nVVi/1+FuJu8wKOXmr6wjcUSFLYT7ODIuhRgZQzmWkSDwwEkYgGEBZqW5/fgUKQro\nohTH1nWWxeI2yYGPKg5rCwyp4pixmixT8FPfPYW4i8lOZuCD0aNt/0/9F+j3vYjm\nNJkZ8DiQdHUnZfzW7XVCrzKjDpfjhFwRGGY0tDsiRZGcTIB8pdarOb1e6ZTkRcch\nwdH1laj176a3kUsMRvZKqA/io08wvsRtMD8JY9ECgYEAxjJkNQmHz0d4t0d8JlmE\nxXU0HwRuM9O1iG7nKTBw7+AxsyhBSbwL4lLh6AOxxHiP9wrZeKCLBEBuyfNdyG5e\nloO/6nR46pRuansH6nbQAkR8fA53ZQ83OtAfapIBd2W7xTk/DplHd1sKO5AEMbIL\nkZaIWwfZwfM6+fvyo7nNWxkCgYEAvxbDnVhG3f0WCtzYwhmDsyeKLuCx5TKYlzUn\ngKhf0RsSPfvrx8dSzyZ4e856dtnADfx2efEBYxOXVGRm1u6w5wfp6SeVaAk37AZw\nG6UfWQcRWSB/yr46QXAaNvoR9r+3ukJk5jnwiTfm5KCXqt4SchH7CffL/DzLvEl+\noPnytzECgYAYodCkas/PKhHNrXu3hG6k38EfjbxogopQL4BZNSUEGvfyTTF4CX/s\nm+JppHPmeBlkWZvXixRb7eoW/UENlPH6gNtMNzeD5/ilES9Vq3iEn6BdBqs+CxsR\nGyacZxL5lNI2W7wDg3dHVTA7YNW0m20mpe/CaIJewWz1/qMUSBZGmQKBgAEF/zA1\ni9OeimKugh6wAkuQV6Yen/VJSxXsO/Ttce3txjA8zCt6vs/LNfP7zB4c1nF8u6m1\nh7tfHH1gOEjIaHwkR7Vu99bhzcHe2vTa8osIhahDi0urryYwkoNe3X/D0RkXR/EP\nuGETwpHQ5l8M525i+EQ6ZoZIURMGFb6I+CrRAoGBAL5QW9Iz9M7vkK95zGY24eez\navlFv58w5MwZlGOpKarWj5Iy9mrvMmpKBY+TL7yCjkAHgTxsUIgcZQ7G94r4eyHh\n9HUN1zIik/Sa7vTk2sCbRfhWrsoKFqQV1va3FH/zt7pl6/fDuUj533hhutP2ST3x\nfKsiX0amW4IPyFyUPopm\n-----END PRIVATE KEY-----\n",
	"client_email": "firebase-adminsdk-ms6ss@stage-cochat.iam.gserviceaccount.com",
	"client_id": "109984191564716966521",
	"auth_uri": "https://accounts.google.com/o/oauth2/auth",
	"token_uri": "https://oauth2.googleapis.com/token",
	"auth_provider_x509_cert_url": "https://www.googleapis.com/oauth2/v1/certs",
	"client_x509_cert_url": "https://www.googleapis.com/robot/v1/metadata/x509/firebase-adminsdk-ms6ss%40stage-cochat.iam.gserviceaccount.com"
}
