module gitlab.com/trumpetvagen/web/hashid-go

go 1.18

require (
	github.com/urfave/cli/v2 v2.6.0
	github.com/cpuguy83/go-md2man/v2 v2.0.1 // indirect
	github.com/russross/blackfriday/v2 v2.1.0 // indirect
)
