[gd_scene load_steps=2 format=3 uid="uid://b6ptjogryblki"]

[ext_resource type="PackedScene" uid="uid://c7mbldn2qbdn0" path="res://props/birch_tree/3d/brich_tree_packed.blend" id="1_irtxb"]

[node name="brich_tree_packed" instance=ExtResource("1_irtxb")]

[node name="birch_13m" parent="." index="0"]
transform = Transform3D(0.119, 0, 0, 0, -5.20166e-09, -0.119, 0, 0.119, -5.20166e-09, 3.85315, 0.601093, -0.951054)
