[gd_scene load_steps=4 format=3 uid="uid://bq4ylt2hmvlrp"]

[ext_resource type="PackedScene" uid="uid://cs3bt8nypwkm6" path="res://props/car1/3d/car1texturefix_packed.blend" id="1_mpyho"]
[ext_resource type="Texture2D" uid="uid://vb4eqqrb5xrn" path="res://props/car1/3d/textures/CIVILIAN_RED.tga" id="2_ifulx"]

[sub_resource type="StandardMaterial3D" id="StandardMaterial3D_phj38"]
albedo_texture = ExtResource("2_ifulx")

[node name="car1texturefix_packed2" instance=ExtResource("1_mpyho")]

[node name="E7_CIVILIAN" parent="." index="0"]
material_override = SubResource("StandardMaterial3D_phj38")
