<?xml version="1.0" encoding="UTF-8"?>
<session version="1.0">
<refactoring comment="Move element &apos;UserController.java&apos; to &apos;Testing/src/main/java/com.trossky.api.controllers&apos;&#x0A;- Original project: &apos;Testing&apos;&#x0A;- Destination element: &apos;Testing/src/main/java/com.trossky.api.controllers&apos;&#x0A;- Original element: &apos;com.trossky.api.UserController.java&apos;&#x0A;- Update references to refactored element" description="Move compilation unit" destination="/src\/main\/java&lt;com.trossky.api.controllers" element1="/src\/main\/java&lt;com.trossky.api{UserController.java" files="0" flags="589830" folders="0" id="org.eclipse.jdt.ui.move" patterns="*" policy="org.eclipse.jdt.ui.moveResources" qualified="false" references="true" stamp="1549018150249" units="1" version="1.0"/>
</session>