<svg width="20" height="20" viewBox="0 0 20 20" fill="none" xmlns="http://www.w3.org/2000/svg">
<path d="M10.125 16.125C9.78333 16.125 9.5 15.8417 9.5 15.5V13.75C9.5 13.4083 9.78333 13.125 10.125 13.125C10.4667 13.125 10.75 13.4083 10.75 13.75V15.5C10.75 15.8417 10.4667 16.125 10.125 16.125Z" fill="white"/>
<path d="M14.9167 18.9583H5.33337V17.5C5.33337 16.2333 6.35837 15.2083 7.62504 15.2083H12.625C13.8917 15.2083 14.9167 16.2333 14.9167 17.5V18.9583ZM6.58337 17.7083H13.6667V17.5C13.6667 16.925 13.2 16.4583 12.625 16.4583H7.62504C7.05004 16.4583 6.58337 16.925 6.58337 17.5V17.7083Z" fill="white"/>
<path d="M15.125 18.9583H5.125C4.78333 18.9583 4.5 18.675 4.5 18.3333C4.5 17.9917 4.78333 17.7083 5.125 17.7083H15.125C15.4667 17.7083 15.75 17.9917 15.75 18.3333C15.75 18.675 15.4667 18.9583 15.125 18.9583Z" fill="white"/>
<path d="M15.3583 10.3667C15.1833 10.3667 15.0083 10.2917 14.8833 10.15C14.725 9.96668 14.6833 9.70834 14.7833 9.49167C15.0667 8.84167 15.2083 8.15001 15.2083 7.42501V4.92501C15.2083 4.63334 15.1583 4.35001 15.0583 4.05001C15.05 4.02501 15.0417 3.99167 15.0333 3.95834C15.0083 3.83334 15 3.70834 15 3.59167C15 3.25001 15.2833 2.96667 15.625 2.96667H16.125C17.6167 2.96667 18.8333 4.21667 18.8333 5.75834C18.8333 7.03334 18.3083 8.29167 17.4 9.20001C17.3833 9.21667 17.3333 9.25834 17.325 9.26667C16.8333 9.67501 16.275 10.1333 15.525 10.3417C15.4667 10.3583 15.4167 10.3667 15.3583 10.3667ZM16.4 4.24167C16.4417 4.46667 16.4583 4.70001 16.4583 4.92501V7.42501C16.4583 7.76667 16.4333 8.09167 16.3833 8.42501C16.4333 8.38334 16.475 8.35001 16.525 8.30834C17.1917 7.64167 17.5833 6.70834 17.5833 5.75834C17.5833 5.00834 17.075 4.37501 16.4 4.24167Z" fill="white"/>
<path d="M4.64996 10.3333C4.58329 10.3333 4.52496 10.325 4.45829 10.3C3.77496 10.0833 3.13329 9.68333 2.59996 9.15C1.64163 8.09167 1.16663 6.93333 1.16663 5.70833C1.16663 4.19167 2.35829 3 3.87496 3H4.41663C4.62496 3 4.82496 3.10833 4.94163 3.28333C5.05829 3.45833 5.07496 3.68333 4.99163 3.875C4.85829 4.175 4.79163 4.51667 4.79163 4.875V7.375C4.79163 8.09167 4.93329 8.79167 5.22496 9.45833C5.32496 9.68333 5.27496 9.94167 5.11663 10.125C4.99163 10.2583 4.82496 10.3333 4.64996 10.3333ZM3.58329 4.275C2.90829 4.40833 2.41663 4.99167 2.41663 5.70833C2.41663 6.61667 2.78329 7.49167 3.50829 8.29167C3.54163 8.33333 3.58329 8.36667 3.62496 8.4C3.56663 8.05833 3.54163 7.71667 3.54163 7.375V4.875C3.54163 4.675 3.55829 4.475 3.58329 4.275Z" fill="white"/>
<path d="M9.99996 13.9583C6.44163 13.9583 3.54163 11.0583 3.54163 7.49999V4.99999C3.54163 2.81666 5.31663 1.04166 7.49996 1.04166H12.5C14.6833 1.04166 16.4583 2.81666 16.4583 4.99999V7.49999C16.4583 11.0583 13.5583 13.9583 9.99996 13.9583ZM7.49996 2.29166C6.00829 2.29166 4.79163 3.50832 4.79163 4.99999V7.49999C4.79163 10.375 7.12496 12.7083 9.99996 12.7083C12.875 12.7083 15.2083 10.375 15.2083 7.49999V4.99999C15.2083 3.50832 13.9916 2.29166 12.5 2.29166H7.49996Z" fill="white"/>
</svg>
