<svg width="1117" height="747" viewBox="0 0 1117 747" fill="none" xmlns="http://www.w3.org/2000/svg">
<circle opacity="0.3" cx="362.5" cy="754.5" r="754.5" fill="url(#paint0_linear_5_113)"/>
<defs>
<linearGradient id="paint0_linear_5_113" x1="-383.558" y1="630.78" x2="503.038" y2="1578.84" gradientUnits="userSpaceOnUse">
<stop stop-color="#545454"/>
<stop offset="1" stop-color="#1A1A1A"/>
</linearGradient>
</defs>
</svg>
