{
  "type": "service_account",
  "project_id": "hello-world-express-nt102",
  "private_key_id": "be07a255cb480a4b7c6bc82c2ef1336dea6fbc93",
  "private_key": "-----BEGIN PRIVATE KEY-----\nMIIEvgIBADANBgkqhkiG9w0BAQEFAASCBKgwggSkAgEAAoIBAQDR+m6eGcSgrF5R\nINtgJpoZkyuX0jO0nAcmVjL7F67RH3EG/FvYpMwgLn5qETTtX0odGSl0Srrnzhae\nnlHjYPyA6iEVF72otirm/GllpyhOIRjM4hQWvaSa2eAYS5DGedxyeN8KfcWZGjb7\nKsq/EQrBrePHPYsk0lRArxVM+cWKhacM7evoU24ILLjtg9jds3iqxvByoEPhh4VU\ndxZHCYurUImNFEcA0+d736PD84mjoR0VwS5Sn+Qd5BcFhUvBhd7y6Lan6PnXYVaj\nCjHg9CqogKFhDpMindsfBNkAG0Jj6kBgVL5l+VvnxC7/vf918+s+GF4NLKSUY5+c\nwpNc0wjDAgMBAAECggEAA6G9ttvM+OgRQDjGQ6hYVVJgINk/kF0EX7UtCX5d1m6p\nyVbyEiMhsk8zBovTYFQ1iI5gZAtEc2Q3m0XNFGOF65hc1KeyzK+h7WZQYOdCpawZ\nRra37l2P4Z6UCVmsLU5hnJh0myPIBxbjlgbQlXOzJCD6TFO2HN2HPlTEpZ11I9Pa\nLv02bWGkovZ3rixgPqChXo/UwBtTWIGtPE6S3CO+uI0+vspFEaZXF9CC49+kkByC\n2HKWAzZkudZ3Hos2H37AmPgJhn2O7B7Y6DcwLBQVHhxvkqm+VvIpMXc5VQs9whSz\nUZ3qpVBi/eMoV5rkR2y79QIh4lP6HKmY9zidSeuB0QKBgQD9Ah1v4uPxcTUZFu9T\nFQWavHJIamsQ4Q8wqAvgnyE4CRkVLULDLjeMPTRbOzVKy8OJCfCAi/EQJQSOS3o4\nDdNRXCbDjZt1pXSGCmqXpuva9jT5Ds1HSaMrEWcJ41WPlHwJ9Fy7cFl6weT+gnn5\nyZqFlrbW3NM9PqXu8TBoDMoJCwKBgQDUdg9yFeQbkQL7Zoywd6UeuCxuWdM/PDkQ\nEPY3MjZdO5JEO1V75CYtrhVvkCp529LaXiZ0jEdYiN9RZKzmjfb6PKdW0i4PqFVn\nXpcse3giZNeSD57LYhpo5EiL4ucAk/IHhoE8ABimtppn+s+5cpsXXBR2/WaCL6tY\naB+z06CCKQKBgQClr8rjSKyJot9o7NIRkIS5DouwzLAMv7YY4RPWJ5+zeJHKgndk\nJlIOLs6oqB+AOex1Q+MR65MURYm0Pc1uA+/NKhHgok2aP54NYajoY1G1dOK/72eT\nNa/7NkxJ92xCuLR6OGK6BRsz/uIdogiLAfGFZmuaTcawJuS3k49ltGpifQKBgQCV\n2EaAgiwFvTrLMMKdW2Uby22azsOM396nFC9zMnjhPLimYuqhnIHIyfTYYGd01rNZ\ny/l3TdCsAqzubQD9ArdkOg8Tzt0pseG6LB6XAuXx7AmWPGoUq7ZQsGDyODAQWkfj\nQtw3AyJfwn4YQ+7projv6sOMQKBhxVkl2xow7FtSMQKBgDPTJWJyxBtTAyy07yT+\nxhxtSI06UWq3DKVSD5XK1ZyCgGmPhab+E8hq6tIsV/cq8dRUYlpysTJB3aBStUf6\nmRFiMGvlD1mYLmqKWHW/UAGj6NWU1yFxT78bOPuo6h6doAmAV4Bi8LPkHUwAujnj\nOze9xLwCCkITez6VsbaEhXN7\n-----END PRIVATE KEY-----\n",
  "client_email": "gitlab-account@hello-world-express-nt102.iam.gserviceaccount.com",
  "client_id": "102028983867581826923",
  "auth_uri": "https://accounts.google.com/o/oauth2/auth",
  "token_uri": "https://oauth2.googleapis.com/token",
  "auth_provider_x509_cert_url": "https://www.googleapis.com/oauth2/v1/certs",
  "client_x509_cert_url": "https://www.googleapis.com/robot/v1/metadata/x509/gitlab-account%40hello-world-express-nt102.iam.gserviceaccount.com"
}
