"0","data <- data %>% "
"0","  gather(date, weight, 8:18) %>% "
"0","  mutate(dob = as.Date(dob, ""%m/%d/%Y""),"
"0","         id = as.factor(id),"
"0","         number = as.factor(number),"
"0","         parite = as.factor(parite),"
"0","         date = ifelse(date == ""kg.T0"", dob,"
"0","                       ifelse(date == ""kg.T48"", dob + 2,"
"0","                              as.Date(substr(date, 2, nchar(date)), ""%m.%d.%Y""))),"
"0","         date = as.Date(date, origin = ""1970-01-01""),"
"0","         days = as.numeric(date - dob)) %>% "
"0","  filter(!is.na(weight)) %>% "
"0","  arrange(id, days)"
"0","head(data)"
