"0","gg <- ggplot(data = filter(data, between(days, 50, 60)), "
"0","             mapping = aes(x = weight, fill = sex)) +"
"0","  geom_density(alpha = 0.2) +"
"0","  ggtitle(label = ""Distribution du poids des agneaux âgés entre 50 et 60 jours selon le sexe"")"
"0","  "
"0","gg"
