icao,regid,mdl,type,operator
300604,i-bmpg,g450,Gulfstream G450,Private Owner
506c32,s5-jva,g450,Gulfstream Aerospace G-IV,Eagle Airlines Luftverkehrsges
761047,4270,g450,Gulfstream Aerospace GIV-X,Pakistan Air Force
780104,b-8155,g450,Gulfstream G450,Nanshan Jet
424402,vq-bzm,g450,Gulfstream 450,Private owner
