icao,regid,mdl,type,operator
38bd5b,f-prag,cozy,Amateur Rutan Cozy,Private owner
a1dec0,n22az,cozy,,
a89fa2,n655dk,cozy,Amateur Cozy Mk.3,Private owner
adb5ae,n9825w,cozy,Amateur Cozy MK-IV,Private owner
