icao,regid,mdl,type,operator
064166,5n-bpc,s92,Sikorsky S-92A,Bristow Helicopters Nigeria
400e1c,g-chck,s92,Sikorsky S-92A,CHC Scotia
400f89,g-iaca,s92,Sikorsky S-92A,Bristow Helicopters
401139,g-iace,s92,Sikorsky S-92A,Bristow Helicopters
40113a,g-iacb,s92,Sikorsky S-92A,Bristow Helicopters
40113b,g-iacc,s92,Sikorsky S-92A,Bristow Helicopters
40113c,g-iacd,s92,Sikorsky S-92A,Bristow Helicopters
4055b8,g-iacf,s92,Sikorsky S-92A,Bristow Helicopters
405ff2,g-lawx,s92,Sikorsky S-92A,Private owner
4062a9,g-chcs,s92,Sikorsky S-92A,CHC Scotia
406683,g-cgyw,s92,Sikorsky S-92A,Bristow Helicopters
4067b3,g-chhf,s92,Sikorsky S-92A,Bristow Helicopters
40683a,g-wnsi,s92,Sikorsky S-92A,CHC Scotia
406842,g-wnsg,s92,Sikorsky S-92A,CHC Scotia
406851,g-xcii,s92,Sikorsky S-92A,Bristow Helicopters
406852,g-chmj,s92,Sikorsky S-92A,Bristow Helicopters
406853,g-chki,s92,Sikorsky S-92A,Bristow Helicopters
406949,g-wnsj,s92,Sikorsky S-92A,CHC Scotia
40694a,g-wnse,s92,Sikorsky S-92A,CHC Scotia
4069a4,g-vind,s92,Sikorsky S-92A,Bond Offshore Helicopters
4069a5,g-vinf,s92,,
4069d2,g-chyg,s92,Sikorsky S-92A,Bristow Helicopters
4069d3,g-chyi,s92,Sikorsky S-92A,Bristow Helicopters
406a2c,g-vini,s92,Sikorsky S-92A,Bond Offshore Helicopters
406a2d,g-ving,s92,Sikorsky S-92A,Bond Offshore Helicopters
406a43,g-galc,s92,Sikorsky S-92A,Bristow Helicopters
406a79,g-cich,s92,Sikorsky S-92A,Bristow Helicopters
406b3e,g-vink,s92,Sikorsky S-92A,Bond Offshore Helicopters
406b7c,g-vinl,s92,Sikorsky S-92A,Bond Offshore Helicopters
406b9c,g-wnsd,s92,Sikorsky S-92A,CHC Scotia
406c55,g-wnsl,s92,Sikorsky S-92A,CHC Scotia
406c83,g-cijc,s92,Sikorsky S-92A,Bristow Helicopters
406d0e,g-wnsm,s92,Sikorsky S-92A,CHC Scotia
406de4,g-wnsr,s92,Sikorsky S-92A,CHC Scotia
406e52,g-vinp,s92,Sikorsky S-92A,Bond Offshore Helicopters
406ee7,g-mcgy,s92,Sikorsky S-92A,Bristow Helicopters
406f8b,g-mcgl,s92,Sikorsky S-92A,Bristow Helicopters
478053,ln-oqj,s92,Sikorsky S-92A,CHC Helikopter Service
478054,ln-oqm,s92,Sikorsky S-92A,CHC Helikopter Service AS
478055,ln-oqo,s92,,
47807d,ln-ona,s92,Eurocopter EC225LP Super Puma,Bristow Helicopters
47807e,ln-onb,s92,Sikorsky S-92A,Bristow Helicopters
47807f,ln-onc,s92,Sikorsky S-92,Bristow Helicopters
478080,ln-ond,s92,Sikorsky S-92A,Bristow Helicopters
478383,ln-one,s92,Sikorsky S-92A,Bristow Helicopters
4783c3,ln-onn,s92,Sikorsky S-92A,Bristow Helicopters
4783c4,ln-ono,s92,Sikorsky S-92A,Bristow Helicopters
4783ee,ln-oqa,s92,Sikorsky S-92A,CHC Helikopter Service
4783ef,ln-oqb,s92,Sikorsky S92A,CHC Helikopter Service
4783f0,ln-oqc,s92,Sikorsky S-92,CHC Helicopter Service
47843c,ln-onp,s92,Sikorsky S-92A,Bristow Helicopters
478445,ln-onq,s92,Sikorsky S-92A,Bristow Helicopters
478468,ln-oqe,s92,Sikorsky S-92A,CHC Helicopter
478470,ln-ons,s92,Sikorsky S-92A,Bristow Helicopters
4784b8,ln-ont,s92,Sikorsky S-92A,Bristow Helicopters
4784ba,ln-oqf,s92,Sikorsky S-92A,CHC Helikopter Service
478528,ln-onu,s92,Sikorsky S-92A,Bristow Helicopters
478571,ln-onv,s92,Sikorsky S-92A,Bristow Helicopters
47860f,ln-oqi,s92,Sikorsky S-92A,CHC Helikopter Service
478610,ln-oqg,s92,Sikorsky S-92A,CHC Helikopter Service
478714,ln-oqk,s92,Sikorsky S-92A,CHC Helikopter Service
478757,ln-onw,s92,Sikorsky S-92A,Bristow Helicopters
478759,ln-onx,s92,Sikorsky S-92A,Bristow Helicopters
479fa6,ln-oqp,s92,Airbus EC 225 LP,CHC Helikopter Service
47c272,ln-oec,s92,Sikorsky S-92A,Norsk Helikopterservice
485082,ph-eui,s92,Sikorsky S92A,CHC Helicopters Netherlands
4ca98b,ei-icg,s92,Sikorsky S-92A,Irish CoastGuard
4ca98c,ei-icu,s92,Sikorsky S-92A,Irish CoastGuard
4ca98d,ei-ica,s92,Sikorsky S-92A,Irish CoastGuard
4ca98e,ei-icr,s92,Sikorsky S-92A,Irish CoastGuard
4ca98f,ei-icd,s92,Sikorsky S-92A,Irish CoastGuard
601856,ez-s720,s92,Sikorsky S-92A,Turkmenistan Government
601857,ez-s721,s92,Sikorsky S-92A,Turkmenistan Government
78009a,b-7353,s92,Sikorsky S-92A,CITIC Offshore Helicopter
780452,b-7355,s92,Sikorsky S-92A,CITIC Offshore Helicopter
7c3b27,vh-lyx,s92,Sikorsky S-92A,Private owner
7c4546,vh-nyw,s92,Sikorsky S-92A,Bond Helicopters Australia
7c8170,vh-zuq,s92,Sikorsky S-92A,Bristow Helicopters Australia
7c8175,vh-zuv,s92,Sikorsky S-92A,Bristow Helicopters Australia
7c8176,vh-zuw,s92,Sikorsky S-92A,Bristow Helicopters Australia
840991,ja02mp,s92,Sikorsky S-92A,Metropolitan Police Department
a1517c,pr-ohi,s92,Sikorsky S-92A,OMNI Taxi Aereo
a15bd9,pr-ohg,s92,Sikorsky S-92A,OMNI Taxi Aereo
a1be5e,n211mt,s92,Sikorsky S-92A,Bristow US
a1b1e1,pr-oho,s92,Sikorsky S-92A,Omni Taxi Aereo
a2beba,pr-jbu,s92,,
a2fd08,n292bg,s92,Sikorsky S-92A,Private owner
a2fe03,n292mh,s92,Sikorsky S-92A,Chevron USA
a48b10,n392js,s92,,
a617a6,n492bg,s92,,
a618d3,n492ph,s92,Sikorsky S-92A,PHI Inc
a7a4f5,n592bg,s92,,
a7a622,n592ph,s92,Sikorsky S-92A,PHI Inc
a93371,n692ph,s92,Sikorsky S-92A,PHI Inc
aac0c0,n792ph,s92,Sikorsky S-92A,PHI Inc
acbc3d,n92eh,s92,Sikorsky S-92A,Private owner
acc282,n921gl,s92,Sikorsky S-92A,Chevron USA
acca9c,n923ph,s92,Sikorsky S-92A,PHI Inc
ac4ce2,n892bg,s92,Sikorsky S-92A,Private owner
ac4e0f,n892ph,s92,Sikorsky S-92A,PHI Inc
acce53,n924ph,s92,Sikorsky S-92A,PHI Inc
acd20a,n925ph,s92,Sikorsky S-92A,PHI Inc
acd5c1,n926ph,s92,Sikorsky S-92A,PHI Inc
acd978,n927ph,s92,Sikorsky S-92A,PHI Inc
acdd2f,n928ph,s92,Sikorsky S-92A,PHI Inc
ace0e6,n929ph,s92,Sikorsky S-92A,PHI Inc
ace6f6,n930ph,s92,Sikorsky S-92A,PHI Inc.
aceaad,n931ph,s92,Sikorsky S-92A,PHI Inc
aced37,n932bg,s92,Sikorsky S-92A,Bristow US
acee64,n932ph,s92,Sikorsky S-92A,PHI Inc
acf0ee,n933bg,s92,Sikorsky S-92A,Bristow US
acf21b,n933ph,s92,Sikorsky S-92A,PHI Inc
acf989,n935ph,s92,Sikorsky S-92A,PHI Inc.
acfd40,n936ph,s92,Sikorsky S-92A,PHI Inc
ad00f7,n937ph,s92,Sikorsky S-92A,PHI Inc
ad0865,n939ph,s92,Sikorsky S-92A,PHI Inc
ad0e75,n940ph,s92,,
ad122c,n941ph,s92,Sikorsky S-92A,PHI Inc
ad15e3,n942ph,s92,Sikorsky S-92A,PHI Inc
ad199a,n943ph,s92,,
ad9fcc,pr-ohf,s92,Sikorsky S-92A,OMNI Taxi Aereo
ad1d51,n944ph,s92,,
ad2108,n945ph,s92,Sikorsky S-92A,PHI Inc
ad24bf,n946ph,s92,,
ad2876,n947ph,s92,,
ad2c2d,n948ph,s92,,
ad2fe4,n949ph,s92,,
ad35f4,n950ph,s92,,
c06022,c-gkkn,s92,Sikorsky S-92A,Cougar Helicopters
ad8ca3,pr-ohe,s92,Sikorsky S-92A,OMNI Taxi Aereo
c05218,c-gfch,s92,Sikorsky S-92A,Cougar Helicopters
c0699c,c-gnzv,s92,,
e48557,pr-chs,s92,Sikorsky S-92A,BHS Taxi Aereo
e48899,pr-bgb,s92,Sikorsky S-92A,BHS Taxi Aereo
e49156,pr-bgu,s92,Sikorsky S-92A,BHS Taxi Aereo
e48c76,pr-bgn,s92,Sikorsky S-92A,BHS Taxi Aereo
e48d07,pr-ohe,s92,Sikorsky S-92A,OMNI Taxi Aereo
478794,ln-oqn,s92,Sikorsky S92A,CHC Helicopter Service
a29e90,b-7363,s92,Sikorsky S-92A Helibus,Zhuhai Helicopter Company
e48e4a,pr-bgt,s92,Sikorsky S-92A,BHS Taxi Aereo
a28bb2,b-7362,s92,Sikorsky S-92A Helibus,Zhuhai Helicopter Company
406bcb,g-iacg,s92,Sikorsky S-92A,Bristow Helicopters
478446,ln-onr,s92,Sikorsky S-92A,Bristow Helicopters
a93244,n692bg,s92,Sikorsky S-92A,Private owner
a48a57,n392bg,s92,Sikorsky S-92A,Private owner
7c4549,vh-nyz,s92,Sikorsky S92A,Bond Helicopters Australia
a2d2b8,n281lm,s92,Sikorsky S-92A,Private owner
7c4203,vh-nbp,s92,Sikorsky S92A,Bristow Helicopters Australia
0641d4,5n-bti,s92,Sikorsky S-92A Helibus,Bristow Helicopters Nigeria
a2b250,n273h,s92,Sikorsky S-92A,Private owner
406c28,g-cigz,s92,Sikorsky S-92A,Bristow Helicopters
a1d1f2,n216y,s92,Sikorsky S-92A,Private owner
0641ce,5n-bth,s92,Sikorsky S-92A,Bristow Helicopters Nigeria
a27536,n258a,s92,Sikorsky S-92A,Private owner
a2a0c2,n269dl,s92,Sikorsky S-92A,Private owner
a2ca2a,n279z,s92,Sikorsky S-92A,Private owner
7c44eb,vh-nwd,s92,Sikorsky S-92A,Bond Helicopters Australia
a2cf03,pr-jbx,s92,Sikorsky S-92A,Lider Taxi Aereo
406c44,g-cihp,s92,Sikorsky S-92A,Bristow Helicopters
4070fc,g-mcsa,s92,Sikorsky S-92A,Babcock MCS Offshore
4070fd,g-mcsb,s92,Sikorsky S-92A,Babcock MCS Offshore
acb0e0,n917cb,s92,Sikorsky S-92A,Private owner
ac731d,n901ch,s92,Sikorsky S-92A,Private owner
7c44fd,vh-nwv,s92,Sikorsky S-92A,Bond Helicopters Australia
c03626,c-fund,s92,Sikorsky S-92A,AIC Global
a28412,b-7306,s92,Sikorsky S-92A Helibus,CITIC Offshore Helicopter
4070f9,g-wnsu,s92,Sikorsky S-92A,CHC Scotia
4b82b1,em-003,s92,Sikorsky S-92A,Turkish Government
478051,ln-oqd,s92,Sikorsky S-92A,CHC Helikopter Service
4070fe,g-vinr,s92,Sikorsky	S-92A,Babcock Mission Critical Services Offsh.
4070ff,g-vint,s92,Sikorsky	S-92A,Babcock Mission Critical Services Offsh.
47a45d,ln-onm,s92,Sikorsky S-92A,Bristow Helicopters
478382,ln-ony,s92,Sikorsky S-92A,Bristow Helicopters
7c39af,vh-loh,s92,Sikorsky S-92A,Lloyd Helicopters
a314a2,n298qt,s92,Sikorsky S-92A,Private owner
e4919a,pr-jbx,s92,Sikorsky S-92A,Lider Taxi Aereo
a2c2bc,n277z,s92,Sikorsky S-92A,Private owner
478747,ln-oql,s92,Sikorsky S-92A,CHC Helikopter Service
4070f8,g-wnst,s92,,
4071a2,g-wnsv,s92,,
a2e607,n286u,s92,Sikorsky S-92A,Private owner
406841,g-wnsf,s92,,
e492f2,pr-ohu,s92,,
a2da90,n283qt,s92,,
ad39ab,n951ph,s92,,
a32112,n300ty,s92,,
40716a,g-cjif,s92,,
478087,ln-onh,s92,,
7c8167,vh-zuh,s92,,
a2c5c4,n278s,s92,,
478052,ln-oqh,s92,,
a30cf0,n296n,s92,,
a26b6f,n255q,s92,,
a3067c,n294y,s92,,
a2f000,n289g,s92,,
e48d5e,pr-jbk,s92,,
7c3adc,vh-lwu,s92,,
e48cfc,pr-jbi,s92,,
7c816e,vh-zuo,s92,,
407284,g-wnsw,s92,,
47c20e,ln-oic,s92,,
e48e8f,pr-jbo,s92,,
7c2aa6,vh-ipk,s92,,
e48b99,pr-bgm,s92,,
47c225,ln-oib,s92,,
4780b9,ln-oni,s92,,
e48a79,pr-jar,s92,,
e4869a,pr-cgd,s92,,
7c3ad8,vh-lwq,s92,,
7c2aa0,vh-ipe,s92,,
7c3ad1,vh-lwj,s92,,
479ede,ln-oqr,s92,,
47c1ab,ln-oid,s92,,
7c2aac,vh-ipq,s92,,
7c2b1d,vh-isv,s92,,
7c2ab3,vh-ipx,s92,,
7c2b17,vh-isp,s92,,
acc00d,n920vh,s92,,
e4909a,pr-jbp,s92,,
a2ecf1,n288nt,s92,,
e49099,pr-jbq,s92,,
a3116f,n297w,s92,,
e485ba,pr-cht,s92,,
4caca4,ei-ics,s92,,
a2df16,n284z,s92,,
ad84ea,pr-jbe,s92,,
c056c5,c-ggwi,s92,,
7c8169,vh-zuj,s92,,
a2ea22,n287y,s92,,
aaf835,n806ap,s92,,
a69911,n524pb,s92,,
478056,ln-oqq,s92,,
a0b620,n145jw,s92,,
a1a832,n2059j,s92,,
8822c2,hs-hvb,s92,,
c06986,c-gnyz,s92,,
47c09e,ln-oia,s92,,
882288,hs-hth,s92,,
407381,g-mrli,s92,,
406156,g-cgci,s92,,
ad0e6d,n940p,s92,,
47c11b,ln-oig,s92,,
7c2ab5,vh-ipz,s92,,
