icao,regid,mdl,type,operator
a25188,n249ba,blcf,Boeing 747-409,Boeing Company
a999df,n718ba,blcf,Boeing 747-4H6,Boeing Company
aa0ca7,n747bc,blcf,Boeing 747-4J6,Boeing Company
aa90a0,n780ba,blcf,Boeing 747-409,Boeing Company
