icao,regid,mdl,type,operator
3d0665,d-eard,e300,Extra EA-330/LC,Private owner
3d0668,d-earg,e300,Extra EA-330/LC,Private
3d232f,d-elop,e300,Extra EA300/200,
400e1f,g-offo,e300,Extra EA300/L,2 Â Excel Aviation
400e20,g-zxcl,e300,Extra EA30/L,2 Â Excel Aviation
400e21,g-zxel,e300,Extra EA300/L,2 Â Excel Aviation
400e22,g-zexl,e300,Extra EA300/L,2 Â Excel Aviation
401104,g-gloc,e300,Extra Ea 300/200,The Cambridge Aero Club
3d4207,d-exgh,e300,Extra EA-300/L,
40436d,g-bzfr,e300,Extra EA300/L,Private Owner
40650e,g-exlt,e300,Extra EA300/LT,Private Owner
406662,g-evil,e300,Extremeair XA41,Private owner
440383,oe-crb,e300,Extra EA-300/L,The Flying Bulls
440456,oe-cfv,e300,Extra EA-300/L,Private owner
484f03,ph-zws,e300,Extra EA 300/LT,Private owner
4b219f,hb-mtb,e300,Extra EA300/200,Flying Ranch AG
4b21a1,hb-mtd,e300,Extra EA300/200,Air-Club d Yverdon-les-Bains
4b21ac,hb-mto,e300,Extra EA300/L,Take - Off Balloon AG
48804c,sp-acm,e300,Extra 300L,Private owner
506dad,s5-dpp,e300,Extra	EA-300/L,Private owner
7c420b,vh-nbx,e300,Extra EA-300/L,Private owner
7c76d5,vh-xrb,e300,Extra EA-300/200,Private owner
a00cf4,n102jk,e300,Extra EA-300/L,Private owner
a0f5e5,n161fc,e300,Extra EA-300/L,Private owner
a10104,n164ex,e300,Extra EA-300/L,Private owner
a0467a,n117cv,e300,Extra EA-300/L,Private owner
a165de,n19am,e300,Extra EA-300/L,Private owner
a192df,n200jv,e300,Extra EA-300/L,Private owner
a1baab,n210mx,e300,Extra EA-300/L,Private owner
a1b948,n21xt,e300,Extra EA-300/L,Private owner
a25603,n25jx,e300,Extra EA-300/L,Private owner
a287b0,n262p,e300,Extra EA-300/L,Private owner
a2a642,n27xt,e300,Extra EA-300/L,Private owner
a32062,n300lx,e300,Extra EA-300/L,Private owner
a3209e,n300pg,e300,Extra EA-300/L,Private owner
a32359,n301de,e300,Extra EA-300/L,Private owner
a39612,n330cs,e300,Extra EA-300/LC,Private owner
a39664,n330fz,e300,Extra EA-300/L,Private owner
a36c37,n32cp,e300,Extra EA-300/L,Private owner
a45b10,n38xt,e300,Extra EA-300/L,Private owner
a55b2e,n444tm,e300,Extra EA-300,Private owner
a5b0fc,n466md,e300,Extra EA300/L,Private owner
a60002,n486mm,e300,Extra EA-300/L,Private owner
a63a6a,n500ex,e300,Extra EA300/LC,Private owner
a8fa44,n678jm,e300,,
aa6e68,n771ta,e300,Extra EA-300/L,Private owner
aa721f,n772ta,e300,Extra EA-300/L,Private owner
ab883a,n842kt,e300,Extra EA-300,Private owner
ad2114,n945pv,e300,Extra EA-300/LC,Private owner
c034bb,c-ftze,e300,Extra EA-300/L,Canada-National Research Counc
c06a20,c-goex,e300,Extra EA-300/L,Private owner
40655a,g-zxll,e300,Extra EA300/L,2 Â Excel Aviation
845ef9,ja11db,e300,Extra EA-300,Private owner
405398,g-olad,e300,Extra EA.300L,Private owner
4b21af,hb-mtr,e300,Extra EA300/SC,Private Owner
7c3b01,vh-lxv,e300,Extra EA-300/LC,Private owner
a39758,n330rt,e300,Extra EA-300/SCE,Private owner
a18f5f,n2xa,e300,Extra EA-300/L,Private owner
48b243,sp-mtd,e300,Extra 330 SC,Private owner
405e96,g-iihi,e300,Extra EA300/SC,Private owner
406fb7,g-iisc,e300,Extra EA-300/SC,Private owner
a3964e,n330fb,e300,Extra EA-300/LC,Private owner
3d4343,d-exsl,e300,Extra 300L,Private owner
403b11,g-miii,e300,Extra EA.300,Private owner
4b21a2,hb-mte,e300,Extra EA-330/SC,Private owner
49d195,ok-kop,e300,Extra EA-330SC,Private owner
4b21aa,hb-mtm,e300,Extra EA300/SC,Take - Off Balloon AG
a31fcc,n300ex,e300,Extra EA-300/L,Private owner
a6d909,n540mk,e300,Extra EA-300/L,Private owner
a86539,n64zz,e300,Extra EA-300/L,Private owner
ac9c14,n911tj,e300,Extra EA-300/L,Private owner
a1d3fd,n217ex,e300,Extra EA-300/L,Private owner
a19da2,n203ex,e300,Extra EA-300/L,Private owner
a396db,n330lt,e300,Extra EA-300/LT,Private owner
aa8bed,n779r,e300,Extra EA-300/L,Private owner
a4fa95,n42pk,e300,Extra EA-300/L,Private owner
a2430c,n245ex,e300,Extra EA-300/L,Private owner
abbf60,n856tw,e300,Extra EA-300/L,Private owner
a68715,n52fc,e300,Extra EA-300/L,Private owner
a4d20d,n41cv,e300,Extra EA-300/L,Private owner
ac9c62,n911wm,e300,Extra EA-300/L,Private owner
4b207c,hb-mhw,e300,Extra 300SC,Private owner
a951fb,n7xt,e300,Extra EA-300/L,Private owner
4b21b0,hb-mts,e300,Extra 300LC,AIL Swiss Austria Leasing
7c5b72,vh-sck,e300,Extra 300SC,Australian Aerobatic Academy
48c962,sp-tlc,e300,Extra 330SC,Private Owner
406fed,g-ihhi,e300,Extra 300SC,Private owner
ab1c21,n815c,e300,Extra EA-300/L,Private owner
a24ac8,n247j,e300,Extra EA-300/L,Private owner
a72739,n560dd,e300,Extra EA-300/L,Private owner
39dc0b,f-hxal,e300,Extra 300SC,Private owner
a40bef,n36wh,e300,Extra EA-300/LT,Private owner
a399a7,n331bh,e300,Extra EA-300/L,Private owner
440861,oe-aro,e300,Extra EA-300,Salzburg Jet Aviation
440863,oe-arp,e300,Extra EA-300,Salzburg Jet Aviation
440862,oe-arq,e300,Extra EA-300,Salzburg Jet Aviation
a39649,n330ex,e300,Extra EA-300/SC,Private owner
a521ed,n43mw,e300,Extra EA-300/L,Private owner
a4183c,n363jc,e300,Extra EA-300/L,Private owner
a1180b,n17nl,e300,Extra EA-300/L,Private owner
4784c9,ln-xtr,e300,Extra EA-300/L,Private owner
4a1702,yr-exb,e300,Extra 330SC,Romanian Airclub
a076ba,n129sj,e300,Extra EA-300/L,Private owner
48ce40,sp-uta,e300,Extra 330 LX,Zelazny Aerobatic Team
a980ac,n711kg,e300,Extra EA-300/L,Private owner
a396df,n330lx,e300,Extra EA-300/LC,Private owner
a2e08e,n285a,e300,Extra EA-300/L,Private owner
4058c6,g-jokr,e300,Extra 300L,Private owner
4b21a3,hb-mtf,e300,Extra EA300/200,Private owner
4063f6,g-iiik,e300,Extra EA 300/SC,Private owner
a07952,n13ex,e300,Extra EA-300/L,Private owner
a5dcb1,n477sf,e300,,
a11d8c,n171gt,e300,,
a03209,n111xt,e300,Extra EA-300/L,Private owner
a11397,n169ex,e300,Extra EA-300/L,Private owner
a397c4,n330wa,e300,,
401040,g-kiii,e300,,
a22e3d,n24ga,e300,,
a1ae11,n207x,e300,,
7c2bc9,vh-ixn,e300,,
a5763d,n451ef,e300,,
a6fe49,n55nl,e300,,
3d42f6,d-expm,e300,,
a39643,n330er,e300,,
a92a7c,n69xt,e300,,
a2a151,n269kd,e300,,
a3c215,n341lx,e300,,
a01866,n105mm,e300,,
a34b02,n311ex,e300,,
a4d241,n41ex,e300,,
3d2936,d-envy,e300,,
3d431e,d-exra,e300,,
48a534,sp-kkw,e300,,
a086a7,n133df,e300,,
a1dfd0,n22mw,e300,,
a74d20,n57lx,e300,,
a3be20,n340jk,e300,,
7c702b,vh-wfx,e300,,
e48c08,pr-zvk,e300,,
4b20d4,hb-mlg,e300,,
ad0b49,n94ex,e300,,
a3968e,n330hr,e300,,
407347,g-hedl,e300,,
a7130e,n555lx,e300,,
39ac12,f-hlas,e300,,
ab2e95,n82au,e300,,
3982a4,f-have,e300,,
400a70,g-teng,e300,,
3d3d03,d-evix,e300,,
3d4195,d-exbx,e300,,
398c35,f-hdbv,e300,,
a41113,n361lx,e300,,
a6d70c,n54rb,e300,,
