icao,regid,mdl,type,operator
390806,f-gcag,r100,Robin R-1180T Aiglon,Private owner
401f37,g-birt,r100,Pierre Robin R1180TD,Private Owner
4022d4,g-robn,r100,Robin Aiglon R100,Private owner
403daf,g-gder,r100,Robin R1180TD Aiglon,Berkshire Aviation Services
4021da,g-geep,r100,Robin R-1180,Private owner
390814,f-gcau,r100,Pierre Robin R-1180T Aiglon,Private owner
4849e6,ph-ecn,r100,Robin R 1180 TD,Private owner
401d96,g-bghm,r100,Pierre Robin R1180T Aiglon,Private owner
3d17e9,d-ehhp,r100,Robin R-1180TD Aiglon,Private Owner
40233b,g-vite,r100,Robin R1180T Aiglon,Private owner
