icao,regid,mdl,type,operator
0d03b1,xc-fiv,c500,Cessna 500 Citation I,SecretarÃ­a de Comunicaciones
0d03b2,xc-fez,c500,Cessna 500 Citation I,Secretaria de Comunicaciones y
300251,i-uuny,c500,Cessna 500 Citation I,Private owner
34264c,ec-jxc,c500,Cessna 500 Citation 1,"Airnor Aeronaves del Noroeste,"
42417e,vp-com,c500,Cessna 500 Citation 1,Private owner
45a829,oy-jai,c500,Cessna 500 Citation 1,Private owner
4a919a,se-dlz,c500,Cessna 500 Citation 1,Private owner
4a925a,se-drz,c500,Cessna 500 Citation 1,Jivair
505df6,om-vov,c500,Cessna 500 Citation 1,Private owner
7c5d2c,vh-sou,c500,Cessna 500 Citation 1,Private owner
a0004e,n1da,c500,Cessna 500 Citation I,Private owner
a004c0,n100am,c500,Cessna 500 Citation I,Private owner
a02afa,n11mn,c500,Cessna 500 Citation I,Private owner
a03005,n111bb,c500,Cessna 500 Citation I,Private owner
a03102,n111me,c500,Cessna 500 Citation I LW,Private owner
a0c8a6,n15jh,c500,Cessna 500 Citation I,Private owner
a0cbea,n150tt,c500,Cessna 500 Citation I,Private owner
a07b91,n130dw,c500,Cessna 500 Citation I,Private owner
a0aa6a,n142da,c500,Cessna 500 Citation I,Private owner
a0b6ed,n145ta,c500,Cessna 500 Citation I,Private owner
a1923c,n200cg,c500,Cessna 500 Citation I,Private owner
a19a2c,n202hm,c500,Cessna 500 Citation I Eagle,Private owner
a23cbc,n243sh,c500,Cessna 500 Citation I,Private owner
a1fc1f,n227mk,c500,Cessna 500 Citation I,Private owner
a21476,n233jj,c500,Cessna 500 Citation I,Private owner
a29919,n267bb,c500,Cessna 500 Citation I,Private owner
a2a51d,n27l,c500,Cessna 500 Citation I,Private owner
a2aa36,yv3029,c500,Cessna 500 Citation I,Private owner
a27940,n259dh,c500,Cessna 500 Citation I LW,Private owner
a33375,n305s,c500,Cessna 500 Citation I,Private owner
a35e43,n316mw,c500,Cessna 500 Citation I,Private owner
a39ed2,n332se,c500,,
a4cfa0,n409s,c500,Cessna 500 Citation I,Private owner
a4d281,n41hl,c500,Cessna 500 Citation I,Private owner
a4d98d,n411tn,c500,Cessna 500 Citation I,Private owner
a637a3,n50am,c500,Cessna 500 Citation I,Private owner
a63e0a,n501dz,c500,Cessna 500 Citation I,Private owner
a63e75,n501jf,c500,Cessna 500 Citation I,Private owner
a63ea9,n501lh,c500,Cessna 500 Citation I,Private owner
a63ed0,n501mx,c500,Cessna 500 Citation I,Private owner
a63f48,n501ss,c500,,
a63fea,n501zd,c500,Cessna 500 Citation I,Private owner
a70077,n550lt,c500,Cessna 500 Citation I,Private owner
a6af8f,n53rd,c500,,
a739b2,n565cc,c500,Cessna 500 Citation I,Private owner
a6d66f,n54jv,c500,Cessna 500 Citation I,Private owner
a7775f,n580r,c500,Cessna 500 Citation I,Private owner
a7a6d7,n592wp,c500,Cessna 500 Citation I,Private owner
a801ad,n615ds,c500,Cessna 500 Citation I,Private owner
a8d381,n668s,c500,,
a953ef,n70ts,c500,Cessna 500 Citation I,Private owner
a97df3,n710vl,c500,Cessna 500 Citation I,Private owner
a980e9,n711mt,c500,Cessna 500 Citation I,Private owner
a98490,n712mb,c500,Cessna 500 Citation I,Private owner
a9f136,n74ll,c500,Cessna 500 Citation I,Private owner
aa21b3,n752ck,c500,,
aa83d9,n777jj,c500,Cessna 500 Citation I,Private owner
aa84a3,n777sl,c500,Cessna 500 Citation I,Private owner
ab11e4,n812mg,c500,Cessna 500 Citation I,Private owner
aadd8c,n8dx,c500,Cessna 500 Citation I,Shelter Charter Services
ab8177,n840sp,c500,Cessna 500 Citation I,Private owner
acbd6d,n92sm,c500,Cessna 500 Citation I,Private owner
ac493e,n891ca,c500,Cessna 500 Citation I,Gulf Atlantic Airways
adf41e,n999am,c500,Cessna 500 Citation I,Private owner
ad5a4c,n96fb,c500,Cessna 500 Citation I,Private owner
adaa29,n98q,c500,Cessna 500 Citation 1,Private owner
add2ae,n990al,c500,Cessna 500 Citation I,Private owner
c07222,c-grft,c500,Cessna 500 Citation 1,Private owner
e909fa,cx-cct,c500,Cessna 500 Citation 1,Private owner
a09a7a,n138sa,c500,Cessna 500 Citation I,Private owner
ad8b15,n972ab,c500,Cessna 500 Citation I,Private owner
a7de7a,n606kr,c500,Cessna 500 Citation I,Private owner
a9613c,n703rt,c500,Cessna 500 Citation I,Private owner
aca5bd,n914cd,c500,Cessna 500 Citation I,Private owner
a953da,n70sw,c500,Cessna 500 Citation I,Private owner
a63e14,n501ej,c500,Cessna 500 Citation I,Private owner
a988c3,yv2800,c500,Cessna 500 Citation I,Private owner
