icao,regid,mdl,type,operator
a11ce7,n171ac,s64,Erickson S-64F,Private owner
a23b27,n243ac,s64,Erickson S-64E,Private owner
a1209e,n172ac,s64,Sikorsky S-64E Skycrane,Erickson Air Crane
a1280c,n174ac,s64,,
a943ae,n6962r,s64,,
