icao,regid,mdl,type,operator
7c120d,vh-dun,at8t,Air Tractor AT-802,Private owner
7c198b,vh-fbx,at8t,Air Tractor AT-802A,Private owner
7c1a05,vh-ffb,at8t,Air Tractor AT-802A,Private owner
7c1a10,vh-ffm,at8t,Air Tractor AT-802,Private owner
7c1ce8,vh-fzu,at8t,Air Tractor AT-802A,Private owner
7c1ceb,vh-fzx,at8t,Air Tractor AT-802A,Private owner
7c4488,vh-ntm,at8t,Air Tractor AT-802,Private owner
7c475b,vh-odp,at8t,Air Tractor AT-802A,Private owner
7c4763,vh-odx,at8t,Air Tractor AT-802A,Private owner
7c49b1,vh-oub,at8t,Air Tractor AT-802A,Private owner
7c49b2,vh-ouc,at8t,Air Tractor AT-802A,Private owner
7c49b4,vh-oue,at8t,Air Tractor AT-802A,Private owner
7c49b9,vh-ouj,at8t,Air Tractor AT-802A,Private owner
7c7bfc,vh-yry,at8t,Air Tractor AT-802,Private owner
7c7fed,vh-zjz,at8t,Air Tractor AT-802,Private owner
a1aebd,n20722,at8t,Air Tractor AT-802,US Depatment of State
a33cf8,n3079t,at8t,,
a33f74,n3080t,at8t,,
a7c9dc,n60019,at8t,Air Tractor AT-802,Private owner
e80850,cc-aph,at8t,,
a33bc5,n30701,at8t,Air Tractor AT-802,Private owner
c00ee7,c-ffqs,at8t,Air Tractor AT-802A,Conair Group
a1b665,n2094q,at8t,Air Tractor AT-802,Private owner
a1b66c,n2094x,at8t,Air Tractor AT-802,Private owner
a1b36f,n20898,at8t,Air Tractor AT-802,Private owner
aaf4a4,n805cb,at8t,Air Tractor AT-802A,Columbia Basin Helicopters
aafc12,n807cb,at8t,Air Tractor AT-802,Columbia Basin Helicopters
7c1a18,vh-ffu,at8t,,
7c0264,vh-ara,at8t,,
7c19e3,vh-fed,at8t,,
e80861,cc-ary,at8t,,
e80852,cc-api,at8t,,
7c2eb3,vh-jid,at8t,,
7c1216,vh-duw,at8t,,
aa7f62,n776as,at8t,,
a95330,n70la,at8t,,
aaee46,n803nz,at8t,,
7c7ebc,vh-zbi,at8t,,
aae30c,n800nc,at8t,,
a50ddb,n4247u,at8t,,
a41783,n363at,at8t,,
a334de,n3054w,at8t,,
a50599,n4221s,at8t,,
ac5da0,n896wp,at8t,,
a5195c,n428ae,at8t,,
aaee16,n803ma,at8t,,
a15ba8,n187la,at8t,,
aae9e3,n802gb,at8t,,
a1acff,n207la,at8t,,
a14356,n1802m,at8t,,
7c1200,vh-dua,at8t,,
7c1210,vh-duq,at8t,,
aaf55f,n805kp,at8t,,
aaea46,n802la,at8t,,
aaeb05,n802ts,at8t,,
a40296,n358as,at8t,,
a63e72,n501jc,at8t,,
7c1ce9,vh-fzv,at8t,,
a108f3,n166la,at8t,,
a12927,n174ml,at8t,,
abad73,n8510m,at8t,,
aa9bbc,n783as,at8t,,
aaea8f,n802nz,at8t,,
abaaaf,n8507k,at8t,,
a49cdb,n397as,at8t,,
abadb8,n8512l,at8t,,
a65135,n506la,at8t,,
7c1a36,vh-fgo,at8t,,
a44a26,n376as,at8t,,
abaab2,n8507n,at8t,,
501f96,892,at8t,,
aaea79,n802nb,at8t,,
aaea89,n802nt,at8t,,
a7fc68,n6131k,at8t,,
a0e047,n1558w,at8t,,
a804ea,n6159f,at8t,,
a33c08,n3072y,at8t,,
a00b24,n10122,at8t,,
a669d8,n512la,at8t,,
a00773,n10028,at8t,,
abbb1d,n855nf,at8t,,
