icao,regid,mdl,type,operator
401816,g-axhr,j3,Piper J3C-65 Cub,Private Owner
4a8694,se-att,j3,Piper J-3C-65,Ãnge Flygklubb
4b012d,hb-alp,j3,Piper J3C-65,Private Owner
4b0bb6,hb-eli,j3,,
4b2534,hb-oci,j3,Piper J3C-65/L-4,Private Owner
a02507,n10817,j3,Piper J3C-65,Private owner
a056c7,n1205p,j3,Piper J3C-65,Private owner
a02d90,n110pz,j3,American AL3,Private owner
a0c206,n148sp,j3,Piper J3C-65,Private owner
a05f05,n123bw,j3,Piper J3C-65,Private owner
a1dd9b,n2192m,j3,Piper J3C-65,Private owner
a274a1,n25752,j3,Piper J3C-65,Private owner
a2b2c5,n273ms,j3,American AL3,Private owner
a31c55,n3tm,j3,Piper J3C-65,Private owner
a35212,n313bc,j3,American AL3,Private owner
a5d763,n476,j3,Piper J3C-65,Private owner
a509a2,n42334,j3,Piper J3C-65,Private owner
a50dc6,n42468,j3,Piper J3C-65,Private owner
a51d0d,n429,j3,Piper J3C-65,Private owner
a6313b,n49875,j3,Piper J3C-65,Private owner
a676bd,n51524,j3,Piper J3C-65,Private owner
a87de1,n6460d,j3,Piper J3C-65,Private owner
a9dd96,n73493,j3,Piper J3C-65,Private owner
aa2db6,n755mg,j3,American Legend AL3,Private owner
ab57b8,n83tp,j3,,
acd733,n92628,j3,Piper J3C-65,Private owner
aca65f,n914jr,j3,American AL-3,Private owner
adc4fe,n98687,j3,Piper J3C-65,Private owner
adc7ba,n98711,j3,Piper J3C-65,Private owner
a950d2,n7kw,j3,Piper J3C-65,Private owner
a1a081,n2037m,j3,Piper J3C-65,Private owner
a63653,n5mb,j3,Piper J3C-65,Private owner
a7c1d4,n59941,j3,Piper J3C-65,Private owner
ab0780,n81f,j3,Piper J3C-65,Private owner
4062be,g-cgiy,j3,Piper J3C-65 Cub,Private owner
a43040,n3691k,j3,Piper J3C-65,Private owner
a1ce8c,n21506,j3,Piper J3C-65,Private owner
a89e5f,n6543h,j3,Piper J3C-65,Private owner
a1df12,n22ef,j3,Piper J3C-65,Private owner
acc858,n92229,j3,Piper J3C-65,Private owner
a469f8,n38380,j3,Piper J3C-65,Private owner
a95eda,n70234,j3,Piper J3C-65,Private owner
a67768,n51570,j3,Piper J3C-65,Private owner
4b25c8,hb-oia,j3,Piper J3C-65/L-4,Fluggruppe Albatros
a96dfa,n70652,j3,Piper J3C-65,Private owner
a28224,n26057,j3,Piper J3C-65,Private owner
38160d,f-bfqn,j3,Piper J/3 Cub,Aero Club Paul Tissandier
a3ab86,n33554,j3,Piper J3C-65,Private owner
a0a55b,n1402n,j3,Piper J3C-65,Private owner
ac244c,n88129,j3,Piper J3C-65,Private owner
a96e01,n70659,j3,Piper J3C-65,Private owner
a96a41,n70550,j3,Piper J3C-65,Private owner
adb28f,n98198,j3,Piper J3C-65,Private owner
a8041a,n6153h,j3,Piper J3C-65,Private owner
a34dcb,n31160,j3,Piper J3C-65,Private owner
a21c5b,n235pc,j3,Piper J3C-65,Private owner
adc095,n98534,j3,Piper J3C-65,Private owner
a952b6,n70fd,j3,Piper J3C-65,Private owner
a5a498,n46286,j3,Piper J3C-65,Private owner
a6291d,n49624,j3,Piper J3C-65,Private owner
a004b3,n100,j3,Piper J3C-65,Private owner
acccdc,n92384,j3,Piper J3C-65,Private owner
a506b9,n42290,j3,Piper J3C-65,Private owner
a1d650,n2173m,j3,Piper J3C-65,Private owner
adbd23,n98453,j3,Piper J3C-65,Private owner
adb595,n98246,j3,Piper J3C-65,Private owner
a96340,n70384,j3,Piper J3C-65,Private owner
a88a45,n6499h,j3,Piper J3C-65,Private owner
a3877c,n32638,j3,Piper J3C-65,Private owner
a3cb41,n3433n,j3,,
a98716,n7129h,j3,Piper J3C-65,Private owner
adc0d7,n98550,j3,,
a5027e,n42158,j3,,
a4e1dc,n41313,j3,,
a24a59,n247dp,j3,,
a4db21,n41167,j3,,
acc0be,n92010,j3,,
acd7bf,n92668,j3,,
4b260b,hb-okp,j3,,
a7eb54,n6092h,j3,,
40488a,g-cubw,j3,,
adc86d,n98765,j3,,
4b255d,hb-odx,j3,,
4b264a,hb-ona,j3,,
a558d9,n4435r,j3,,
a2bfad,n2764c,j3,,
402137,g-bpyn,j3,,
a338e8,n30669,j3,,
a416a8,n3624k,j3,,
aa18ad,n75lc,j3,,
adc3e5,n98606,j3,,
a24929,n24636,j3,,
398a81,f-hcub,j3,,
4b264e,hb-one,j3,,
a3daa9,n3477n,j3,,
a38b54,n32746,j3,,
a212a9,n23224,j3,,
4b254d,hb-odh,j3,,
a38e6d,n3280n,j3,,
adc8ae,n98780,j3,,
a0dc88,n1548n,j3,,
404397,g-bzhu,j3,,
a2863f,n26182,j3,,
a3ba75,n3396n,j3,,
a1d348,n2168m,j3,,
a847f3,n6323h,j3,,
