icao,regid,mdl,type,operator
3002bc,i-lyfe,p68,Partenavia P68,Private owner
3002be,i-gife,p68,Partenavia P68C,Private owner
300613,i-agae,p68,Partenavia 	P-68B,Private owner
343455,ec-itv,p68,Partenavia P-68C-TC,Grup Air-Med
3434d5,ec-iod,p68,Partenavia P.68C,Private owner
393c88,f-gpei,p68,Partenavia P68C,Private owner
394c38,f-gtby,p68,Partenavia P.68B,Private owner
3994a8,f-hffi,p68,Partenavia P-68B Victor,
39bc88,f-hpei,p68,Partenavia P-68C,Private owner
39c948,f-hski,p68,Vulcanair P.68TC,Private owner
39cd68,f-htli,p68,Vulcanair P.68,Private owner
400fb1,g-rvne,p68,Partenavia P68B Victor,Ravenair
401071,g-rvnk,p68,Partenavia P68B Victor,Ravenair
3d9810,d-gdvk,p68,Partenavia P-68C,Sylt Air
3d99ae,d-geli,p68,Partenavia P68B,Private owner
3d99c1,d-gemb,p68,Partenavia P68B,Private owner
3d9a51,d-gerp,p68,Partenavia P-68B Victor,Private owner
3d9cb8,d-gfpg,p68,Partenavia	P-68B Victor,Sylt Air
3da081,d-ghan,p68,Partenavia P-68,Private owner
3da0dc,d-ghea,p68,Vulcanair SPA	P-68 Obs,Polzei Hessen
3da370,d-gidk,p68,Vulcanair	P-68R,Private Owner
3da46a,d-gina,p68,Partenavia P68B,Private owner
401192,g-ence,p68,Partenavia P.68B Victor,Private owner
400ac9,g-bfbu,p68,Partenavia P68B,Ravenair
4026cf,g-rvng,p68,Partenavia P68B Victor,Ravenair
400bc1,g-rvrx,p68,Partenavia P68B Victor,Ravenair
400bfe,g-rvre,p68,Partenavia P68B Victor,Ravenair
400c8b,g-hubb,p68,Partenavia P68B Victor,Ravenair
406062,g-ripa,p68,Vulcan Air P-68 Observer 2,Private owner
4064a9,g-svey,p68,Vulcanair	P-68TC Observer,2 Excel Aviation
40663c,g-giga,p68,Partenavia P68C,Private owner
40673d,g-obsr,p68,Partenavia P68 Observer,Ravenair
406763,g-rvnp,p68,Partenavia P68B Victor,Ravenair
440291,oe-fjg,p68,Partenavia P68C,Private owner
440729,oe-fmm,p68,Partenavia P-68,Private owner
458a65,oy-bse,p68,Partenavia P68 B Victor,Private owner
458c26,oy-caf,p68,Partenavia P68 B  Victor,Private owner
458c83,oy-cdc,p68,Partenavia P68 C,Copenhagen Air Taxi
459156,oy-djv,p68,Partenavia P68 B Victor,Private owner
459d33,oy-gis,p68,Vulcanair P.68C,Private owner
459dd3,oy-gns,p68,Partenavia P.68,Private owner
459e13,oy-gps,p68,Vulcanair P.68 Observer 2,Private owner
45a593,oy-ils,p68,Partenavia P.68 Observer 2,Private owner
45a5d3,oy-ins,p68,Vulcanair P.68C,Bio Aviation I/S
45ceb2,oy-sur,p68,Partenavia P-68C Observer,Private owner
484595,ph-dki,p68,Partenavia P.68 C,Private owner
4845b6,ph-rvs,p68,Partenavia P.68B,Private owner
4ab327,se-lyg,p68,Partenavia	P-68C,Private owner
4b1eab,hb-lpz,p68,Partenavia P68B,Private owner
4b1f0c,hb-lts,p68,Partenavia P-68B Victor,Private owner
4895ec,sp-fpm,p68,Partenavia P.68 Observer 2,MGGP Aero
48988e,sp-geo,p68,Vulcanair P68 TC Observer,Private owner
489911,sp-gis,p68,Partenavia P-68,Gispro
48d6b5,sp-zzz,p68,Vulcanair P68 C,Private owner
4cc084,tf-bmw,p68,Partenavia P.68 Observer 2,Private owner
7c0b6d,vh-cjj,p68,Vulcanair P.68C,Private owner
7c2a18,vh-ilm,p68,Partenavia P-68C,Royal Victorian Aero Club
7c2bbe,vh-ixc,p68,Partenavia P-68B,Private owner
7c2bbf,vh-ixd,p68,Partenavia P.68B,Private owner
7c2bc0,vh-ixe,p68,Partenavia P.68B,Private owner
7c2be8,vh-iyi,p68,Partenavia P.68B,Private owner
7c2beb,vh-iyl,p68,Partenavia P.68B,Private owner
7c2fdc,vh-jqm,p68,Partenavia P.68B,Private owner
7c32d2,vh-kbo,p68,Vulcanair P.68C,Private owner
7c3b47,vh-lzt,p68,Vulcanair P.68R,Private owner
7c46f5,vh-oav,p68,Vulcanair P-68C,Private owner
7c4881,vh-olv,p68,Vulcanair P.68C,Private owner
7c4ed9,vh-puz,p68,Partenavia P.68C,Private owner
7c63c1,vh-tzn,p68,Vulcanair P.68C,Private owner
a00ac3,n1010,p68,Partenavia P68TC Observer,Private owner
a30ba3,n2959c,p68,Partenavia P.68C/TC,Private owner
a431f6,n37fg,p68,Partenavia P.68 Observer 2,State of California
a90f52,n683kw,p68,Partenavia P.68C,Private owner
a91309,n684kw,p68,Partenavia P.68C,Private owner
ac1ca8,n88n,p68,Partenavia P68C,Private owner
c80b2c,zk-pla,p68,Partenavia P.68 Observer,Private owner
c8173a,zk-tzz,p68,Partenavia P-68C,Canterbury Aero Club
3d9a43,d-gerb,p68,Partenavia P-68B Observer,Private owner
c8802d,dq-dnt,p68,Partenavia P.68B Victor,Private owner
a902ba,n68va,p68,Vulcanair P.68C Victor,Private owner
3d99c2,d-gemc,p68,Partenavia P68B,Private owner
7c4dd7,vh-pnt,p68,Partenavia P-68B,Royal Aero Club of Western Australia
3d9cba,d-gfpi,p68,Partenavia P68B,Private owner
7c1bdf,vh-fsh,p68,Partenavia P-68B,Private owner
400c89,g-orvr,p68,Partenavia P68B Victor,Ravenair
c8117a,zk-lak,p68,Partenavia P68C,Private owner
3db39a,d-gogo,p68,Partenavia P68-C-TC,Private owner
4407a4,oe-fgg,p68,Vulcanair P.68R,Private owner
406e9d,g-pngb,p68,Partenavia P.68B,Private owner
c05dbe,c-gjmz,p68,Partenavia P.68 Observer,Can-West Air Charters
4010a0,g-kimk,p68,Partenavia P68B,Private owner
84b735,ja210h,p68,Vulcanair P.68C,Private owner
44d14b,oo-tjk,p68,Partenavia P.68 Observer,Abelag Aviation
84b407,ja203h,p68,Vulcanair P.68C-TC,Hiratagakuen Aviation Operation Division
343251,ec-dts,p68,Cessna 208B Super Cargomaster,Generalitat de Catalunya
3d9c62,d-gfly,p68,Partenavia P68C,Private owner
3d9a5a,d-gery,p68,Partenavia P-68B,Rheinbraun
49d35d,ok-gis,p68,Vulcanair P68C TC,TopGis
a79f5c,n590wa,p68,Partenavia P68B,Private owner
478561,ln-lmx,p68,Vulcanair AP.68TP-300 Spartacus,Private owner
a8b6e2,n6602l,p68,Partenavia P-68,Private owner
a6ca68,n53695,p68,Partenavia P68B,Private owner
300652,i-rtaa,p68,Partenavia P-68B Victor,Private owner
3d99c0,d-gema,p68,Partenavia P-68B,Private owner
acbe2b,n920aa,p68,Partenavia P68B,Private owner
400d09,g-fjms,p68,Partenavia P-68B,Private owner
31ff16,321,p68,Vulcanair P.68 Observer 2,Chilean Navy
c80b20,zk-lal,p68,Partenavia P68B,Aerial Surveys
40693f,g-rvnj,p68,Partenavia P68B Victor,Ravenair
7c4dd6,vh-pns,p68,Partenavia P.68B,Private owner
3dc6a7,d-gvmd,p68,Partenavia P-68B Victor,Private owner
a56f35,n44959,p68,Partenavia P-68 Observer,Private owner
7c6cbc,vh-vri,p68,Vulcanair P.68R,Private owner
7c6045,vh-tav,p68,Vulcanair P.68R,Private owner
7c3905,vh-ljr,p68,,
7c6c15,vh-vmv,p68,,
7c2be5,vh-iyf,p68,,
7c4dd9,vh-pnv,p68,,
45b593,oy-mls,p68,,
3d97b8,d-gdsa,p68,,
345386,ec-mfy,p68,,
e485a7,pr-fsj,p68,,
45b533,oy-mis,p68,,
7c6c04,vh-vme,p68,,
48b9e6,sp-opg,p68,,
3da51e,d-gity,p68,,
7c0ae7,vh-cft,p68,,
392095,f-giev,p68,,
3006bd,i-grad,p68,,
39d498,f-hvey,p68,,
300641,i-vicc,p68,,
459c6d,oy-gcm,p68,,
440994,oe-fac,p68,,
7c2be2,vh-iyc,p68,,
30065b,i-gaus,p68,,
345387,ec-ivc,p68,,
45b5d3,oy-mns,p68,,
3006ef,i-elim,p68,,
7c4dd8,vh-pnu,p68,,
a61154,n490nr,p68,,
30066a,i-gjul,p68,,
7c3483,vh-knp,p68,,
e48cb6,pr-dcg,p68,,
300572,i-mejo,p68,,
31ff11,i-pdvc,p68,,
39a441,f-hjcb,p68,,
7c681f,vh-uup,p68,,
a7f09c,n610vc,p68,,
3d9a55,d-gert,p68,,
3d98fa,d-geek,p68,,
a32052,n300lf,p68,,
3daa1e,d-gkre,p68,,
a9290d,n69ha,p68,,
a62625,n4958k,p68,,
a11929,n17zx,p68,,
a37390,n321rt,p68,,
