icao,regid,mdl,type,operator
400b5b,g-beud,hr10,Pierre Robin HR100/285,Private Owner
40464f,g-cbfn,hr10,Pierre Robin HR100/200B,Private Owner
4010cb,g-blwf,hr10,Pierre HR100/210 Safari II,Private owner
44d5fa,oo-uoz,hr10,Pierre-Robin HR-100-210 Safari,Private owner
385cd7,f-bxgx,hr10,Pierre-Robin HR-100-250 TR,Private owner
4b0c45,hb-eqv,hr10,Robin HR100-250TR,Imprimerie Gessler SA
390801,f-gcab,hr10,Pierre-Robin R-1180T,Private owner
385ccd,f-bxgn,hr10,Pierre-Robin HR-100-250 TR,Private owner
