icao,regid,mdl,type,operator
4025ba,g-beol,sc7,SC7 Skyvan 3 Variant 100,Private owner
403a11,g-pigy,sc7,Short SC7 Skyvan 3-100,Private owner
440261,oe-fdi,sc7,Short SC7 Skyvan S3,Pink Aviation Services
4402e5,oe-fdk,sc7,Short SC7 Skyvan S3,Pink Aviation Services
4402e6,oe-fdn,sc7,Short SC7 Skyvan S3,Pink Aviation Services
4404e6,oe-fdp,sc7,Short SC7 Skyvan S3,Pink Aviation Services
462fa2,oh-sba,sc7,Short SC-7 Skyvan 3A-100,Aalto university
489dcf,sp-hop,sc7,Short Sc7 Series 3,Private owner
a00a41,n101uv,sc7,Amateur Vans RV-3,Private owner
a0f76e,n161ww,sc7,Shorts SC-7 Series 3,Private owner
c001bb,c-fara,sc7,Shorts SC-7 Skyvan 100,Summit Air
c0607d,c-gkoa,sc7,Short SC7 Skyvan Series 3,Private owner
a4a920,n4ne,sc7,Short SC-7 Skyvan,Private owner
a00a60,n101wa,sc7,Short SC-7 Skyvan,Private owner
739343,4x-agp,sc7,,
a171a2,n192ww,sc7,,
0b601a,8r-ggk,sc7,,
a17910,n194ww,sc7,,
