icao,regid,mdl,type,operator
484ceb,ph-djm,fox,Denney Acf Kitfox Mk IV,Private owner
4b400f,hb-ygt,fox,Skyfox Kitfox,Private Owner
a0e5cd,n157sn,fox,Amateur Kitfox Super Sport S7,Private owner
a54a22,n44vc,fox,Vix Syracuse/Kitfox 7 Series 7,Private owner
a69436,n523bk,fox,Kitfox Light Sport,Private owner
a7cfa9,n602lb,fox,Amateur S-7 Kitfox,Private owner
a82e89,n626wp,fox,Foxair Kitfox Light Sport,Private owner
a9b34a,n724ka,fox,Foxair Kitfox Light Sport,Private owner
acd116,n925dp,fox,Amateur Kitfox Supersport,Private owner
add45e,n990tt,fox,Amateur Kitfox Super Sport 7,Private owner
c04785,c-gbce,fox,Amateur Kitfox Series 5,Private owner
a901c5,n68kf,fox,KitFox V,Private owner
a9ae47,n7227,fox,Foxair Kitfox Light Sport,Private owner
ac0caa,n876ak,fox,Kitfox S7 Supersport,Private owner
4b3ff4,hb-yfs,fox,Kitfox IV,Private owner
4b4059,hb-yjp,fox,,
a6879f,n52lr,fox,Kitfox S7 Supersport,Private owner
484c56,ph-bcf,fox,SkyStar Kitfox Classic IV,Private owner
aacc43,n795tb,fox,Amateur Kitfox 7A,Private owner
a53e19,n437l,fox,,
4b40f4,hb-ypo,fox,,
4b405d,hb-yjt,fox,,
3d0706,d-eaxi,fox,,
4b4046,hb-yiw,fox,,
403466,g-tfox,fox,,
a063a1,n124m,fox,,
4b4085,hb-ylh,fox,,
