icao,regid,mdl,type,operator
e14c32,t-02,f28,Fokker F28-4000 Fellowship,Argentine Air Force
e20004,tc-52,f28,Fokker F.28 Fellowship 1000C,Argentine Air Force
e20005,tc-54,f28,Fokker F-28 Fellowship,Argentine Air Force
e20014,5-t-21,f28,Fokker F-28 Fellowship,Argentine Navy
0ac039,fac1041,f28,Fokker F-28 Fellowship,Fuerza Aerea Colombiana
0ac005,fac0002,f28,Fokker F-28 Fellowship,Fuerza Aerea Colombiana
e14d73,tc-53,f28,,
