icao,regid,mdl,type,operator
00a39f,zs-nmc,crj2,Canadair CL-600-2B19 Regional,South African Express Airways
00a3a0,zs-nmd,crj2,Canadair CL-600-2B19 Regional,South African Express Airways
00a3a1,zs-nme,crj2,Canadair CL-600-2B19 Regional,South African Express Airways
00a3a2,zs-nmf,crj2,Canadair CRJ-200,South African Express
00a3a3,zs-nmg,crj2,Canadair CL-600-2B19 Regional,South African Express Airways
00a3a4,zs-nmh,crj2,Canadair CRJ-200,South African Express
00a3a5,zs-nmi,crj2,Canadair CRJ-200,South African Express
00a3a6,zs-nmj,crj2,Canadair CRJ-200ER,MGC Airlines
00a3a7,zs-nmk,crj2,Canadair CRJ-200ER,MGC Airlines
00a3a8,zs-nml,crj2,Canadair CL-600-2B19 Regional,South African Express Airways
00a3aa,zs-nmn,crj2,Canadair CL-600-2B19 Regional,South African Express Airways
00b25e,zs-tbh,crj2,Canadair CRJ-200,South African Express
07c03b,st-nvb,crj2,Canadair CRJ-200,Nova Airways
07c03e,st-nvc,crj2,Canadair CL-600-2B19 Regional,Nova Airways
0d08da,xa-mcs,crj2,CRJ 200ER,MCS Aerocarga
34124b,ec-gyi,crj2,Canadair CRJ-200,Air Nostrum
3412c2,ec-gza,crj2,Canadair CRJ-200,Air Nostrum
341395,ec-hek,crj2,Canadair CRJ-200,Air Nostrum
3413d7,ec-hhi,crj2,Canadair CRJ-200,Air Nostrum
3414c4,ec-hpr,crj2,Canadair CRJ-200,Air Nostrum
341507,ec-hsh,crj2,Canadair CRJ-200,Air Nostrum
341658,up-cj011,crj2,Canadair CL-600-2B19 Regional,SCAT Air
341697,up-cj012,crj2,Canadair CRJ-200,Air Nostrum
3420d1,ec-mjy,crj2,Canadair CRJ-200,Air Nostrum
342185,ec-mjz,crj2,Canadair CRJ-200,Air Nostrum
342392,ec-jnx,crj2,Canadair CRJ-200,Air Nostrum
3423c7,ec-joy,crj2,Canadair CRJ-200,Air Nostrum
342f99,ec-jod,crj2,Canadair CRJ-200,Air Nostrum
150692,ra-67218,crj2,Canadair Challenger 850,MBK-S
150693,ra-67219,crj2,Canadair Challenger 850,Yamal Airlines
150694,ra-67220,crj2,Canadair Challenger 850,MBK-S
15069d,ra-67229,crj2,Canadair CRJ-200,Severstal
15069e,ra-67230,crj2,Canadair CRJ-200,Severstal
15069f,ra-67231,crj2,Canadair CRJ-200,Severstal
1506a0,ra-67232,crj2,Canadair Challenger 850,Ak Bars Aero
1506a2,ra-67234,crj2,Canadair CL-600-2B19 Regional,Severstal
1506a7,ra-67239,crj2,Canadair CRJ-200,Severstal
1506a8,ra-67240,crj2,Canadair CRJ-200,Severstal
3c69f9,d-ajoy,crj2,Canadair Challenger 850,Elytra Charter
3c452a,d-aaij,crj2,Canadair Challenger 850,JetAir Flug
42453b,vq-bot,crj2,Canadair CRJ-200,Ak Bars Aero
42453c,vq-bor,crj2,Canadair CRJ200,Ak Bars Aero
42453d,vq-boq,crj2,Canadair CRJ-200,Ak Bars Aero
42453f,vq-bom,crj2,Canadair CRJ-200,Ak Bars Aero
424540,vq-bol,crj2,Canadair CRJ-200,Ak Bars Aero
424541,vq-boj,crj2,Canadair CRJ-200,Ak Bars Aero
424542,vq-bou,crj2,Canadair CRJ200,Ak Bars Aero
42457f,vq-bsb,crj2,Canadair CRJ-200,Yamal Airlines
42458a,vq-bsa,crj2,Canadair CL-600-2B19 Regional,Yamal Airlines
4245f8,vq-bev,crj2,ATR 72-500,UTair
424619,vq-bpb,crj2,Canadair CRJ-200,Yamal Airlines
42461a,vq-bpd,crj2,Canadair CRJ-200,Yamal Airlines
42461b,vq-bpc,crj2,Canadair CRJ-200,Yamal Airlines
42461c,vq-bpa,crj2,Canadair CRJ-200,Yamal Airlines
424959,vq-bfa,crj2,Canadair CRJ-200,Rusline
42495a,vq-bfb,crj2,Canadair CRJ-200,Rusline
42495d,vq-bff,crj2,Canadair CRJ-200,Rusline
42495e,vq-bfi,crj2,Canadair CRJ-200,Rusline
424997,vq-bgr,crj2,Canadair CRJ-200,UTair
4249c1,vq-bov,crj2,Canadair Challenger 850,Rusline
4249cf,vq-bix,crj2,Canadair Regional Jet CRJ-200E,IrAero
4249d0,vq-biy,crj2,Canadair CRJ-200,IrAero
4249f4,vq-bml,crj2,Canadair CRJ-200,IrAero
4249f5,vq-bmk,crj2,Canadair CRJ-200,IrAero
43e764,m-fzmh,crj2,Canadair Challenger 850,Nexus Flight Operations
43e7a6,m-dwww,crj2,Canadair Challenger 850,TAG Aviation Asia
43e7ca,m-anta,crj2,Canadair Challenger 850,Private owner
43e83d,m-take,crj2,Canadair Challenger 850,Private owner
43e94a,m-lily,crj2,Canadair Challenger 850,TAG Aviation Asia
43e9d6,m-lilj,crj2,Canadair Challenger 850,Private owner
440054,up-cj008,crj2,Canadair CRJ-200,SCAT Airlines
4241a7,vp-con,crj2,Canadair Challenger 850,Private owner
424269,vp-bmn,crj2,Canadair CRJ-200,Rusline
424277,vp-bny,crj2,Canadair Challenger 850,Private owner
42427b,vp-bba,crj2,Canadair CRJ-200,Yamal Airlines
424289,vp-bbc,crj2,Canadair CRJ-200,Yamal Airlines
42428a,vp-bbe,crj2,Canadair CRJ-200,Yamal Airlines
4242b8,vp-bbm,crj2,Canadair CRJ-200,Yamal Airlines
45c943,oy-rjc,crj2,Canadair CRJ-200,SAS
45c94b,oy-rjk,crj2,Canadair CRJ-200,SAS
45c94d,oy-rjm,crj2,Canadair CRJ-200,SAS
4a92b8,se-dux,crj2,Canadair CRJ-200,West Air Sweden
4a92b9,se-duy,crj2,Canadair CRJ-200,West Air Sweden
4ac926,se-rif,crj2,Canadair CRJ-200,West Air Sweden
4ca7de,ei-eez,crj2,Canadair Challenger 850,Private Sky
4d20a8,9h-bvj,crj2,Canadair Challenger 850,Blue Square Aviation Group
4d20e1,9h-clg,crj2,Bombardier Challenger 850,Air X Charter
4d2103,9h-joy,crj2,Bombardier Challenger 850,Air X Charter
4d2104,9h-boo,crj2,Bombardier Challenger 850,Air X Charter
4d210c,9h-ila,crj2,Bombardier Challenger 850,VistaJet
4d210d,9h-ili,crj2,Bombardier Challenger 850,Vistajet Malta
4d210e,9h-ilv,crj2,Bombardier Challenger 850,VistaJet
500081,t7-oam,crj2,Bombardier Challenger 850,Private owner
503c1c,ly-zab,crj2,Canadair CRJ-200LR,KlasJet
503d19,ly-lty,crj2,Canadair Challenger 850,Charter Jets
506c07,s5-aag,crj2,Canadair CRJ-200,Adria Airways
5081b8,ur-icd,crj2,Canadair Challenger 850,ISD Avia
510046,ew-276pj,crj2,Canadair CRJ-200,Belavia
510047,ew-277pj,crj2,Canadair CRJ-200,Belavia
510055,ew-301pj,crj2,Canadair Challenger 850,Belavia
51005a,ew-303pj,crj2,Canadair CRJ-200,Belavia
514013,4l-gaa,crj2,Canadair Challenger 850,Georgian Airways
51402f,4l-tgs,crj2,Canadair CRJ-200,Georgian Airways
51404b,4l-tgb,crj2,Canadair CRJ-200,Georgian Airways
5faa9a,n155mw,crj2,Canadair CRJ-200,Private owner
683087,up-c8501,crj2,Canadair Challenger 850,Berkut State Air Company
6830e3,up-c8503,crj2,Canadair Challenger 850,Khozu-Avia
6831d9,up-cj004,crj2,Canadair CRJ-200,SCAT Airlines
6831dd,up-cj005,crj2,Canadair CRJ-200,SCAT Airlines
6831f8,up-c8505,crj2,Canadair Challenger 850,Comlux KZ
503d16,ly-vta,crj2,Canadair CRJ-200,KlasJet
780091,b-3073,crj2,Canadair Challenger 850,Freesky Aviation
71c040,hl8040,crj2,Canadair CRJ-200,uSky Air
78048d,b-4011,crj2,Canadair Challenger 800,PLAAF-China Air Force
7804cf,b-7695,crj2,Canadair CL-600-2B19 Regional,ZYB Lily Jet
780620,b-7697,crj2,Canadair Challenger 850,ZYB Lily Jet
78072f,b-3570,crj2,Canadair Challenger 850,Yalian Business Jet
78073c,b-7795,crj2,Canadair Challenger 850,ZYB Lily Jet
780117,b-3373,crj2,Boeing 737-86N,Shanghai Airlines
780271,b-3078,crj2,Canadair Challenger 850,Freesky Aviation
78035e,b-3006,crj2,Canadair CRJ-200,Shandong Airlines
748035,od-tal,crj2,Canadair CRJ-200,EasyFly
7807a5,b-3563,crj2,Canadair Challenger 850,Yalian Business Jet
780813,b-7797,crj2,Canadair Challenger 850,Private Owner
78091f,b-7767,crj2,Canadair Challenger 850,ZYB Lily Jet
80050d,vt-are,crj2,Canadair CRJ-200,Club One Air
8005e1,vt-ibp,crj2,Canadair Challenger 850,Indiabulls
840d80,ja03rj,crj2,Canadair CRJ-200,Ibex Airlines
841114,ja04rj,crj2,Canadair CRJ-200,Ibex Airlines
84b3c4,ja201j,crj2,Canadair CRJ-200,J-Air
84b3e6,ja202j,crj2,Canadair CRJ-200,J-Air
84b408,ja203j,crj2,Canadair CRJ-200,J-Air
84b42a,ja204j,crj2,Canadair CRJ-200,J-Air
84b44c,ja205j,crj2,Canadair CRJ-200,J-Air
84b46e,ja206j,crj2,Canadair CRJ-200,J-Air
84b490,ja207j,crj2,Canadair CRJ-200,J-Air
84b4b2,ja208j,crj2,Canadair CL-600-2B19 Regional,J-Air
84b4d4,ja209j,crj2,Canadair CRJ-200,J-Air
a0a7ff,n141sh,crj2,Canadair CRJ-200,Stewart-Haas Racing
a19ac7,n202ps,crj2,Canadair CRJ-200ER,US Airways Express
a14307,n1800c,crj2,Canadair  Challenger 800,Private owner
a1c5fd,n213ps,crj2,Canadair CRJ-200ER,US Airways Express
a1a9a3,n206ps,crj2,Canadair CRJ-200ER,US Airways Express
a1cd6b,n215ps,crj2,Canadair CRJ-200ER,US Airways Express
a1d122,n216ps,crj2,Canadair CRJ-200ER,US Airways Express
a1d890,n218ps,crj2,Canadair CRJ-200ER,US Airways Express
a1ad5a,n207ps,crj2,Canadair CRJ-200ER,US Airways Express
a1b4c8,n209ps,crj2,Canadair CRJ-200ER,US Airways Express
a1e257,n220ps,crj2,Canadair CRJ-200ER,US Airways Express
a1e60e,n221ps,crj2,Canadair CRJ-200ER,US Airways Express
a2350c,n241ps,crj2,Canadair CRJ-200ER,US Airways Express
a23846,n242js,crj2,Canadair CRJ-200ER,US Airways Express
a24031,n244ps,crj2,Canadair CRJ-200ER,US Airways Express
a1ecff,n223js,crj2,Canadair CRJ-200ER,US Airways Express
a1f824,n226js,crj2,Canadair CRJ-200ER,US Airways Express
a1f8a1,n226ps,crj2,,
a2000f,n228ps,crj2,Canadair CRJ-200ER,US Airways Express
a203c6,n229ps,crj2,Canadair CRJ-200ER,US Airways Express
a209d6,n230ps,crj2,Canadair CRJ-200ER,US Airways Express
a243e8,n245ps,crj2,Canadair CRJ-200ER,US Airways Express
a2479f,n246ps,crj2,Canadair CRJ-200ER,US Airways Express
a24ad9,n247js,crj2,Canadair CRJ-200ER,US Airways Express
a24f0d,n248ps,crj2,Canadair CRJ-200ER,US Airways Express
a252c4,n249ps,crj2,Canadair CRJ-200ER,US Airways Express
a258d4,n250ps,crj2,Canadair CRJ-200ER,US Airways Express
a25c8b,n251ps,crj2,Canadair CRJ-200ER,US Airways Express
a263f9,n253ps,crj2,Canadair CRJ-200,US Airways Express
a267b0,n254ps,crj2,Canadair CRJ-200ER,US Airways Express
a26f1e,n256ps,crj2,Canadair CRJ-200ER,US Airways Express
a272d5,n257ps,crj2,Canadair CRJ-200ER,US Airways Express
a2768c,n258ps,crj2,Canadair CRJ-200ER,US Airways Express
a27fd6,n260js,crj2,Canadair CRJ-200ER,US Airways Express
a28053,n260ps,crj2,,
a2840a,n261ps,crj2,Canadair CRJ-200ER,US Airways Express
a287c1,n262ps,crj2,Canadair CRJ-200ER,US Airways Express
a223d7,n237ps,crj2,Canadair CRJ-200ER,US Airways Express
a30d83,n296tx,crj2,Canadair Challenger 850,Private owner
a27a43,n259ps,crj2,Canadair CRJ-200ER,US Airways Express
a4c300,n406aw,crj2,Canadair CRJ-200ER,US Airways Express
a4c6b7,n407aw,crj2,Canadair CRJ-200ER,US Airways Express
a4ca6e,n408aw,crj2,Canadair CRJ-200ER,US Airways Express
a4ce25,n409aw,crj2,Canadair CRJ-200ER,US Airways Express
a4d435,n410aw,crj2,Canadair CRJ-200ER,US Airways Express
a4da2b,n411zw,crj2,Canadair CRJ-200ER,US Airways Express
a4dba3,n412aw,crj2,Canadair CRJ-200ER,US Airways Express
a4df5a,n413aw,crj2,Canadair CRJ-200ER,US Airways Express
a4e550,n414zw,crj2,Canadair CRJ-200ER,US Airways Express
a4e6c8,n415aw,crj2,Canadair CRJ-200ER,US Airways Express
a4ea7f,n416aw,crj2,Canadair CRJ-200ER,US Airways Express
a4ee36,n417aw,crj2,Canadair CRJ-200ER,US Airways Express
a4efc6,n417sw,crj2,Canadair CRJ-200LR,American Eagle
a4f1ed,n418aw,crj2,Canadair CRJ-200ER,US Airways Express
a4f37d,n418sw,crj2,Canadair CRJ-200LR,SkyWest Airlines
a4f5a4,n419aw,crj2,Canadair CRJ-200ER,US Airways Express
a4b06d,n401aw,crj2,Canadair CRJ-200LR,US Airways Express
a4b424,n402aw,crj2,Canadair CRJ-200LR,US Airways Express
a4b7db,n403aw,crj2,Canadair CRJ-200LR,US Airways Express
a4bb92,n404aw,crj2,Canadair CRJ-200ER,US Airways Express
a4bf49,n405aw,crj2,Canadair CRJ-200ER,US Airways Express
a4fb3b,n42wa,crj2,Canadair CRJ-200,Private owner
a4fbb4,n420aw,crj2,Canadair CRJ-200ER,US Airways Express
a501aa,n421zw,crj2,Canadair CRJ-200ER,US Airways Express
a535c6,n435aw,crj2,Canadair CRJ-200ER,US Airways Express
a53756,n435sw,crj2,Canadair CRJ-200ER,American Eagle
a5397d,n436aw,crj2,Canadair CRJ-200ER,US Airways Express
a53d34,n437aw,crj2,Canadair CRJ-200ER,US Airways Express
a53ec4,n437sw,crj2,Canadair CRJ-200ER,Delta Connection
a540eb,n438aw,crj2,Canadair CRJ-200ER,US Airways Express
a5427b,n438sw,crj2,Canadair CRJ-200ER,Delta Connection
a544a2,n439aw,crj2,Canadair CRJ-200ER,US Airways Express
a54632,n439sw,crj2,Canadair CRJ-200ER,Delta Connection
a54ab2,n440aw,crj2,Canadair CRJ-200ER,US Airways Express
a54c42,n440sw,crj2,Canadair CRJ-200ER,Delta Connection
a54ff9,n441sw,crj2,Canadair CRJ-200ER,Delta Connection
a550a8,n441zw,crj2,Canadair CRJ-200ER,US Airways Express
a55220,n442aw,crj2,Canadair CRJ-200ER,US Airways Express
a553b0,n442sw,crj2,Canadair CRJ-200ER,Delta Connection
a555d7,n443aw,crj2,Canadair CRJ-200ER,US Airways Express
a55767,n443sw,crj2,Canadair CRJ-200ER,Delta Connection
a55bcd,n444zw,crj2,Canadair CRJ-200ER,US Airways Express
a55d45,n445aw,crj2,Canadair CRJ-200ER,US Airways Express
a55ed5,n445sw,crj2,Canadair CRJ-200ER,Delta Connection
a560fc,n446aw,crj2,Canadair CRJ-200ER,US Airways Express
a5628c,n446sw,crj2,Canadair CRJ-200ER,Delta Connection
a564b3,n447aw,crj2,Canadair CRJ-200ER,US Airways Express
a56643,n447sw,crj2,Canadair CRJ-200ER,Delta Connection
a5686a,n448aw,crj2,Canadair CRJ-200ER,US Airways Express
a569fa,n448sw,crj2,Canadair CRJ-200ER,Delta Connection
a56c21,n449aw,crj2,Canadair CRJ-200ER,US Airways Express
a56db1,n449sw,crj2,Canadair CRJ-200ER,Delta Connection
a57231,n450aw,crj2,Canadair CRJ-200ER,US Airways Express
a575e8,n451aw,crj2,Canadair CRJ-200ER,US Airways Express
a57d56,n453aw,crj2,Canadair CRJ-200ER,US Airways Express
a57ee6,n453sw,crj2,Canadair CRJ-200ER,Delta Connection
a5810d,n454aw,crj2,Canadair CRJ-200ER,US Airways Express
a5829d,n454sw,crj2,Canadair CRJ-200ER,Delta Connection
a584c4,n455aw,crj2,Canadair CRJ-200ER,US Airways Express
a584e2,n455ca,crj2,Canadair CRJ-200ER,Delta Connection
a58654,n455sw,crj2,Canadair CRJ-200ER,Delta Connection
a58aba,n456zw,crj2,Canadair CRJ-200ER,US Airways Express
a58c32,n457aw,crj2,Canadair CRJ-200ER,US Airways Express
a58dc2,n457sw,crj2,Canadair CRJ-200ER,Delta Connection
a58fe9,n458aw,crj2,Canadair CRJ-200ER,US Airways Express
a593a0,n459aw,crj2,Canadair CRJ-200ER,US Airways Express
a59530,n459sw,crj2,Canadair CRJ-200ER,Delta Connection
a599b0,n460aw,crj2,Canadair CRJ-200ER,US Airways Express
a59b40,n460sw,crj2,Canadair CRJ-200ER,Delta Connection
a59d67,n461aw,crj2,Canadair CRJ-200ER,US Airways Express
a59ef7,n461sw,crj2,Canadair CRJ-200ER,Delta Connection
a5a11e,n462aw,crj2,Canadair CRJ-200ER,US Airways Express
a5a4d5,n463aw,crj2,Canadair CRJ-200ER,US Airways Express
a5a665,n463sw,crj2,Canadair CRJ-200ER,Delta Connection
a5a88c,n464aw,crj2,Canadair CRJ-200ER,US Airways Express
a5aa1c,n464sw,crj2,Canadair CRJ-200ER,American Eagle
a5ac43,n465aw,crj2,Canadair CRJ-200ER,US Airways Express
a5add3,n465sw,crj2,Canadair CRJ-200ER,SkyWest Airlines
a5affa,n466aw,crj2,Canadair CRJ-200ER,US Airways Express
a5b18a,n466sw,crj2,Canadair CRJ-200ER,SkyWest Airlines
a5b3b1,n467aw,crj2,Canadair CRJ-200ER,US Airways Express
a5b5f0,n467zw,crj2,,
a5b768,n468aw,crj2,Canadair CRJ-200ER,US Airways Express
a5b786,n468ca,crj2,Canadair CRJ-200ER,US Airways Express
a5bb1f,n469aw,crj2,Canadair CRJ-200ER,US Airways Express
a5db4e,n477ca,crj2,Canadair CRJ-200ER,United Express
a5e2bc,n479ca,crj2,Canadair CRJ-200ER,United Express
a50322,n422aw,crj2,Canadair CRJ-200ER,US Airways Express
a506d9,n423aw,crj2,Canadair CRJ-200ER,US Airways Express
a50869,n423sw,crj2,Canadair CRJ-200LR,American Eagle
a50a90,n424aw,crj2,Canadair CRJ-200ER,US Airways Express
a50e47,n425aw,crj2,Canadair CRJ-200ER,US Airways Express
a511fe,n426aw,crj2,Canadair CRJ-200ER,US Airways Express
a602cd,n487ca,crj2,Canadair CRJ-200ER,Delta Connection
a61f27,n494ca,crj2,Canadair CRJ-200ER,SkyWest Airlines
a5c36e,n470zw,crj2,Canadair CRJ-200ER,US Airways Express
a5c504,n471ca,crj2,Canadair CRJ-200ER,United Express
a5c725,n471zw,crj2,Canadair CRJ-200ER,US Airways Express
a5c8bb,n472ca,crj2,Canadair CRJ-200ER,United Express
a5138e,n426sw,crj2,Canadair CRJ-200LR,Delta Connection
a51745,n427sw,crj2,Canadair CRJ-200LR,Delta Connection
a517f4,n427zw,crj2,Canadair CRJ-200ER,US Airways Express
a5196c,n428aw,crj2,Canadair CRJ-200ER,US Airways Express
a51d23,n429aw,crj2,Canadair CRJ-200ER,US Airways Express
a51eb3,n429sw,crj2,Canadair CRJ-200ER,Delta Connection
a52333,n430aw,crj2,Canadair CRJ-200ER,US Airways Express
a524c3,n430sw,crj2,Canadair CRJ-200ER,Delta Connection
a526ea,n431aw,crj2,Canadair CRJ-200ER,US Airways Express
a5287a,n431sw,crj2,Canadair CRJ-200ER,Delta Connection
a52aa1,n432aw,crj2,Canadair CRJ-200ER,US Airways Express
a52c31,n432sw,crj2,Canadair CRJ-200ER,Delta Connection
a52e58,n433aw,crj2,Canadair CRJ-200ER,US Airways Express
a52fe8,n433sw,crj2,Canadair CRJ-200ER,Delta Connection
a5320f,n434aw,crj2,Canadair CRJ-200ER,US Airways Express
a622de,n495ca,crj2,Canadair CRJ-200ER,SkyWest Airlines
a62695,n496ca,crj2,Canadair CRJ-200ER,US Airways Express
a62e03,n498ca,crj2,Canadair CRJ-200ER,SkyWest Airlines
a5799f,n452aw,crj2,Canadair CRJ-200ER,US Airways Express
a57b2f,n452sw,crj2,Canadair CRJ-200ER,Delta Connection
a6506d,n506ca,crj2,Canadair CRJ-200ER,US Airways Express
a65424,n507ca,crj2,Canadair CRJ-200ER,United Express
a6a6d9,n528ca,crj2,Canadair CRJ-200ER,Delta Connection
a78a0e,up-cj007,crj2,Canadair CRJ-200,GECAS
a7c584,n60gh,crj2,Canadair CRJ-200,Private owner
a7a23c,n591ml,crj2,Canadair CRJ-200,Private owner
a7a9aa,n593ml,crj2,Canadair CRJ-200LR,United Express
a7cd0c,n601xj,crj2,Canadair CRJ-200,Mesaba Airlines
a7d0c3,n602xj,crj2,Canadair CRJ-200LR,Delta Connection
a837d5,n629br,crj2,Canadair CRJ-200ER,Delta Connection
a89451,n652br,crj2,Canadair CRJ-200ER,SkyWest Airlines
a8ae52,n659br,crj2,Canadair CRJ-200ER,Delta Connection
a8feb8,n679sa,crj2,Canadair CRJ-200ER,United Express
a915f3,n685br,crj2,Canadair CRJ-200ER,Delta Connection
a8ee74,n675br,crj2,Canadair CRJ-200ER,Delta Connection
a9586e,n701br,crj2,Canadair CRJ-200ER,United Express
a95c25,n702br,crj2,Canadair CRJ-200ER,SkyWest Airlines
a97626,n709br,crj2,Canadair CRJ-200ER,SkyWest Airlines
a93604,n693br,crj2,Canadair CRJ-200ER,SkyWest Airlines
a94c4e,n699br,crj2,Canadair CRJ-200ER,SkyWest Airlines
aae1f4,n800ay,crj2,Canadair CRJ-200LR,Delta Connection
ab2ae2,n819ay,crj2,Canadair CRJ-200LR,Delta Connection
ab30f2,n820ay,crj2,Canadair CRJ-200LR,Delta Connection
ab34a3,n821as,crj2,Canadair CRJ-200ER,US Airways Express
ab3c11,n823as,crj2,Canadair CRJ-200ER,Delta Connection
ab586b,n830as,crj2,Canadair CRJ-200ER,United Express
ab5fdf,n832ay,crj2,Canadair CRJ-200,Endeavor Air
ab6390,n833as,crj2,Canadair CRJ-200ER,United Express
ab6396,n833ay,crj2,Canadair CRJ-200LR,Delta Connection
ab674d,n834ay,crj2,Canadair CRJ-200LR,Delta Connection
ab6b04,n835ay,crj2,Canadair CRJ-200LR,Delta Connection
ab6ebb,n836ay,crj2,Canadair CRJ-200LR,Delta Connection
ab726c,n837as,crj2,Canadair CRJ-200ER,United Express
ab7623,n838as,crj2,Canadair CRJ-200ER,Delta Connection
aae5ab,n801ay,crj2,Canadair CRJ-200LR,Delta Connection
ab3fc8,n824as,crj2,Canadair CRJ-200ER,SkyWest Airlines
ab9da2,n848as,crj2,Canadair CRJ-200ER,Delta Connection
aba159,n849as,crj2,Canadair CRJ-200ER,Delta Connection
aba769,n850as,crj2,Canadair CRJ-200ER,Delta Connection
aba82b,n850jl,crj2,Canadair Challenger 850,Private owner
abab20,n851as,crj2,Canadair CRJ-200ER,Delta Connection
abaed7,n852as,crj2,Canadair CRJ-200ER,Delta Connection
abb28e,n853as,crj2,Canadair CRJ-200ER,Delta Connection
abb645,n854as,crj2,Canadair CRJ-200ER,Delta Connection
abb9fc,n855as,crj2,Canadair CRJ-200ER,Delta Connection
abbdb3,n856as,crj2,Canadair CRJ-200ER,Delta Connection
abc16a,n857as,crj2,Canadair CRJ-200ER,Delta Connection
ab7fea,n840as,crj2,Canadair CRJ-200ER,Delta Connection
ab7ff0,n840ay,crj2,Canadair CRJ-200LR,Delta Connection
ab83a1,n841as,crj2,Canadair CRJ-200ER,Delta Connection
ab8758,n842as,crj2,Canadair CRJ-200ER,Delta Connection
ab8a0b,n8423c,crj2,Canadair CRJ-200LR,Delta Connection
ab8b0f,n843as,crj2,Canadair CRJ-200ER,Delta Connection
ab8ec6,n844as,crj2,Canadair CRJ-200ER,Delta Connection
ab9634,n846as,crj2,Canadair CRJ-200ER,Delta Connection
ab99eb,n847as,crj2,Canadair CRJ-200ER,Delta Connection
ac0cb1,n876as,crj2,Canadair CRJ-200ER,American Eagle
ac1068,n877as,crj2,Canadair CRJ-200ER,American Eagle
ac141f,n878as,crj2,Canadair CRJ-200ER,Delta Connection
ac17d6,n879as,crj2,Canadair CRJ-200ER,American Eagle
ac1de6,n880as,crj2,Canadair CRJ-200ER,American Eagle
ac2554,n882as,crj2,Canadair CRJ-200ER,Delta Connection
ac28b7,n8828d,crj2,Canadair CRJ-200LR,Delta Connection
ac290b,n883as,crj2,Canadair CRJ-200ER,Delta Connection
ac2c92,n8839e,crj2,Canadair CRJ-200LR,Delta Connection
ac2cc2,n884as,crj2,Canadair CRJ-200ER,Delta Connection
ac2fff,n8847a,crj2,Canadair CRJ-200LR,Delta Connection
ac3079,n885as,crj2,Canadair CRJ-200ER,US Airways Express
ac3430,n886as,crj2,Canadair CRJ-200ER,US Airways Express
ac37b4,n8869b,crj2,Canadair CRJ-200LR,Delta Connection
ac3b24,n8877a,crj2,Canadair CRJ-200LR,Delta Connection
abc521,n858as,crj2,Canadair CRJ-200ER,Delta Connection
abc8d8,n859as,crj2,Canadair CRJ-200ER,Delta Connection
abcee8,n860as,crj2,Canadair CRJ-200ER,Delta Connection
abd29f,n861as,crj2,Canadair CRJ-200ER,Delta Connection
abd656,n862as,crj2,Canadair CRJ-200ER,American Eagle
abda0d,n863as,crj2,Canadair CRJ-200ER,American Eagle
abddc4,n864as,crj2,Canadair CRJ-200ER,American Eagle
abe532,n866as,crj2,Canadair CRJ-200ER,American Eagle
abe8e9,n867as,crj2,Canadair CRJ-200ER,Delta Connection
abeca0,n868as,crj2,Canadair CRJ-200ER,American Eagle
abf057,n869as,crj2,Canadair CRJ-200ER,American Eagle
abf667,n870as,crj2,Canadair CRJ-200ER,Delta Connection
abfa1e,n871as,crj2,Canadair CRJ-200ER,Delta Connection
abfdd5,n872as,crj2,Canadair CRJ-200ER,Delta Connection
ac0041,n8721b,crj2,Canadair CRJ-200LR,Delta Connection
ac018c,n873as,crj2,Canadair CRJ-200ER,Delta Connection
ac0330,n873tm,crj2,Canadair CRJ-200,Export Development Canada
ac0543,n874as,crj2,Canadair CRJ-200ER,SkyWest Airlines
ac08fa,n875as,crj2,Canadair CRJ-200ER,US Airways Express
ac735b,n901ev,crj2,Canadair CRJ-200ER,American Eagle
ac7712,n902ev,crj2,Canadair CRJ-200ER,American Eagle
ac7ac9,n903ev,crj2,Canadair CRJ-200ER,American Eagle
ac7bf6,n903sw,crj2,Canadair CRJ-200LR,United Express
ac7e80,n904ev,crj2,Canadair CRJ-200ER,American Eagle
ac8237,n905ev,crj2,Canadair CRJ-200ER,American Eagle
ac8364,n905sw,crj2,Canadair CRJ-200LR,United Express
ac85ee,n906ev,crj2,Canadair CRJ-200ER,American Eagle
ac871b,n906sw,crj2,Canadair CRJ-200ER,US Airways Express
ac89a5,n907ev,crj2,Canadair CRJ-200ER,American Eagle
ac8ad2,n907sw,crj2,Canadair CRJ-200ER,US Airways Express
ac8d5c,n908ev,crj2,Canadair CRJ-200ER,American Eagle
ac8e89,n908sw,crj2,Canadair CRJ-200ER,US Airways Express
ac9113,n909ev,crj2,Canadair CRJ-200ER,American Eagle
ac9240,n909sw,crj2,Canadair CRJ-200ER,US Airways Express
ac94b7,n91ea,crj2,Canadair CRJ-200ER,Elite Airways
ac9723,n910ev,crj2,Canadair CRJ-200ER,Delta Connection
ac9850,n910sw,crj2,Canadair CRJ-200ER,United Express
acb124,n917ev,crj2,Canadair CRJ-200ER,Delta Connection
acb251,n917sw,crj2,Canadair CRJ-200ER,United Express
acb608,n918sw,crj2,Canadair CRJ-200ER,United Express
acb892,n919ev,crj2,Canadair CRJ-200ER,Delta Connection
acb9bf,n919sw,crj2,Canadair CRJ-200ER,United Express
acbc36,n92ea,crj2,Canadair CRJ-200ER,Elite Airways
acbea2,n920ev,crj2,Canadair CRJ-200ER,Delta Connection
acbfcf,n920sw,crj2,Canadair CRJ-200ER,United Express
acc259,n921ev,crj2,Canadair CRJ-200ER,Delta Connection
acc610,n922ev,crj2,Canadair CRJ-200ER,Delta Connection
acc9c7,n923ev,crj2,Canadair CRJ-200ER,Delta Connection
accaf4,n923sw,crj2,Canadair CRJ-200ER,United Express
ac3c3a,n888gy,crj2,Canadair CRJ-200,Private owner
ac3d94,n888wu,crj2,Canadair CRJ-200,WU Air Corporation
ac3e53,n8883e,crj2,Canadair CRJ-200LR,Delta Connection
ac3e76,n8884e,crj2,Canadair CRJ-200LR,Delta Connection
ac3f55,n889as,crj2,Canadair CRJ-200ER,US Airways Express
ac41c0,n8891a,crj2,Canadair CRJ-200LR,Delta Connection
ac4816,n8903a,crj2,Canadair CRJ-200LR,Delta Connection
ac4861,n8905f,crj2,Canadair CRJ-200LR,Delta Connection
ac48a2,n8907a,crj2,Canadair CRJ-200LR,Delta Connection
ac4bcd,n8913a,crj2,Canadair CRJ-200LR,Delta Connection
ac4f84,n8923a,crj2,Canadair CRJ-200LR,Delta Connection
ac4fa8,n8924b,crj2,Canadair CRJ-200LR,Delta Connection
ac52d6,n8930e,crj2,Canadair CRJ-200LR,Delta Connection
ac531a,n8932c,crj2,Canadair CRJ-200LR,Delta Connection
ac533c,n8933b,crj2,Canadair CRJ-200LR,Delta Connection
ac53ea,n8938a,crj2,Canadair CRJ-200LR,Delta Connection
ac568d,n8940e,crj2,Canadair CRJ-200LR,Delta Connection
ac56cf,n8942a,crj2,Canadair CRJ-200LR,Delta Connection
ac56f2,n8943a,crj2,Canadair CRJ-200LR,Delta Connection
ac5716,n8944b,crj2,Canadair CRJ-200LR,Delta Connection
ac5824,n895cl,crj2,Canadair Challenger 850,Averitt Air Charter
accd7e,n924ev,crj2,Canadair CRJ-200ER,Delta Connection
acceab,n924sw,crj2,Canadair CRJ-200ER,United Express
acd135,n925ev,crj2,Canadair CRJ-200ER,Delta Connection
acd262,n925sw,crj2,Canadair CRJ-200ER,United Express
acd4ec,n926ev,crj2,Canadair CRJ-200ER,Delta Connection
acd619,n926sw,crj2,Canadair CRJ-200ER,United Express
acd8a3,n927ev,crj2,Canadair CRJ-200ER,Delta Connection
acd9d0,n927sw,crj2,Canadair CRJ-200ER,United Express
acdc5a,n928ev,crj2,Canadair CRJ-200ER,SkyWest Airlines
acdd87,n928sw,crj2,Canadair CRJ-200ER,United Express
ace011,n929ev,crj2,Canadair CRJ-200ER,United Express
ace13e,n929sw,crj2,Canadair CRJ-200ER,United Express
ace3b5,n93ea,crj2,Canadair CRJ-200ER,Elite Airways
ace621,n930ev,crj2,Canadair CRJ-200ER,SkyWest Airlines
ace74e,n930sw,crj2,Canadair CRJ-200ER,United Express
ac5df7,n8960a,crj2,Canadair CRJ-200LR,Delta Connection
ac5e87,n8964e,crj2,Canadair CRJ-200LR,Delta Connection
ac5eaa,n8965e,crj2,Canadair CRJ-200LR,Delta Connection
ac5f13,n8968e,crj2,Canadair CRJ-200LR,Delta Connection
ac5f32,n8969a,crj2,Canadair CRJ-200LR,Delta Connection
ac61b1,n8970d,crj2,Canadair CRJ-200LR,Delta Connection
ac61f8,n8972e,crj2,Canadair CRJ-200LR,Delta Connection
ac623c,n8974c,crj2,Canadair CRJ-200LR,Delta Connection
ac6284,n8976e,crj2,Canadair CRJ-200LR,Delta Connection
ac62a3,n8977a,crj2,Canadair CRJ-200LR,Delta Connection
ac6565,n8980a,crj2,Canadair CRJ-200LR,Delta Connection
ac65ab,n8982a,crj2,Canadair CRJ-200LR,Delta Connection
ac6638,n8986b,crj2,Canadair CRJ-200LR,Delta Connection
ac9e91,n912ev,crj2,Canadair CRJ-200ER,Delta Connection
ac9fbe,n912sw,crj2,Canadair CRJ-200ER,United Express
aca248,n913ev,crj2,Canadair CRJ-200ER,Delta Connection
aca375,n913sw,crj2,Canadair CRJ-200ER,United Express
aca5ff,n914ev,crj2,Canadair CRJ-200ER,Delta Connection
aced8f,n932ev,crj2,Canadair CRJ-200ER,United Express
aceebc,n932sw,crj2,Canadair CRJ-200ER,United Express
acf4fd,n934ev,crj2,Canadair CRJ-200,ExpressJet Airlines
ad3dba,n952sw,crj2,Canadair CRJ-200ER,United Express
ad4171,n953sw,crj2,Canadair CRJ-200ER,SkyWest Airlines
ad4528,n954sw,crj2,Canadair CRJ-200ER,United Express
ac6fa4,n900ev,crj2,Canadair CRJ-200ER,Delta Connection
aca9b6,n915ev,crj2,Canadair CRJ-200ER,Delta Connection
acaae3,n915sw,crj2,Canadair CRJ-200ER,United Express
acad6d,n916ev,crj2,Canadair CRJ-200ER,Delta Connection
acae9a,n916sw,crj2,Canadair CRJ-200ER,United Express
acf62a,n934sw,crj2,Canadair CRJ-200ER,United Express
acf9e1,n935sw,crj2,Canadair CRJ-200ER,United Express
acfc6b,n936ev,crj2,Canadair CRJ-200ER,Delta Connection
acfd98,n936sw,crj2,Canadair CRJ-200ER,United Express
ad0022,n937ev,crj2,Canadair CRJ-200ER,Delta Connection
ad014f,n937sw,crj2,Canadair CRJ-200ER,United Express
ad0506,n938sw,crj2,Canadair CRJ-200ER,United Express
ad906f,n973sw,crj2,Canadair CRJ-200ER,United Express
ad92f9,n974ev,crj2,Canadair CRJ-200ER,Delta Connection
ad97dd,n975sw,crj2,Canadair CRJ-200ER,United Express
ad48df,n955sw,crj2,Canadair CRJ-200ER,American Eagle
ad4c96,n956sw,crj2,Canadair CRJ-200ER,United Express
ad504d,n957sw,crj2,Canadair CRJ-200ER,United Express
ad5404,n958sw,crj2,Canadair CRJ-200ER,United Express
ad57bb,n959sw,crj2,Canadair CRJ-200ER,United Express
ad59db,n96ap,crj2,Canadair CL-600-2B19 Regional,Private
ad08bd,n939sw,crj2,Canadair CRJ-200ER,United Express
ad1284,n941sw,crj2,Canadair CRJ-200ER,United Express
ad19f2,n943sw,crj2,Canadair CRJ-200ER,United Express
ad9b94,n976sw,crj2,Canadair CRJ-200ER,United Express
ad5a32,n96ea,crj2,Canadair CRJ-200ER,Elite Airways
ad5dcb,n960sw,crj2,Canadair CRJ-200ER,United Express
ada302,n978sw,crj2,Canadair CRJ-200ER,United Express
ada58c,n979ev,crj2,Canadair CRJ-200ER,Delta Connection
ada6b9,n979sw,crj2,Canadair CRJ-200ER,United Express
adacc9,n980sw,crj2,Canadair CRJ-200ER,United Express
ad6182,n961sw,crj2,Canadair CRJ-200ER,United Express
ad6539,n962sw,crj2,Canadair CRJ-200ER,United Express
ad68f0,n963sw,crj2,Canadair CRJ-200ER,United Express
ad1da9,n944sw,crj2,Canadair CRJ-200ER,US Airways Express
ad2160,n945sw,crj2,Canadair CRJ-200ER,United Express
ad2517,n946sw,crj2,Canadair CRJ-200ER,United Express
ad28ce,n947sw,crj2,Canadair CRJ-200ER,SkyWest Airlines
c008d7,c-fdja,crj2,Canadair CRJ-200,Air Canada Express
c00b7b,c-feja,crj2,Canadair CRJ-200,Air Canada Express
c00e1f,c-ffja,crj2,Canadair CRJ-200,Air Canada Express
ad6ca7,n964sw,crj2,Canadair CRJ-200ER,United Express
ad705e,n965sw,crj2,Canadair CRJ-200ER,United Express
adb437,n982sw,crj2,Canadair CRJ-200ER,United Express
adb7ee,n983sw,crj2,Canadair CRJ-200ER,United Express
c0160b,c-fija,crj2,Canadair CRJ-200,Air Canada Express
ad2c85,n948sw,crj2,Canadair CRJ-200ER,United Express
ad3a03,n951sw,crj2,Canadair CRJ-200ER,SkyWest Airlines
adc313,n986sw,crj2,Canadair CRJ-200ER,United Express
ad77cc,n967sw,crj2,Canadair CRJ-200ER,United Express
ad7f3a,n969sw,crj2,Canadair CRJ-200ER,United Express
ad854a,n970sw,crj2,Canadair CRJ-200ER,United Express
ad8901,n971sw,crj2,Canadair CRJ-200ER,United Express
c05f00,c-gjzj,crj2,Canadair CRJ-200,Air Canada Express
c05f10,c-gjzz,crj2,Canadair CRJ-200,Air Canada Express
c05f82,c-gkej,crj2,Canadair CRJ-200,Air Canada Express
c05f83,c-gkek,crj2,Canadair CRJ-200,Air Canada Express
c05f85,c-gkem,crj2,Canadair CRJ-200,Air Canada Express
c05f88,c-gkep,crj2,Canadair CRJ-200,Air Canada Express
c05f8a,c-gker,crj2,Canadair CRJ-200,Air Canada Express
c05f8d,c-gkeu,crj2,Canadair CRJ-200,Air Canada Express
c05f8f,c-gkew,crj2,Canadair CRJ-200,Air Canada Express
c05f92,c-gkez,crj2,Canadair CRJ-200,Air Canada Express
c05fa4,c-gkfr,crj2,Canadair CRJ-200,Air Canada Express
c05faf,c-gkgc,crj2,Canadair CRJ-200,Air Canada Express
c06543,c-gmja,crj2,Canadair CRJ-200,Air Canada Express
c03d75,c-fxhc,crj2,Canadair CRJ-200,Voyageur Airways
c042ef,c-fzja,crj2,Canadair CRJ-200,Air Canada Express
c04e86,c-gdtd,crj2,Canadair Challenger 850,Flightexec
c0519b,c-gexm,crj2,Canadair CL-600-2B19 Regional,Avmax Group
c052bb,c-gfio,crj2,Canadair CRJ-200,Nav Canada
c0556b,c-ggja,crj2,Canadair CRJ-200,Air Canada Express
c067e7,c-gnja,crj2,Canadair CRJ-200,Air Canada Express
c06921,c-gnvc,crj2,Canadair CRJ-200,Nav Canada
c06a8b,c-goja,crj2,Canadair CRJ-200,Air Canada Express
c06fd3,c-gqja,crj2,Canadair CRJ-200,Air Canada Express
c0725d,c-gria,crj2,Canadair CRJ-200,R1 Airlines
c0764f,c-gsuw,crj2,Canadair Challenger 850,Private owner
c077bf,c-gtja,crj2,Canadair CRJ-200,Air Canada Express
c07a63,c-guja,crj2,Canadair CRJ-200,Air Canada Express
e07248,lv-gih,crj2,Canadair CRJ-200ER,Sol Lineas Aereas
e07249,lv-gii,crj2,Canadair CRJ-200ER,SOL Lineas Aereas
e0724a,lv-gij,crj2,Canadair CRJ-200ER,Sol Lineas Aereas
c0824f,c-gxja,crj2,Canadair CRJ-200,Air Canada Express
c08797,c-gzja,crj2,Canadair CRJ-200,Air Canada Express
e88024,zp-crn,crj2,Canadair CRJ-200ER,Amaszonas Paraguay
e9406c,cp-2969,crj2,Canadair CRJ-200LR,Linea Aerea Amaszonas
e9406b,cp-2908,crj2,Canadair CRJ-200LR,Linea Aerea Amaszonas
ac4f3f,n8921b,crj2,Canadair CRJ-200LR,Delta Connection
abef52,n8683b,crj2,Canadair CRJ-200,Endeavor Air
1506a1,ra-67233,crj2,Canadair Challenger 850,Private owner
ac3eb8,n8886a,crj2,Canadair CRJ-200LR,Delta Connection
345184,ec-mje,crj2,Canadair CRJ-200ER,Air Nostrum
ab437f,n825as,crj2,Canadair CRJ-200ER,United Express
e94065,cp-2715,crj2,Canadair CRJ-200LR,Amaszonas
ab79da,n839as,crj2,Canadair CRJ-200ER,Delta Connection
ac426f,n8896a,crj2,Canadair CRJ-200,Delta Connection
e94b23,cp-2851,crj2,Canadair CRJ-200ER,Boliviana de Aviacion
ac2c25,n8836a,crj2,Canadair CRJ200,Delta Connection
ac4229,n8894a,crj2,Canadair CRJ-200,Endeavor Air
ac3f01,n8888d,crj2,Canadair CRJ-200,Endeavor Air
7803a1,b-3011,crj2,Canadair CRJ-200,SR Jet
4852fe,ph-acq,crj2,Bombardier CRJ-200ER,SAMCO Aviation
e94066,cp-2733,crj2,Canadair CRJ-200LR,Amaszonas
e94067,cp-2742,crj2,Canadair CRJ-200LR,Amaszonas
ac15c3,n878tm,crj2,Canadair CRJ-200,US Bank
abf002,n8688c,crj2,,
ac2c49,n8837b,crj2,,
abff79,n872tm,crj2,Canadair CRJ-200,GECAS
abf32b,n8694a,crj2,Canadair CRJ-200,Endeavor Air
ac5033,n8928a,crj2,Canadair CRJ-200ER,Endeavor Air
ac16d4,n8783e,crj2,,
e94068,cp-2762,crj2,Canadair CRJ-200LR,Amaszonas
c01e29,c-flky,crj2,Canadair CRJ-200ER,Novajet
00c392,zs-zor,crj2,Canadair Challenger 850,Private owner
e9406a,cp-2867,crj2,Canadair CRJ-200LR,Amaszonas
28053d,n864jw,crj2,,
4d210f,9h-ily,crj2,Bombardier Challenger 850,VistaJet Malta
e94069,cp-2856,crj2,Canadair CRJ-200LR,Amaszonas
c021ce,c-fmuv,crj2,Canadair CRJ-200LR,United Nations
ac135f,n8775a,crj2,Bombardier CRJ-200LR,Delta Connection
ac4c7d,n8918b,crj2,Canadair CRJ-200ER,Endeavor Air
ac53a4,n8936a,crj2,Canadair CRJ-200LR,Delta Connection
ace9d8,n931ev,crj2,Bombardier CRJ-200ER,Delta Connection
c03de2,c-fxlh,crj2,Bombardier CRJ-200LR,United Nations
a6ef00,n546jb,crj2,Bombardier Challenger 850,Private owner
a9724b,n708ae,crj2,,
c02911,c-fpoi,crj2,Bombardier CRJ-200ER,Avmax Group
ac06e7,n874tm,crj2,Bombardier CRJ-200,Export Development Canada
4d2135,9h-you,crj2,Bombardier Challenger 850,Air X Charter
acf146,n933ev,crj2,Bombardier CRJ-200,ExpressJet Airlines
780362,b-3008,crj2,Bombardier CRJ-200ER,Jiangsu Jet
34160b,ec-mls,crj2,Canadair CRJ-200ER,Air Nostrum
780363,b-3009,crj2,Bombardier CRJ-200ER,Jiangsu Jet
3c712b,d-alik,crj2,Bombardier Challenger 850,Imperial Jet Europe
a919aa,n686br,crj2,Bombardier CRJ-200ER,ExpressJet Airlines
4d2110,9h-ilz,crj2,Bombardier Challenger 850,VistaJet Malta
43e944,m-hlan,crj2,Bombardier Challenger 850,TAG Aviation Asia
ac48c8,n8908d,crj2,Bombardier CRJ-200,Endeavor Air
ac575b,n8946a,crj2,Bombardier CRJ-200LR,Endeavor Air
a57606,n451ca,crj2,Bombardier CRJ-200,ExpressJet Airlines
adab9c,n980ev,crj2,Bombardier CRJ-200ER,Delta Connection
e90d0b,cx-sdu,crj2,Bombardier CRJ-200LR,Amaszonas Uruguay
4bd259,tc-try,crj2,Bombardier Challenger 850,Private owner
adaf53,n981ev,crj2,,
3452c6,ec-mnb,crj2,,
42497d,vq-bhi,crj2,Bombardier CRJ-200,Ak Bars Aero
a689bd,n520jg,crj2,,
780360,b-3020,crj2,,
ab351a,n821fl,crj2,,
04c171,5y-ssr,crj2,,
ad9a00,n976as,crj2,,
c06afa,c-gonh,crj2,,
4d2150,9h-amy,crj2,,
780007,b-3013,crj2,,
a82e06,n626rh,crj2,,
04c17b,5y-cgf,crj2,,
c03c69,c-fwwu,crj2,,
c05c32,c-gixt,crj2,,
04c0c2,5y-jlb,crj2,,
e94b24,cp-2852,crj2,,
aab611,n79ea,crj2,,
3403f8,n907ev,crj2,,
a1ad90,n207rw,crj2,,
a93d72,9n-ame,crj2,,
e8804c,zp-crr,crj2,,
008696,zs-cmf,crj2,,
4b9d10,tc-ghp,crj2,,
31c518,n819ay,crj2,,
e90d0f,cx-lva,crj2,,
3c5e41,d-agra,crj2,,
0d0a55,xa-mce,crj2,,
c03f2d,c-fxya,crj2,,
31cc3a,n8938a,crj2,,
c079cb,c-gude,crj2,,
350bd7,n930ev,crj2,,
780361,b-3007,crj2,,
341516,9n-ale,crj2,,
42497b,vq-bhg,crj2,,
a0ddea,n155mw,crj2,,
c03206,c-fsyn,crj2,,
a1b4fe,n209rw,crj2,,
31c244,n927ev,crj2,,
3547d7,n936sw,crj2,,
780da5,b-3370,crj2,,
424907,vq-bbv,crj2,,
7810df,b-3248,crj2,,
4247af,vp-cwy,crj2,,
35484b,n454sw,crj2,,
31c4bc,n8886a,crj2,,
31ca35,n8847a,crj2,,
3547e5,n461sw,crj2,,
3547b3,n455sw,crj2,,
31c506,n8837b,crj2,,
500108,t7-sla,crj2,,
008697,zs-cmg,crj2,,
31c535,n249ps,crj2,,
31c107,n8913a,crj2,,
31cfc2,n8888d,crj2,,
31c742,n8938a,crj2,,
31ce2f,n8924b,crj2,,
354614,n454sw,crj2,,
354f42,n498ca,crj2,,
354cff,n455sw,crj2,,
458a0f,oy-bpo,crj2,,
3505b7,n930ev,crj2,,
7810e0,b-3249,crj2,,
31cf88,n835ay,crj2,,
31cd10,n251ps,crj2,,
31ccee,n833ay,crj2,,
354a61,n460sw,crj2,,
a57b09,n452rh,crj2,,
350c30,n930ev,crj2,,
31c29e,n8908d,crj2,,
43ebef,2-avco,crj2,,
31cd82,n209ps,crj2,,
c03b31,c-fwku,crj2,,
3402ed,n465sw,crj2,,
a0d970,n154ea,crj2,,
728827,yi-bag,crj2,,
ab8418,n841fl,crj2,,
345557,ec-mqz,crj2,,
e8805e,zp-crs,crj2,,
31c10f,n230ps,crj2,,
683263,up-cj015,crj2,,
354169,n916ev,crj2,,
354c37,n452sw,crj2,,
354448,n8933b,crj2,,
354920,n431sw,crj2,,
354d48,n629br,crj2,,
354802,n914ev,crj2,,
354eb9,n863as,crj2,,
31c5da,n8836a,crj2,,
780e18,b-3367,crj2,,
350cb9,n947sw,crj2,,
354777,n907sw,crj2,,
350b89,n693br,crj2,,
800bed,vt-zoa,crj2,,
e8c077,ob-2130p,crj2,,
31c6c0,n229ps,crj2,,
ab0d9b,n811fl,crj2,,
800bee,vt-zob,crj2,,
abcfa8,n860jj,crj2,,
31ccf5,n229ps,crj2,,
e08455,lv-hqu,crj2,,
ab5c99,n831fl,crj2,,
70a9f3,9n-ame,crj2,,
35415c,n8982a,crj2,,
a3a3c4,n3333q,crj2,,
