icao,regid,mdl,type,operator
4b0bbd,hb-elp,s205,Siai-Marchetti S.205-20/R,Private owner
a7e13a,n60695,s205,SIAI-Marchetti S.205-20/R,Private owner
3d353e,d-eskk,s205,SIAI-Marchetti S-205-20/R,Private owner
