icao,regid,mdl,type,operator
7c5cd8,vh-smi,b214,Bell 214B-1,Private owner
506f41,h2-33,b214,Bell 412HP,Slovenia Air Force
a1d4d1,n217pj,b214,Bell 214B-1,McDermott Aviation
a1d11a,n216pj,b214,Bell 214B Big Lifter,Private owner
8980c8,p2-mbh,b214,,
