icao,regid,mdl,type,operator
3924a7,f-gjfh,p32t,Piper PA-32RT-300T,Private owner
400a9e,g-bfub,p32t,Piper PA-32RT-300,Private owner
402f34,g-brha,p32t,Piper PA32RT-300 Lance 2,Private Owner
458a99,oy-bty,p32t,Piper PA-32RT-300,
462969,oh-prt,p32t,Piper PA-32RT-300,Vampulan Siipiveikot
a00350,n10kv,p32t,Piper PA-32RT-300T,Private owner
a0ef77,n16bj,p32t,Piper PA-32RT-300T,Private owner
a1000b,n1636p,p32t,Piper PA-32RT-300T,Private owner
a102f0,n1640p,p32t,Piper PA-32RT-300T,Private owner
a08a47,n134ch,p32t,Piper PA-32RT-300T,Private owner
a0a0b7,n14dw,p32t,Piper PA-32RT-300T,Private owner
a15b43,n187g,p32t,Piper PA-32RT-300T,Private owner
a1671c,n19pe,p32t,,
a16d6d,n191rv,p32t,Piper PA-32RT-300T,Private owner
a1336c,n177cm,p32t,Piper PA-32RT-300T,Private owner
a1bc22,n2102b,p32t,,
a1bc40,n21027,p32t,Piper PA-32RT-300T,Private owner
a1bc8b,n2105b,p32t,Piper PA-32RT-300T,Private owner
a1c042,n2115b,p32t,Piper PA-32RT-300T,Private owner
a1c484,n2129a,p32t,Piper PA-32RT-300T,Private owner
a1c73e,n21313,p32t,Piper PA-32RT-300T,Private owner
a1c7cd,n21356,p32t,Piper PA-32RT-300T,Private owner
a1c7ce,n21357,p32t,Piper PA-32RT-300T,Private owner
a1c81d,n2138f,p32t,Piper PA-32RT-300T,Private owner
a1c821,n2138k,p32t,Piper PA-32RT-300T,Private owner
a18e6c,n2mh,p32t,Piper PA-32RT-300T,Private owner
a1cb21,n2143b,p32t,Piper PA-32RT-300T,Private owner
a1cb3d,n21435,p32t,Piper PA-32RT-300T,Private owner
a1cb3e,n21436,p32t,Piper PA-32RT-300T,Private owner
a1cb87,n21459,p32t,Piper PA-32RT-300T,Private owner
a1cbaa,n21469,p32t,Piper PA-32RT-300T,Private owner
a1cbd0,n2148b,p32t,Piper PA-32RT-300T,Private owner
a1cee3,n2153n,p32t,Piper PA-32RT-300T,Private owner
a1d600,n2171b,p32t,Piper PA-32RT-300T,Private owner
a1d623,n2172b,p32t,Piper PA-32RT-300T,Private owner
a1d68b,n2175a,p32t,Piper PA-32RT-300T,Private owner
a1d6c1,n2176v,p32t,Piper PA-32RT-300T,Private owner
a1da4b,n2185k,p32t,Piper PA-32RT-300,Private owner
a1daef,n21899,p32t,Piper PA-32RT-300T,Private owner
a1afad,n2079x,p32t,Piper PA-32RT-300T,Private owner
a1b309,n2087a,p32t,Piper PA-32RT-300T,Private owner
a1b69d,n2096a,p32t,,
a1e124,n220bk,p32t,Piper PA-32RT-300,Private owner
a22dc0,n24ba,p32t,Piper PA-32RT-300T,Private owner
a1e753,n22117,p32t,Piper PA-32RT-300T,Private owner
a1e798,n22136,p32t,Piper PA-32RT-300T,Private owner
a1eb06,n22213,p32t,Piper PA-32RT-300T,Private owner
a1f2a4,n2243f,p32t,Piper PA-32RT-300T,Private owner
a1f2fd,n22450,p32t,Piper PA-32RT-300T,Private owner
a334f2,n3055f,p32t,Piper PA-32RT-300T,Private owner
a338a5,n3065b,p32t,Piper PA-32RT-300T,Private owner
a33ccf,n3078m,p32t,Piper PA-32RT-300T,Private owner
a377b2,n322w,p32t,Piper PA-32RT-300T,Private owner
a32672,n30173,p32t,Piper PA-32RT-300T,Private owner
a326a6,n3019k,p32t,,
a329d2,n3025l,p32t,Piper PA-32RT-300T,Private owner
a329d4,n3025n,p32t,Piper PA-32RT-300T,Private owner
a329e3,n30253,p32t,Piper PA-32RT-300T,Private owner
a329ed,n3026c,p32t,Piper PA-32RT-300T,Private owner
a32a31,n3028a,p32t,Piper PA-32RT-300T,Private owner
a32a5e,n3029l,p32t,Piper PA-32RT-300T,Private owner
a330a5,n30406,p32t,Piper PA-32RT-300T,Private owner
a3956c,n33wb,p32t,Piper PA-32RT-300T,Private owner
a396e5,n330mc,p32t,Piper PA-32RT-300T,Private owner
a33441,n3050d,p32t,Piper PA-32RT-300T,Private owner
a3536f,n313rb,p32t,Piper PA-32RT-300T,Private owner
a365d8,n318pk,p32t,Piper PA-32RT-300T,Private owner
a36b84,n31961,p32t,Piper PA-32RT-300T,Private owner
a36bca,n31981,p32t,Piper PA32RT-300T,Private owner
a494ec,n39464,p32t,Piper PA-32RT-300T,Private owner
a49537,n39489,p32t,Piper PA-32RT-300T,Private owner
a497d3,n39506,p32t,Piper PA-32RT-300T,Private owner
a49818,n39525,p32t,Piper PA-32RT-300T,Private owner
a49819,n39526,p32t,Piper PA-32RT-300T,Private owner
a498c9,n39577,p32t,Piper PA-32RT-300T,Private owner
a49bb0,n39619,p32t,Piper PA-32RT-300T,Private owner
a49bd2,n39628,p32t,Piper PA-32RT-300T,Private owner
a49bf6,n39639,p32t,Piper PA-32RT-300T,Private owner
a49c33,n39650,p32t,Piper PA-32RT-300T,Private owner
a49c7c,n39673,p32t,Piper PA-32RT-300T,Private owner
a49ca2,n39686,p32t,Piper PA-32RT-300T,Private owner
a49f41,n39706,p32t,Piper PA-32RT-300T,Private owner
a49f42,n39707,p32t,Piper PA-32RT-300T,Private owner
a49f67,n39719,p32t,Piper PA-32RT-300T,Private owner
a49fcb,n39744,p32t,Piper PA-32RT-300T,Private owner
a4a033,n39773,p32t,Piper PA-32RT-300T,Private owner
a4a6f0,n39921,p32t,Piper PA-32RT-300T,Private owner
a4a739,n39944,p32t,Piper PA-32RT-300T,Private owner
a412c3,n36129,p32t,Piper PA-32RT-300 Turbo Lance,Private owner
a4162c,n36201,p32t,Piper PA-32RT-300T,Private owner
a41b25,n36398,p32t,Piper PA-32RT-300,Private owner
a41d9a,n36401,p32t,,
a41d9b,n36402,p32t,Piper PA-32RT-300T,Private owner
a42199,n36523,p32t,Piper PA-32RT-300T,Private owner
a4219b,n36525,p32t,Piper PA-32RT-300T,Private owner
a4226a,n36582,p32t,Piper PA-32RT-300T,Private owner
a42645,n36693,p32t,Piper PA-32RT-300T,Private owner
a553c0,n442tm,p32t,Piper PA-32RT-300T,Private owner
a55862,n4432b,p32t,Piper PA-32RT-300T,Private owner
a5bbdd,n469jl,p32t,Piper PA-32RT-300T,Private owner
a52ae5,n432dp,p32t,Piper PA-32R-300T,Private owner
a63b0c,n500mj,p32t,Piper PA-32RT-300T,Private owner
a6a6ed,n528cw,p32t,Piper PA-32RT-300,Private owner
a84915,n633cb,p32t,Piper PA-32RT-300T,Private owner
a825c1,n624gt,p32t,Piper PA-32RT-300T,Private owner
a8fb21,n678th,p32t,Piper PA-32RT-300T,Private owner
a993e9,n716sb,p32t,Piper PA-32RT-300T,Private owner
a99b26,n718qc,p32t,,
aa49ca,n762jm,p32t,Piper PA-32RT-300T,Private owner
aa7209,n772sd,p32t,Piper PA-32RT-300T,Private owner
aa8e99,n78eh,p32t,Piper PA-32RT-300T,Private owner
aa8ec5,n78gb,p32t,Piper PA-32RT-300T,Private owner
ab26c1,n8177y,p32t,,
ab5033,n828sr,p32t,Piper PA-32RT-300T,Private owner
aaaf09,n788jc,p32t,Piper PA-32RT-300T,Private owner
ab8586,n841wb,p32t,Piper PA-32RT-300T,Private owner
abe35f,n865wa,p32t,Piper PA-32RT-300,Private owner
ad5149,n9572c,p32t,,
adf44e,n999ck,p32t,Piper PA-32RT-300T,Private owner
ad0b6b,n94gf,p32t,Piper PA-32RT-300 Lance,Private owner
ad190d,n943hs,p32t,Piper PA-32RT-300T,Private owner
ada841,n9796c,p32t,Piper PA-32RT-300,Private owner
c056fd,c-ggym,p32t,Piper PA-32RT-300T,Private owner
a329ee,n3026d,p32t,Piper PA-32RT-300T,Private owner
a32a16,n3027j,p32t,Piper PA-32RT-300T,Private owner
a1cc13,n21499,p32t,Piper PA-32RT-300T,Private owner
aa8f50,n78mr,p32t,Piper PA-32RT-300T,Private owner
a42204,n36555,p32t,Piper PA-32RT-300,Private owner
a32dde,n30371,p32t,Piper PA-32RT-300T,Private owner
a1d6fa,n2178g,p32t,Piper PA-32RT-300T,Private owner
a31ad9,n3cg,p32t,Piper PA-32RT-300T,Private owner
a2a4bb,n27gb,p32t,Piper PA-32RT-300,Asterix Aviation
a1bbdb,n2100a,p32t,Piper PA-32RT-300T,Private owner
a32233,n30037,p32t,Piper PA-32RT-300T,Private owner
a329a8,n3024d,p32t,Piper PA-32RT-300T,Private owner
401214,g-ojcw,p32t,Piper PA32RT-300 Lance 2,Private owner
a42c7d,n36808,p32t,Piper PA-32RT-300T,Private owner
a51acf,n428ra,p32t,Piper PA-32RT-300T,Private owner
a6d5b3,n54bg,p32t,Piper PA-32RT-300T,Private owner
a793ca,n588bs,p32t,Piper PA-32RT-300T,Private owner
a1d641,n21727,p32t,Piper PA-32RT-300T,Private owner
a49b87,n39603,p32t,Piper PA-32RT-300T,Private owner
a4f718,n419rt,p32t,Piper PA-32RT-300T,Private owner
a1dae8,n21892,p32t,Piper PA-32RT-300T,Private owner
3924b0,f-gjfq,p32t,Piper PA-32RT-300T,Private owner
a4292a,n36733,p32t,Piper PA-32RT-300T,Private owner
a35f95,n31609,p32t,Piper PA-32RT-300,Private owner
a1ec20,n22295,p32t,Piper PA-32RT-300T,Private owner
a1f32b,n2247a,p32t,Piper PA-32RT-300T,Private owner
ace52d,n93vb,p32t,Piper PA-32RT-300T,Private owner
a1af76,n2078b,p32t,Piper PA-32RT-300T,Private owner
a1f2e5,n2245a,p32t,Piper PA-32RT-300T,Private owner
a49cc3,n39694,p32t,,
a36af7,n31920,p32t,Piper PA-32RT-300T,Private owner
a082d9,n132ch,p32t,Piper PA-32RT-300T,Private owner
a421e2,n36546,p32t,,
a6e3b8,n543gs,p32t,Piper PA-32RT-300T,Private owner
a416ff,n36262,p32t,,
a33941,n3069t,p32t,Piper PA-32RT-300T,Private owner
a49c56,n39660,p32t,Piper PA-32RT-300T,Private owner
ad225c,n9452c,p32t,Piper PA-32RT-300T,Private owner
a49c3c,n39659,p32t,Piper PA-32RT-300T,Private owner
a1cf6f,n2157n,p32t,Piper PA-32RT-300T,Private owner
a1bfd8,n2112a,p32t,Piper PA-32RT-300T,Private owner
a33c6a,n3075r,p32t,Piper PA-32RT-300T,Private owner
a331cb,n3049k,p32t,Piper PA-32RT-300T,Private owner
a8ce74,n667ch,p32t,Piper PA-32RT-300T,Private owner
a41323,n36150,p32t,,
402248,g-nroy,p32t,Piper PA-32RT-300,Private owner
a1e3c0,n22028,p32t,Piper PA-32RT-300T,Private owner
a1ef74,n2237a,p32t,Piper PA-32RT-300T,Private owner
a79ccd,n59tx,p32t,,
7c7593,vh-xid,p32t,,
a32cd8,n3030j,p32t,,
7c3a27,vh-lrt,p32t,,
a32cf3,n3031a,p32t,,
a343e7,n30956,p32t,,
a88620,n6486c,p32t,,
a36b1e,n31934,p32t,,
404175,g-sawi,p32t,,
a1c34a,n2120b,p32t,,
a1da1a,n21836,p32t,,
a7c77a,n600cj,p32t,,
ac44dd,n89vg,p32t,,
a35ccd,n31573,p32t,,
ab0dba,n811gs,p32t,,
a2ccfb,n28pv,p32t,,
a4176d,n36297,p32t,,
abbf35,n856sc,p32t,,
a1bc77,n2104s,p32t,,
a2b2bd,n273mj,p32t,,
a06f95,n127vg,p32t,,
a1bc31,n2102s,p32t,,
39d1e4,f-hupe,p32t,,
a42270,n36588,p32t,,
a394cc,n33ps,p32t,,
a3392e,n30689,p32t,,
a3214b,n300we,p32t,,
a52d13,n4321m,p32t,,
a1e80a,n2217e,p32t,,
aae392,n800tm,p32t,,
a1e5ce,n221mc,p32t,,
a4987d,n39551,p32t,,
a3263e,n3016l,p32t,,
ac1d7e,n88wp,p32t,,
ad632d,n9617c,p32t,,
7c5bc0,vh-seq,p32t,,
a11bad,n1701e,p32t,,
a36bf2,n31996,p32t,,
ad4624,n9542c,p32t,,
a7ee65,n61wm,p32t,,
a1d31a,n2167a,p32t,,
a429d7,n36781,p32t,,
a7c4c7,n6yv,p32t,,
a4176b,n36295,p32t,,
a35d13,n31593,p32t,,
a1cefe,n2154e,p32t,,
a49514,n39479,p32t,,
a81add,n621kh,p32t,,
ad133a,n9410c,p32t,,
a7614a,n575dc,p32t,,
a008c6,n101dr,p32t,,
ad3bf4,n9519c,p32t,,
a9201f,n6874c,p32t,,
a004b9,n100ae,p32t,,
a3fb70,n356dp,p32t,,
acbc3e,n92ej,p32t,,
adf525,n999m,p32t,,
a3296b,n3022n,p32t,,
a345ef,n31r,p32t,,
a4983f,n39539,p32t,,
a1de9f,n21992,p32t,,
a3ebba,n3516m,p32t,,
a49c37,n39654,p32t,,
aad243,n797cl,p32t,,
a36cac,n32hf,p32t,,
a3605f,n31661,p32t,,
a2569f,n25rc,p32t,,
ac5823,n895ck,p32t,,
a1e362,n2200j,p32t,,
a501f5,n4212a,p32t,,
a49feb,n39751,p32t,,
aa720c,n772sg,p32t,,
7c3311,vh-kdf,p32t,,
a321ca,n30007,p32t,,
a67c8f,n517mm,p32t,,
a334d1,n3054h,p32t,,
a07c12,n130k,p32t,,
a1eeaa,n2231j,p32t,,
406fb0,g-cizi,p32t,,
a1e416,n2205p,p32t,,
a02e37,n110wr,p32t,,
a4162d,n36202,p32t,,
a363b5,n31739,p32t,,
a721b0,n559jp,p32t,,
a6d734,n54ss,p32t,,
7c70ce,vh-wkg,p32t,,
a497d0,n39503,p32t,,
a331e2,n30498,p32t,,
ada2e5,n978rs,p32t,,
aa94db,n781gh,p32t,,
ab2ee8,n82eb,p32t,,
a42927,n36730,p32t,,
a9d05e,n731sm,p32t,,
a321c8,n30005,p32t,,
a26e1f,n256dm,p32t,,
a322bc,n30074,p32t,,
a1ce6f,n2150b,p32t,,
a66cdb,n513cw,p32t,,
ab2c5d,n819sb,p32t,,
a37302,n321la,p32t,,
a2df39,n2840k,p32t,,
ad066b,n9385c,p32t,,
a19399,n200sf,p32t,,
7c0b05,vh-cgn,p32t,,
a1da48,n2185g,p32t,,
a1e7a2,n2214f,p32t,,
a82774,n6240c,p32t,,
a713d5,n555uw,p32t,,
a41309,n36149,p32t,,
a1da22,n2184d,p32t,,
a4b1f3,n401sl,p32t,,
a36d80,n32rt,p32t,,
a1c43e,n2127a,p32t,,
adb7e9,n983sr,p32t,,
a3601a,n31642,p32t,,
a1f27a,n22419,p32t,,
a1dd4b,n2190b,p32t,,
a49c17,n39647,p32t,,
a0b208,n144ez,p32t,,
a15ff9,n188se,p32t,,
a7f474,n611wl,p32t,,
a1e9c2,n222pp,p32t,,
a1b664,n2094p,p32t,,
a413b3,n36194,p32t,,
a32675,n30176,p32t,,
a33102,n3043u,p32t,,
a96f6c,n707jw,p32t,,
a329c2,n30245,p32t,,
a497f7,n39517,p32t,,
a1cbdb,n2148n,p32t,,
ad7954,n9676c,p32t,,
a52bbb,n432nc,p32t,,
