icao,regid,mdl,type,operator
a0c619,n149wf,ch65,Amateur Zodiac CH-650,Private owner
a88aa5,n65ct,ch65,,
a88d43,n650fm,ch65,Amateur Zodiac CH-650,Private owner
a015e7,n104zz,ch65,Amateur Zodiac CH-650B,Private owner
a80e21,n618tb,ch65,,
a247c9,n246rj,ch65,,
