icao,regid,mdl,type,operator
0099b5,zs-jsm,js41,BAe Jetstream 41,Private owner
00a424,zs-nrf,js41,BAe Jetstream 41,Airlink
00a425,zs-nrg,js41,BAe Jetstream 41,Airlink
00a426,zs-nrh,js41,BAe Jetstream 41,Airlink
00a427,zs-nri,js41,BAe Jetstream 41,Airlink
00a588,zs-oex,js41,BAe Jetstream 41,Airlink
00a646,zs-omf,js41,BAe Jetstream 41,Airlink
3982a3,f-havd,js41,BAe Jetstream 4100,AVDEF-Aviation Defence Service
3982a5,f-havf,js41,BAe Jetstream 41,AVDEF-Aviation Defence Service
400e07,g-majt,js41,BAe Jetstream 41,Eastern Airways
400ec2,g-maju,js41,BAe Jetstream 41,Eastern Airways
400f22,g-majw,js41,BAe Jetstream 41,Eastern Airways
400f26,g-majz,js41,BAe Jetstream 41,Eastern Airways
400f46,g-majy,js41,BAe Jetstream 41,Eastern Airways
400983,g-maja,js41,BAe Jetstream 41,Eastern Airways
400984,g-majb,js41,BAe Jetstream 41,Eastern Airways
400985,g-majc,js41,BAe Jetstream 41,Eastern Airways
400986,g-majd,js41,BAe Jetstream 41,Eastern Airways
400987,g-maje,js41,BAe Jetstream 41,Eastern Airways
400989,g-majg,js41,BAe Jetstream 41,Eastern Airways
40098a,g-majh,js41,BAe Jetstream 41,Eastern Airways
40098b,g-maji,js41,BAe Jetstream 41,Eastern Airways
40098d,g-majk,js41,BAe Jetstream 41,Eastern Airways
40098e,g-majl,js41,BAe Jetstream 41,Eastern Airways
46c9e4,sx-rod,js41,BAe Jetstream 41,Sky Express
46cca8,sx-seh,js41,BAe Jetstream 41,Sky Express
78017a,b-hrs,js41,BAe Jetstream 41,Government Flying Service of H
78017b,b-hrt,js41,BAe Jetstream 41,Government Flying Service of H
a382aa,n325ue,js41,BAe Jetstream 41,Private owner
a36a07,n319ue,js41,BAe Jetstream 41,Private owner
a37017,n320ue,js41,BAe Jetstream 41,Private owner
a7367f,n564hk,js41,,
00a428,zs-nrj,js41,BAe Jetstream 41,Airlink
40098c,g-majj,js41,BAe Jetstream 41,Eastern Airways
0ac12d,hk-4775,js41,BAe Jetstream 41,Easyfly
0ac0ae,hk-4551,js41,BAe Jetstream 41,EasyFly
00a3dd,zs-nom,js41,BAe Jetstream 41,Private owner
00a423,zs-nre,js41,BAe Jetstream 41,Airlink
0ac130,hk-4786-x,js41,BAe Jetstream 41,Easyfly
00a653,zs-oms,js41,BAe Jetstream 41,Airlink
0ac0a6,hk-4522,js41,,
0ac0a2,hk-4502,js41,,
70aeae,9n-ajc,js41,,
70a979,9n-ahw,js41,,
70a00d,9n-aih,js41,,
7c7649,vh-xnf,js41,,
70a975,9n-ahy,js41,,
70a97c,9n-ahu,js41,,
70a96f,9n-ahv,js41,,
758244,rp-c8299,js41,,
0ac156,hk-4867,js41,,
a4f95c,n42ax,js41,,
