icao,regid,mdl,type,operator
401305,g-cewl,pnr2,Amateur Pioneer 200,Private owner
406348,g-cgli,pnr2,Pioneer 200-M,Private owner
406bb3,g-pccm,pnr2,Pioneer 200-M,Private owner
3feda0,d-mmjm,pnr2,,
31d818,i-6594,pnr2,,
394bfc,f-jrsa,pnr2,,
