icao,regid,mdl,type,operator
06a142,a7-apa,a388,Airbus A380-861,Qatar Airways
06a143,a7-apb,a388,Airbus A380-861,Qatar Airways
06a144,a7-apc,a388,Airbus A380-861,Qatar Airways
06a145,a7-apd,a388,Airbus A380-861,Qatar Airways
06a146,a7-ape,a388,Airbus A380-861,Qatar Airways
06a147,a7-apf,a388,Airbus A380-861,Qatar Airways
38105a,f-wwdd,a388,Airbus A380-841,Airbus
38379a,f-wwss,a388,Airbus A380,Airbus
3837ba,f-wwst,a388,Airbus A380-8,Airbus
383e7a,f-wwow,a388,Airbus A380-841,Airbus
383efa,f-wwse,a388,Airbus A380,Airbus
383f3a,f-wwsg,a388,Airbus A380,Airbus
383f9a,f-wwsj,a388,Airbus A380,Airbus
383fba,f-wwsk,a388,Airbus A380,Airbus
383fda,f-wwsl,a388,Airbus A380-8,Airbus
383ffa,f-wwsm,a388,Airbus A380,Airbus
38403a,f-wwso,a388,Airbus A380,Airbus
38407a,f-wwsa,a388,Airbus A380-8,Airbus
3840ba,f-wwsv,a388,Airbus A380,Airbus
3840da,f-wwsx,a388,Airbus A380,Airbus
3840fa,f-wwsy,a388,Airbus A380,Airbus
38413a,f-wwsb,a388,Airbus A380-,Airbus
3807fa,f-wwae,a388,Airbus A380,Airbus
3808fa,f-wwan,a388,Airbus A380,Airbus
38091a,f-wwao,a388,Airbus A380,Airbus
38093a,f-wwap,a388,Airbus A380-800,Airbus
38095a,f-wwaq,a388,Airbus A380,Airbus
38097a,f-wwar,a388,Airbus A380,Airbus
38099a,f-wwat,a388,Airbus A380,Airbus
3c65a1,d-aima,a388,Airbus A380-841,Lufthansa
3c65a2,d-aimb,a388,Airbus A380-841,Lufthansa
3c65a3,d-aimc,a388,Airbus A380-841,Lufthansa
3c65a4,d-aimd,a388,Airbus A380-841,Lufthansa
3c65a5,d-aime,a388,Airbus A380-841,Lufthansa
3c65a6,d-aimf,a388,Airbus A380-841,Lufthansa
3c65a7,d-aimg,a388,Airbus A380-841,Lufthansa
3c65a8,d-aimh,a388,Airbus A380-841,Lufthansa
3c65a9,d-aimi,a388,Airbus A380-841,Lufthansa
3c65aa,d-aimj,a388,Airbus A380-841,Lufthansa
3c65ab,d-aimk,a388,Airbus A380-841,Lufthansa
3c65ac,d-aiml,a388,Airbus A380-841,Lufthansa
3c65ad,d-aimm,a388,Airbus A380-841,Lufthansa
3c65ae,d-aimn,a388,Airbus A380-841,Lufthansa
39bd20,f-hpja,a388,Airbus A380-861,Air France
39bd21,f-hpjb,a388,Airbus A380-861,Air France
39bd22,f-hpjc,a388,Airbus A380-861,Air France
39bd23,f-hpjd,a388,Airbus A380-861,Air France
39bd24,f-hpje,a388,Airbus A380-861,Air France
39bd25,f-hpjf,a388,Airbus A380-861,Air France
39bd26,f-hpjg,a388,Airbus A380-861,Air France
39bd27,f-hpjh,a388,Airbus A380-861,Air France
39bd28,f-hpji,a388,Airbus A380-861,Air France
39bd29,f-hpjj,a388,Airbus A380-861,Air France
40688b,g-xlea,a388,Airbus A380-841,British Airways
40688c,g-xleb,a388,Airbus A380-841,British Airways
40688d,g-xlec,a388,Airbus A380-841,British Airways
406a03,g-xled,a388,Airbus A380-841,British Airways
406a04,g-xlee,a388,Airbus A380-841,British Airways Â
406a05,g-xlef,a388,Airbus A380-841,British Airways
406b20,g-xleg,a388,Airbus A380-841,British Airways
406b21,g-xleh,a388,Airbus A380-841,British Airways
406b22,g-xlei,a388,Airbus A380-841,British Airways
406d1a,g-xlej,a388,Airbus A380-841,British Airwyas
71be11,hl7611,a388,Airbus A380-861,Korean Air
71be12,hl7612,a388,Airbus A380-861,Korean Air
71be13,hl7613,a388,Airbus A380-861,Korean Air
71be14,hl7614,a388,Airbus A380-861,Korean Air
71be15,hl7615,a388,Airbus A380-861,Korean Air
71be19,hl7619,a388,Airbus A380-861,Korean Air
71be21,hl7621,a388,Airbus A380-861,Korean Air
71be22,hl7622,a388,Airbus A380-861,Korean Air
71be25,hl7625,a388,Airbus A380-841,Asiana Airlines
71be26,hl7626,a388,Airbus A380-841,Asiana Airlines
71be27,hl7627,a388,Airbus A380-861,Korean Air
71be28,hl7628,a388,Airbus A380-861,Korean Air
76cd61,9v-ska,a388,Airbus A380-841,Singapore Airlines
76cd62,9v-skb,a388,Airbus A380-841,Singapore Airlines
76cd63,9v-skc,a388,Airbus A380-841,Singapore Airlines
76cd64,9v-skd,a388,Airbus A380-841,Singapore Airlines
76cd65,9v-ske,a388,Airbus A380-841,Singapore Airlines
76cd66,9v-skf,a388,Airbus A380-841,Singapore Airlines
76cd67,9v-skg,a388,Airbus A380-841,Singapore Airlines
76cd68,9v-skh,a388,Airbus A380-841,Singapore Airlines
76cd69,9v-ski,a388,Airbus A380-841,Singapore Airlines
76cd6a,9v-skj,a388,Airbus A380-841,Singapore Airlines
76cd6b,9v-skk,a388,Airbus A380-841,Singapore Airlines
76cd6c,9v-skl,a388,Airbus A380-841,Singapore Airlines
76cd6d,9v-skm,a388,Airbus A380-841,Singapore Airlines
76cd6e,9v-skn,a388,Airbus A380-841,Singapore Airlines
76cd70,9v-skp,a388,Airbus A380-841,Singapore Airlines
76cd71,9v-skq,a388,Airbus A380-841,Singapore Airlines
76cd72,9v-skr,a388,Airbus A380-841,Singapore Airlines
76cd73,9v-sks,a388,Airbus A380-841,Singapore Airlines
76cd74,9v-skt,a388,Airbus A380-861,Singapore Airlines
71be34,hl7634,a388,Airbus A380-841,Asiana Airlines
71be35,hl7635,a388,Airbus A380-841,Asiana Airlines
780736,b-6136,a388,Airbus A380-841,China Southern Airlines
780737,b-6137,a388,Airbus A380-841,China Southern Airlines
75028e,9m-mna,a388,Airbus A380-841,Malaysia Airlines
75028f,9m-mnb,a388,Airbus A380-841,Malaysia Airlines
750290,9m-mnc,a388,Airbus A380-841,Malaysia Airlines
750291,9m-mnd,a388,Airbus A380-841,Malaysia Airlines
750292,9m-mne,a388,Airbus A380-841,Malaysia Airlines
750293,9m-mnf,a388,Airbus A380-841,Malaysia Airlines
7807bc,b-6138,a388,Airbus A380-841,China Southern Airlines
7808b0,b-6139,a388,Airbus A380-841,China Southern Airlines
780994,b-6140,a388,Airbus A380-841,China Southern Airlines
7c4920,vh-oqa,a388,Airbus A380-842,Qantas
7c4921,vh-oqb,a388,Airbus A380-842,Qantas
7c4922,vh-oqc,a388,Airbus A380-842,Qantas
7c4923,vh-oqd,a388,Airbus A380-842,Qantas
7c4924,vh-oqe,a388,Airbus A380-842,Qantas
7c4925,vh-oqf,a388,Airbus A380-842,Qantas
7c4926,vh-oqg,a388,Airbus A380-842,Qantas
7c4927,vh-oqh,a388,Airbus A380-842,Qantas
7c4928,vh-oqi,a388,Airbus A380-842,Qantas
7c4929,vh-oqj,a388,Airbus A380-842,Qantas
7c492a,vh-oqk,a388,Airbus A380-842,Qantas
7c492b,vh-oql,a388,Airbus A380-842,Qantas
8960e2,a6-eda,a388,Airbus A380-861,Emirates
8960e3,a6-edb,a388,Airbus A380-861,Emirates
8960e4,a6-edc,a388,Airbus A380-861,Emirates
8960e5,a6-edd,a388,Airbus A380-861,Emirates
8960e6,a6-ede,a388,Airbus A380-861,Emirates
8960e7,a6-edf,a388,Airbus A380-861,Emirates
8960e8,a6-edg,a388,Airbus A380-861,Emirates
8960e9,a6-edh,a388,Airbus A380-861,Emirates
8960ea,a6-edi,a388,Airbus A380-861,Emirates
8960eb,a6-edj,a388,Airbus A380-861,Emirates
8960ec,a6-edk,a388,Airbus A380-861,Emirates
8960ed,a6-edl,a388,Airbus A380-861,Emirates
8960ee,a6-edm,a388,Airbus A380-861,Emirates
8960ef,a6-edn,a388,Airbus A380-861,Emirates
8960f0,a6-edo,a388,Airbus A380-861,Emirates
8960f1,a6-edp,a388,Airbus A380-861,Emirates
8960f2,a6-edq,a388,Airbus A380-861,Emirates
8960f3,a6-edr,a388,Airbus A380-861,Emirates
8960f4,a6-eds,a388,Airbus A380-861,Emirates
8960f5,a6-edt,a388,Airbus A380-861,Emirates
8960f6,a6-edu,a388,Airbus A380-861,Emirates
8960f7,a6-edv,a388,Airbus A380-861,Emirates
8960f8,a6-edw,a388,Airbus A380-861,Emirates
8960f9,a6-edx,a388,Airbus A380-861,Emirates
8960fa,a6-edy,a388,Airbus A380-861,Emirates
8960fb,a6-edz,a388,Airbus A380-861,Emirates
896180,a6-eea,a388,Airbus A380-861,Emirates
896181,a6-eeb,a388,Airbus A380-861,Emirates
896182,a6-eec,a388,Airbus A380-861,Emirates
896183,a6-eed,a388,Airbus A380-861,Emirates
896184,a6-eee,a388,Airbus A380-861,Emirates
896185,a6-eef,a388,Airbus A380-861,Emirates
896186,a6-eeg,a388,Airbus A380-861,Emirates
896187,a6-eeh,a388,Airbus A380-861,Emirates
896188,a6-eei,a388,Airbus A380-861,Emirates
896189,a6-eej,a388,Airbus A380-861,Emirates
89618a,a6-eek,a388,Airbus A380-861,Emirates
89618b,a6-eel,a388,Airbus A380-861,Emirates
89618c,a6-eem,a388,Airbus A380-861,Emirates
89618d,a6-een,a388,Airbus A380-861,Emirates
89618e,a6-eeo,a388,Airbus A380-861,Emirates
89618f,a6-eep,a388,Airbus A380-861,Emirates
896190,a6-eeq,a388,Airbus A380-861,Emirates
896191,a6-eer,a388,Airbus A380-861,Emirates
896192,a6-ees,a388,Airbus A380-861,Emirates
896193,a6-eet,a388,Airbus A380-861,Emirates
896194,a6-eeu,a388,Airbus A380-861,Emirates
896195,a6-eev,a388,Airbus A380-861,Emirates
896196,a6-eew,a388,Airbus A380-861,Emirates
896197,a6-eex,a388,Airbus A380-861,Emirates
896198,a6-eey,a388,Airbus A380-861,Emirates
896199,a6-eez,a388,Airbus A380-861,Emirates
89639a,a6-eoa,a388,Airbus A380-861,Emirates
89639b,a6-eob,a388,Airbus A380-861,Emirates
89639c,a6-eoc,a388,Airbus A380-861,Emirates
89639d,a6-eod,a388,Airbus A380-861,Emirates
89639e,a6-eoe,a388,Airbus A380-861,Emirates
89639f,a6-eof,a388,Airbus A380-861,Emirates
8963cd,a6-apa,a388,Airbus A380-861,Etihad Airways
8963e4,a6-eog,a388,Airbus A380-861,Emirates
8963e5,a6-eoh,a388,Airbus A380-861,Emirates
8963e6,a6-eoi,a388,Airbus A380-861,Emirates
8963e7,a6-eoj,a388,Airbus A380-861,Emirates
8963e8,a6-eok,a388,Airbus A380-861,Emirates
8963e9,a6-eol,a388,Airbus A380-861,Emirates
8963ea,a6-eom,a388,Airbus A380-861,Emirates
8963eb,a6-eon,a388,Airbus A380-861,Emirates
8963ec,a6-eoo,a388,Airbus A380-861,Emirates
8963ed,a6-eop,a388,Airbus A380-861,Emirates
8963ee,a6-eoq,a388,Airbus A380-861,Emirates
8963ef,a6-eor,a388,Airbus A380-861,Emirates
8963f0,a6-eos,a388,Airbus A380-861,Emirates
8963f1,a6-eot,a388,Airbus A380-861,Emirates
896405,a6-apb,a388,Airbus A380-861,Etihad Airways
896406,a6-apc,a388,Airbus A380-861,Etihad Airways
896407,a6-apd,a388,Airbus A380-861,Etihad Airways
896439,a6-ape,a388,Airbus A380-861,Etihad Airways
8852a1,hs-tua,a388,Airbus A380-841,Thai Airways
8852a2,hs-tub,a388,Airbus A380-841,Thai Airways
8852a3,hs-tuc,a388,Airbus A380-841,Thai Airways
8852a4,hs-tud,a388,Airbus A380-841,Thai Airways
8852a5,hs-tue,a388,Airbus A380-841,Thai Airways
8852a6,hs-tuf,a388,Airbus A380-841,Thai Airways
3c439d,g-xlec,a388,Airbus A380-841,British Airways
406ec9,g-xlek,a388,Airbus A380-841,British Airways
38411a,f-wwsz,a388,Airbus A380,Airbus
8963f2,a6-eou,a388,Airbus A380-861,Emirates
38087a,f-wwaj,a388,Airbus A380,Airbus
8963f3,a6-eov,a388,Airbus A380-861,Emirates
3808ba,f-wwal,a388,Airbus A380,Airbus
3808da,f-wwam,a388,Airbus A380,Airbus
3809ba,f-wwau,a388,Airbus A380,Airbus
896461,a6-apf,a388,Airbus A380-861,Etihad Airways
3809da,f-wwav,a388,Airbus A380,Airbus
3807ba,f-wwab,a388,Airbus A380,Airbus
8963f4,a6-eow,a388,Airbus A380-861,Emirates
3807da,f-wwad,a388,Airbus A380,Airbus
8963f5,a6-eox,a388,Airbus A380-861,Emirates
896462,a6-apg,a388,Airbus A380-861,Etihad Airways
8963f6,a6-eoy,a388,Airbus A380-861,Emirates
38409a,f-wwsu,a388,Airbus A380,Airbus
896463,a6-aph,a388,Airbus A380-861,Etihad Airways
383eda,f-wwsd,a388,Airbus A380,Airbus
38081a,f-wwaf,a388,Airbus A380,Airbus
8963f7,a6-eoz,a388,Airbus A380-861,Emirates
38405a,f-wwsp,a388,Airbus A380,Airbus
383f5a,f-wwsh,a388,Airbus A380,Airbus
3809fa,f-wwax,a388,Airbus A380,Airbus
896456,a6-eua,a388,Airbus A380-861,Emirates
383e9a,f-wwsq,a388,Airbus A380,Airbus
382b9a,f-wwsr,a388,Airbus A380,Airbus
406ec7,g-xlel,a388,Airbus A380-861,British Airways
896457,a6-eub,a388,Airbus A380-861,Emirates
896459,a6-eud,a388,Airbus A380-861,Emirates
89645a,a6-eue,a388,Airbus A380-861,Emirates
383eba,f-wwsc,a388,Airbus A380,Airbus
896458,a6-euc,a388,Airbus A380-861,Emirates
89645b,a6-euf,a388,Airbus A380-861,Emirates
38089a,f-wwak,a388,Airbus A380,Airbus
896471,a6-eug,a388,Airbus A380-861,Emirates
383f1a,f-wwsf,a388,Airbus A380,Airbus
71be40,hl7640,a388,Airbus A380-841,Asiana Airlines
896472,a6-euh,a388,,
38003a,f-wwas,a388,,
896474,a6-euj,a388,,
896475,a6-euk,a388,,
06a148,a7-apg,a388,,
896476,a6-eul,a388,,
380a1a,f-wway,a388,,
71be41,hl7641,a388,,
896477,a6-eum,a388,,
896478,a6-eun,a388,,
896473,a6-eui,a388,,
896479,a6-euo,a388,,
89649d,a6-api,a388,,
06a149,a7-aph,a388,,
89647a,a6-eup,a388,,
89649e,a6-apj,a388,,
89647b,a6-euq,a388,,
896483,a6-euy,a388,,
896482,a6-eux,a388,,
38401a,f-wwsn,a388,,
896484,a6-euz,a388,,
89647e,a6-eut,a388,,
896480,a6-euv,a388,,
76cd76,9v-skv,a388,,
76cd75,9v-sku,a388,,
06a14a,a7-api,a388,,
89647d,a6-eus,a388,,
89647c,a6-eur,a388,,
