icao,regid,mdl,type,operator
00b3ff,zs-tri,md83,McDonnell Douglas MD-83,Africa Charter Airline
0640a4,5n-sri,md83,McDonnell Douglas MD-83,Dana Air
0d08d7,xa-uvg,md83,McDonnell Douglas MD-83,Aeronaves TSM
0d815a,yv481t,md83,McDonnell Douglas MD83,SBA Airlines
300312,i-smen,md83,McDonnell Douglas MD-83,Meridiana
0d81b4,yv539t,md83,McDonnell Douglas MD-83,Aserca Airlines
0d81d0,yv2971,md83,McDonnell Douglas MD-83,Aserca Airlines
0d81dd,yv2990,md83,McDonnell Douglas MD-83,Aserca Airlines
0d81ee,yv3024,md83,McDonnell Douglas MD83,Aserca Airlines
342aa7,p4-mdi,md83,McDonnell Douglas MD-83,Swiftair
45caa5,oy-rue,md83,McDonnell Douglas MD-83,Danish Air Transport
4688b6,yv485t,md83,McDonnell Douglas MD-83,SBA Airlines
46a4c1,sx-ifa,md83,McDonnell Douglas MD-83,AMJET Executive S.A.
480090,pj-mdf,md83,McDonnell Douglas MD-83,Insel Air
484090,pj-mdf,md83,McDonnell Douglas MD-83,Insel Air
484342,p4-mdg,md83,McDonnell Douglas MD83,InselAir Aruba
48449a,p4-mdh,md83,McDonnell Douglas MD83,InselAir Aruba
5080d6,ur-cel,md83,McDonnell Douglas MD-83,Aviatrans K
50812a,hi977,md83,McDonnell Douglas MD-83,UM Air
508209,ep-cpv,md83,McDonnell Douglas MD-83,Caspian Airlines
508277,ur-cju,md83,McDonnell Douglas MD-83,Khors Aircompany
50834e,ur-cob,md83,McDonnell Douglas MD-83,Kam Air
50835c,ur-coc,md83,McDonnell Douglas MD-83,Kam Air
4a2044,yr-hbd,md83,McDonnell Douglas MD-83,Ten Airways
70000c,ya-kmd,md83,McDonnell Douglas MD-83,Kam Air
702031,s2-aeh,md83,McDonnell Douglas MD-83,United Airways
728e1a,ep-cpz,md83,McDonnell Douglas MD-83,Caspian Airlines
730e04,ep-cpd,md83,McDonnell Douglas MD-83,Caspian Airlines
730e15,ep-cpu,md83,McDonnell Douglas MD-83,Caspian Airlines
730e18,ep-cpx,md83,McDonnell Douglas MD-83,Caspian Airlines
733069,ep-lci,md83,McDonnell Douglas MD-83,Kish Air
73306e,ep-lcn,md83,McDonnell Douglas MD-83,Kish Air
73306f,ep-lco,md83,McDonnell Douglas MD-83,Kish Air
733486,ep-mdf,md83,McDonnell Douglas MD-83,Iran Air Tours
73502d,ep-tam,md83,McDonnell Douglas MD-83,ATA Airlines
73502e,ep-tan,md83,McDonnell Douglas MD-83,ATA Airlines
735030,ep-tap,md83,McDonnell Douglas MD-83,ATA Airlines
735031,ep-taq,md83,McDonnell Douglas MD-83,ATA Airlines
735032,ep-tar,md83,McDonnell Douglas MD-83,ATA Airlines
735033,ep-tas,md83,McDonnell Douglas MD-83,ATA Airlines
73682b,ep-zak,md83,McDonnell Douglas MD-83,Zagros Air
8a0392,pk-ocs,md83,McDonnell Douglas MD-83,Airfast Indonesia
8a04d8,pk-ocr,md83,McDonnell Douglas MD83,Airfast Indonesia
899033,b-28007,md83,McDonnell Douglas MD-83,Far Eastern Air Transport
899034,b-28011,md83,McDonnell Douglas MD-83,Far Eastern Air Transport
89906c,b-28027,md83,McDonnell Douglas MD-83,Far Eastern Air Transport
89906f,b-28025,md83,McDonnell Douglas MD-83,Far Eastern Air Transport
a054d2,n120mn,md83,McDonnell Douglas MD-83,Haiti Aviation
a4c074,n405nv,md83,McDonnell Douglas MD-83,Allegiant Air
a4c42b,n406nv,md83,McDonnell Douglas MD-83,Allegiant Air
a4c7e2,n407nv,md83,McDonnell Douglas MD-83,Allegiant Air
a4cb99,n408nv,md83,McDonnell Douglas MD-83,Allegiant Air
a4cf50,n409nv,md83,McDonnell Douglas MD-83,Allegiant Air
a4d560,n410nv,md83,McDonnell Douglas MD-83,Allegiant Air
a4d917,n411nv,md83,McDonnell Douglas MD-83,Allegiant Air
a4e7f3,n415nv,md83,McDonnell Douglas MD-83,Allegiant Air
a4ebaa,n416nv,md83,McDonnell Douglas MD-83,Allegiant Air
a4ef61,n417nv,md83,McDonnell Douglas MD-83,Allegiant Air
a4f318,n418nv,md83,McDonnell Douglas MD-83,Allegiant Air
a4f6cf,n419nv,md83,McDonnell Douglas MD-83,Allegiant Air
a4fcdf,n420nv,md83,McDonnell Douglas MD-83,Allegiant Air
a50096,n421nv,md83,McDonnell Douglas MD-83,Allegiant Air
a53969,n436aa,md83,McDonnell Douglas MD-83,American Airlines
a53d20,n437aa,md83,McDonnell Douglas MD-83,American Airlines
a540d7,n438aa,md83,McDonnell Douglas MD-83,American Airlines
a5448e,n439aa,md83,McDonnell Douglas MD-83,American Airlines
a5044d,n422nv,md83,McDonnell Douglas MD-83,Allegiant Air
a50804,n423nv,md83,McDonnell Douglas MD-83,Allegiant Air
a50bbb,n424nv,md83,McDonnell Douglas MD-83,Allegiant Air
a50f72,n425nv,md83,McDonnell Douglas MD-83,Allegiant Air
a51329,n426nv,md83,McDonnell Douglas MD-83,Allegiant Air
a516e0,n427nv,md83,McDonnell Douglas MD-83,Allegiant Air
a51e4e,n429nv,md83,McDonnell Douglas MD-83,Allegiant Air
a531fb,n434aa,md83,McDonnell Douglas MD-83,American Airlines
a735c7,n564aa,md83,McDonnell Douglas MD-83,American Airlines
a7397e,n565aa,md83,McDonnell Douglas MD-83,American Airlines
a73d35,n566aa,md83,McDonnell Douglas MD-83,American Airlines
a74e6a,n570aa,md83,McDonnell Douglas MD-83,American Airlines
a75221,n571aa,md83,McDonnell Douglas MD-83,American Airlines
a755d8,vp-ckn,md83,Hawker 800XP,Private owner
a740f7,n567am,md83,McDonnell Douglas MD-83,American Airlines
a744a3,n568aa,md83,McDonnell Douglas MD-83,American Airlines
a7485a,n569aa,md83,McDonnell Douglas MD-83,American Airlines
a7b3b2,n596aa,md83,McDonnell Douglas MD-83,American Airlines
a7bb20,n598aa,md83,McDonnell Douglas MD-83,American Airlines
a79d68,n590aa,md83,McDonnell Douglas MD-83,American Airlines
aa4b67,n76200,md83,McDonnell Douglas MD-83,American Airlines
aa4b69,n76202,md83,McDonnell Douglas MD-83,American Airlines
aaa88e,n786tw,md83,McDonnell Douglas MD-83,Ameristar
ab397f,yv191t,md83,McDonnell Douglas MD-82,Venezolana
ab5de4,n831us,md83,McDonnell Douglas MD-83,USA Jet Airlines
aaeb40,n802wa,md83,McDonnell Douglas MD-83,World Atlantic Airlines
aaf2ae,n804wa,md83,McDonnell-Douglas MD83,World Atlantic Airlines
aaf665,n805wa,md83,McDonnell Douglas MD-83,World Atlantic Airlines
aafa1c,n806wa,md83,McDonnell Douglas MD-83,World Atlantic Airlines
aafdd3,n807wa,md83,,
aaac45,n787tw,md83,McDonnell Douglas MD-83,Ameristar
ac0d37,n876ga,md83,McDonnell Douglas MD-83,Allegiant Air
ac10ee,n877ga,md83,McDonnell Douglas MD-83,Allegiant Air
ac14a5,n878ga,md83,McDonnell Douglas MD-83,Allegiant Air
ac185c,n879ga,md83,McDonnell Douglas MD-83,Allegiant Air
ac1e2e,n880dp,md83,McDonnell Douglas MD-83,Private owner
ac1e6c,n880ga,md83,McDonnell Douglas MD-83,Allegiant Air
ac2223,n881ga,md83,McDonnell Douglas MD-83,Allegiant Air
ac2991,n883ga,md83,McDonnell Douglas MD-83,Allegiant Air
ac2d48,n884ga,md83,McDonnell Douglas MD-83,Allegiant Air
ac34b6,n886ga,md83,McDonnell Douglas MD-83,Allegiant Air
ac386d,n887ga,md83,McDonnell Douglas MD-83,Allegiant Air
abd325,n861ga,md83,McDonnell Douglas MD-83,Allegiant Air
abd6dc,n862ga,md83,McDonnell Douglas MD-83,Allegiant Air
abda93,n863ga,md83,McDonnell Douglas MD-83,Allegiant Air
abde4a,n864ga,md83,McDonnell Douglas MD-83,Allegiant Air
abe201,n865ga,md83,McDonnell Douglas MD-83,Allegiant Air
abe5b8,n866ga,md83,McDonnell Douglas MD-83,Allegiant Air
abed26,n868ga,md83,McDonnell Douglas MD-83,Allegiant Air
abf0dd,n869ga,md83,McDonnell-Douglas MD82,Allegiant Air
abfaa4,n871ga,md83,McDonnell Douglas MD-83,Allegiant Air
abfe5b,n872ga,md83,McDonnell Douglas MD-83,Allegiant Air
ac0212,n873ga,md83,McDonnell Douglas MD-83,Allegiant Air
ac05c9,n874ga,md83,McDonnell Douglas MD-83,Allegiant Air
ac0980,n875ga,md83,McDonnell Douglas MD-83,Allegiant Air
ac49a2,n891ga,md83,McDonnell Douglas MD-83,Allegiant Air
ac4d59,n892ga,md83,McDonnell Douglas MD-83,Allegiant Air
acd488,n926av,md83,McDonnell Douglas MD-83,AvCorp International
ad0fb8,n9401w,md83,McDonnell Douglas MD-83,American Airlines
ad0fdb,n9402w,md83,McDonnell Douglas MD-83,American Airlines
ad0ffe,n9403w,md83,McDonnell Douglas MD-83,American Airlines
ad1020,n9404v,md83,McDonnell Douglas MD-83,American Airlines
ad1041,n9405t,md83,McDonnell Douglas MD-83,American Airlines
ad1067,n9406w,md83,McDonnell Douglas MD-83,American Airlines
ad10c1,n9409f,md83,McDonnell Douglas MD-83,American Airlines
ada6d2,n979tw,md83,McDonnell Douglas MD-83,American Airlines
adace2,n980tw,md83,McDonnell Douglas MD-83,American Airlines
ad5fee,n961as,md83,McDonnell Douglas MD-83,Alaska Airlines
ad619b,n961tw,md83,McDonnell Douglas MD-83,American Airlines
ad62f9,n9615w,md83,McDonnell Douglas MD-83,American Airlines
ad630e,n9616g,md83,McDonnell Douglas MD-83,American Airlines
ad633a,n9617r,md83,McDonnell Douglas MD-83,American Airlines
ad634e,n9618a,md83,McDonnell Douglas MD-83,American Airlines
ad6384,n9619v,md83,McDonnell Douglas MD-83,American Airlines
ad6552,n962tw,md83,McDonnell Douglas MD-83,American Airlines
ad65f0,n9620d,md83,McDonnell Douglas MD-83,American Airlines
ad6610,n9621a,md83,McDonnell Douglas MD-83,American Airlines
ad6633,n9622a,md83,McDonnell Douglas MD-83,American Airlines
ad668a,n9624t,md83,McDonnell Douglas MD-83,American Airlines
ad66b0,n9625w,md83,McDonnell Douglas MD-83,American Airlines
ad66c4,n9626f,md83,McDonnell Douglas MD-83,American Airlines
ad6719,n9628w,md83,McDonnell Douglas MD-83,American Airlines
ad672f,n9629h,md83,McDonnell Douglas MD-83,American Airlines
ad6909,n963tw,md83,McDonnell Douglas MD-83,American Airlines
ad69a4,n9630a,md83,McDonnell Douglas MD-83,American Airlines
ad273a,n947as,md83,McDonnell Douglas MD-83,Alaska Airlines
ad6cc0,n964tw,md83,McDonnell Douglas MD-83,American Airlines
ad7077,n965tw,md83,McDonnell Douglas MD-83,American Airlines
adb450,n982tw,md83,McDonnell Douglas MD-83,American Airlines
adb807,n983tw,md83,McDonnell Douglas MD-83,American Airlines
adbbbe,n984tw,md83,McDonnell Douglas MD-83,American Airlines
ad742e,n966tw,md83,McDonnell Douglas MD-83,American Airlines
ad77e5,n967tw,md83,McDonnell Douglas MD-83,American Airlines
ad7989,n9677w,md83,McDonnell Douglas MD-83,American Airlines
ad7b9c,n968tw,md83,McDonnell Douglas MD-83,American Airlines
ad7c5b,n9681b,md83,McDonnell Douglas MD-83,American Airlines
ad7f53,n969tw,md83,McDonnell Douglas MD-83,American Airlines
ad8563,n970tw,md83,McDonnell Douglas MD-83,American Airlines
ad891a,n971tw,md83,McDonnell Douglas MD-83,American Airlines
ad8cd1,n972tw,md83,McDonnell Douglas MD-83,American Airlines
e171cd,lv-wgm,md83,McDonnell Douglas MD83,Andes Lineas Aereas
e01644,lv-ayd,md83,McDonnell Douglas MD83,Andes Lineas Aereas
e030ca,lv-ccj,md83,McDonnell Douglas MD-83,Andes LÃ­neas AÃ©reas
6b0e18,ep-cpu,md83,McDonnell Douglas MD-83,Caspian Airlines
184204,hi990,md83,McDonnell Douglas MD-83,PAWA Dominicana
e171ce,lv-wgn,md83,McDonnell Douglas MD-83,Andes Lineas Aereas
736823,ep-zac,md83,McDonnell Douglas MD-83,Zagros Air
0c4083,hi977,md83,McDonnell Douglas MD-83,Pawa Dominicana
ad6b39,n964ce,md83,McDonnell Douglas MD-83,Everts Air
50818c,ur-cdp,md83,McDonnell Douglas MD-83,Khors Aircompany
736831,ep-zaq,md83,McDonnell-Douglas MD83,Zagros Air
508361,ur-coo,md83,McDonnell Douglas MD-83,UM Air
0c4086,hi989,md83,McDonnell Douglas MD-83,PAWA Dominicana
508381,ur-cpb,md83,McDonnell Douglas MD-83,Anda Air
0c4087,hi992,md83,,
06415d,5n-joy,md83,,
0d8164,yv485t,md83,,
ad97f6,n975tw,md83,,
50838f,ur-cpr,md83,,
730c49,ep-cbi,md83,,
ad6eca,n965as,md83,,
ab018a,n808wa,md83,,
508393,ur-cpx,md83,,
0c4084,hi990,md83,,
508399,ur-cqc,md83,,
5083a4,ur-cou,md83,,
732823,ep-zac,md83,,
add72e,n991jm,md83,,
4840b6,pj-mdi,md83,,
ad6ef0,n965ce,md83,,
e02147,lv-beg,md83,,
0d0aa8,xa-uzi,md83,,
a7bed7,n599aa,md83,,
a44b39,n376ms,md83,,
aa4b68,n76201,md83,,
