icao,regid,mdl,type,operator
00a284,zs-nbf,crj7,Canadair CRJ-700,South African Express
00a285,zs-nbg,crj7,Canadair CRJ-700,South African Express
00b25b,zs-tbe,crj7,Canadair CRJ-700,South African Express
394722,f-grzc,crj7,Canadair CRJ-700,HOP!
394723,f-grzd,crj7,Canadair CRJ-700,HOP!
394724,f-grze,crj7,Canadair CRJ-700,HOP!
394725,f-grzf,crj7,Canadair CRJ-700,HOP!
394726,f-grzg,crj7,Canadair CRJ-700,HOP!
394727,f-grzh,crj7,Canadair CRJ-700,HOP!
394728,f-grzi,crj7,Canadair CRJ-700,HOP!
394729,f-grzj,crj7,Canadair CRJ-700,HOP!
39472a,f-grzk,crj7,Canadair CRJ-700,HOP!
39472b,f-grzl,crj7,Canadair CRJ-700,HOP!
39472c,f-grzm,crj7,Canadair CRJ-700,HOP!
39472d,f-grzn,crj7,Canadair CRJ-700,HOP!
39472e,f-grzo,crj7,Canadair CRJ-700,HOP!
400111,vp-bcl,crj7,Canadair CRJ-700,Private owner
506c2e,s5-aaz,crj7,Canadair CRJ700,Adria Airways
5110c4,es-ace,crj7,Canadair CRJ-700,Estonian Air
5110c5,es-acf,crj7,Canadair CRJ-701ER,Estonian Air
6830e4,up-cl001,crj7,Canadair CRJ-700 Regional Jet,Khozu-Avia
7800ca,b-4064,crj7,Canadair CRJ-700,PLAAF-China Air Force
7803b7,b-3079,crj7,Bombardier CRJ-700-701ER,Shandong Airlines
7803b8,b-3080,crj7,Canadair CRJ-700,Shandong Airlines
800453,vt-rjb,crj7,Canadair CRJ-700,Air India Regional
800455,vt-rjd,crj7,Canadair CRJ700 Regional Jet,Air India Regional
800456,vt-rje,crj7,Canadair Regional Jet CRJ-700,Air India Regional
8414a8,ja05rj,crj7,Canadair CRJ-700 Regional Jet,Ibex Airlines
84183c,ja06rj,crj7,Canadair CRJ-700 Regional Jet,Ibex Airlines
841bd0,ja07rj,crj7,Canadair CRJ-700,Ibex Airlines
841f64,ja08rj,crj7,Canadair CRJ-700,Ibex Airlines
8422f8,ja09rj,crj7,Canadair CRJ-700 Regional Jet,Ibex Airlines
845c8c,ja10rj,crj7,Canadair CRJ-702,Ibex Airlines
846020,ja11rj,crj7,Canadair CRJ-700,Ibex Airlines
a02a3f,n11ea,crj7,Canadair CL-600-2C10 Regional,Elite Airways
a0ce85,n151gj,crj7,Canadair CRJ-702,United Express
a0d23c,n152gj,crj7,Canadair CRJ-702,United Express
a0d5f3,n153gj,crj7,Canadair CRJ-702,United Express
a0d9aa,n154gj,crj7,Canadair CRJ-702,United Express
a0dd61,n155gj,crj7,Canadair CRJ-702,United Express
a0e118,n156gj,crj7,Canadair CRJ-702,United Express
a0e4cf,n157gj,crj7,Canadair CRJ-702,United Express
a0e886,n158gj,crj7,Canadair CRJ-702,United Express
a0ec3d,n159gj,crj7,Canadair CRJ-702,United Express
a0f24d,n160gj,crj7,Canadair CRJ-702,United Express
a0f604,n161gj,crj7,Canadair CRJ-702,United Express
a0f9bb,n162gj,crj7,Canadair CRJ-702,United Express
a0fd72,n163gj,crj7,Canadair CRJ-702,United Express
a10129,n164gj,crj7,Canadair CRJ-702,United Express
a104e0,n165gj,crj7,Canadair CRJ-702,United Express
a10897,n166gj,crj7,Canadair CRJ-702,United Express
a10c4e,n167gj,crj7,Canadair CRJ-702,United Express
a11005,n168gj,crj7,Canadair CRJ-702,United Express
a113bc,n169gj,crj7,Canadair CRJ-702,United Express
a119cc,n170gj,crj7,Canadair CRJ-702,United Express
a11d83,n171gj,crj7,Canadair CRJ-702,United Express
a1213a,n172gj,crj7,Canadair CRJ-702,United Express
a124f1,n173gj,crj7,Canadair CRJ-702,United Express
a128a8,n174gj,crj7,Canadair CRJ-702,United Express
a12c5f,n175gj,crj7,Canadair CRJ-702,United Express
a1cc1c,n215ag,crj7,Canadair CRJ-701ER,Alaska Airlines
a1cfd3,n216ag,crj7,Canadair CRJ-701ER,Alaska Airlines
a1d38a,n217ag,crj7,Canadair CRJ-701ER,Alaska Airlines
a1d741,n218ag,crj7,Canadair CRJ-701ER,Alaska Airlines
a1daf8,n219ag,crj7,Canadair CRJ-701ER,Alaska Airlines
a22e0b,n24ea,crj7,,
a1ec2d,n223ag,crj7,Canadair CRJ-701ER,Alaska Airlines
a1efe4,n224ag,crj7,Canadair CRJ-701ER,Alaska Airlines
a1f39b,n225ag,crj7,Canadair CRJ-701ER,Alaska Airlines
a1fb09,n227ag,crj7,Canadair CRJ-701ER,Alaska Airlines
a36105,n317ca,crj7,Canadair CRJ-700,Delta Connection
a399b9,n331ca,crj7,Canadair CRJ-700,Delta Connection
a3bd81,n340ca,crj7,Canadair CRJ-701,Delta Connection
a442da,n374ca,crj7,Canadair CRJ-700,Delta Connection
a482fc,n390ca,crj7,Canadair CRJ-701,Delta Connection
a486b3,n391ca,crj7,Canadair CRJ-700,Delta Connection
a4a0b4,n398ca,crj7,Canadair CRJ-700,Delta Connection
a3f3dc,n354ca,crj7,Canadair CRJ-700,Delta Connection
a3f793,n355ca,crj7,Canadair CRJ-700,Delta Connection
a44a48,n376ca,crj7,Canadair CRJ-700,Delta Connection
a451b6,n378ca,crj7,Canadair CRJ-700,Delta Connection
a4556d,n379ca,crj7,Canadair CRJ-700,Delta Connection
a42680,n367ca,crj7,Canadair CRJ-700,Delta Connection
a42a37,n368ca,crj7,Canadair CRJ-701,Delta Connection
a42dee,n369ca,crj7,Canadair CRJ-700,Delta Connection
a437b5,n371ca,crj7,Canadair CRJ-700,Delta Connection
a639f5,n500ae,crj7,Canadair CRJ-701ER,American Eagle
a63dc7,n501bg,crj7,Canadair CRJ-701ER,American Eagle
a63ec3,n501mj,crj7,Canadair CRJ-700,United Express
a64163,n502ae,crj7,Canadair CRJ-701ER,American Eagle
a6427a,n502mj,crj7,Canadair CRJ-700,United Express
a6451a,n503ae,crj7,Canadair CRJ-701ER,American Eagle
a64631,n503mj,crj7,Canadair CRJ-700,United Express
a648d1,n504ae,crj7,Canadair CRJ-701ER,American Eagle
a649e8,n504mj,crj7,Canadair CRJ-700,United Express
a64c88,n505ae,crj7,Canadair CRJ-701ER,American Eagle
a64d9f,n505mj,crj7,Canadair CRJ-700,United Express
a6503f,n506ae,crj7,Canadair CRJ-701ER,American Eagle
a65156,n506mj,crj7,Canadair CRJ-700,United Express
a653f6,n507ae,crj7,Canadair CRJ-701ER,American Eagle
a6550d,n507mj,crj7,Canadair CRJ-700,United Express
a657ad,n508ae,crj7,Canadair CRJ-701ER,American Eagle
a658c4,n508mj,crj7,Canadair CRJ-700,United Express
a65b64,n509ae,crj7,Canadair CRJ-701ER,American Eagle
a65c7b,n509mj,crj7,Canadair CRJ-700,United Express
a66174,n510ae,crj7,Canadair CRJ-701ER,American Eagle
a6628b,n510mj,crj7,Canadair CRJ-701ER,United Express
a6652b,n511ae,crj7,Canadair CRJ-701ER,American Eagle
a66642,n511mj,crj7,Canadair CRJ-701ER,United Express
a668e2,n512ae,crj7,Canadair CRJ-701ER,American Eagle
a669f9,n512mj,crj7,Canadair CRJ-701ER,United Express
a6aac2,n529ea,crj7,Canadair CRJ-702ER,American Eagle
a67b75,n517ae,crj7,Canadair CRJ-701ER,American Eagle
a67f2c,n518ae,crj7,Canadair CRJ-701ER,American Eagle
a68031,n518lr,crj7,Canadair CRJ-701LR,United Express
a682e3,n519ae,crj7,Canadair CRJ-701ER,American Eagle
a683ad,n519jg,crj7,Saab 2000,Joe Gibbs Racing
a683e8,n519lr,crj7,Canadair CRJ-701LR,United Express
a6893c,n520dc,crj7,Canadair CRJ-701ER,American Eagle
a68caa,n521ae,crj7,Canadair CRJ-701ER,American Eagle
a68daf,n521lr,crj7,Canadair CRJ-701LR,United Express
a69061,n522ae,crj7,Canadair CRJ-701ER,American Eagle
a69166,n522lr,crj7,Canadair CRJ-701LR,United Express
a69418,n523ae,crj7,Canadair CRJ-701ER,American Eagle
a697cf,n524ae,crj7,Canadair CRJ-701ER,American Eagle
a69b86,n525ae,crj7,Canadair CRJ-702ER,American Eagle
a6b0d2,n530ea,crj7,Canadair CRJ-702ER,American Eagle
a6b48f,n531eg,crj7,Canadair CRJ-702ER,American Eagle
a6b840,n532ea,crj7,Canadair CRJ-702ER,American Eagle
a6bb97,n533ae,crj7,Canadair CRJ-702ER,American Eagle
a6bf4e,n534ae,crj7,Canadair CRJ-702ER,American Eagle
a6c365,n535ea,crj7,Canadair CRJ-702ER,American Eagle
a6c71c,n536ea,crj7,Canadair CRJ-702ER,American Eagle
a6cad3,n537ea,crj7,Canadair CRJ-702ER,American Eagle
a6ce90,n538eg,crj7,Canadair CRJ-702ER,American Eagle
a6d241,n539ea,crj7,Canadair CRJ-702ER,American Eagle
a66c99,n513ae,crj7,Canadair CRJ-701ER,American Eagle
a66db0,n513mj,crj7,Canadair CRJ-701ER,United Express
a67050,n514ae,crj7,Canadair CRJ-701ER,American Eagle
a67167,n514mj,crj7,Canadair CRJ-701ER,United Express
a67407,n515ae,crj7,Canadair CRJ-701ER,American Eagle
a6751e,n515mj,crj7,Canadair CRJ-701ER,United Express
a677be,n516ae,crj7,Canadair CRJ-701ER,American Eagle
a678c3,n516lr,crj7,Canadair CRJ-701LR,United Express
a69f9d,n526ea,crj7,Canadair CRJ-702ER,American Eagle
a6a354,n527ea,crj7,Canadair CRJ-702ER,American Eagle
a6a711,n528eg,crj7,Canadair CRJ-702ER,American Eagle
a6d857,n540eg,crj7,Canadair CRJ-702ER,American Eagle
a6dc08,n541ea,crj7,Canadair CRJ-702ER,American Eagle
a6dfbf,n542ea,crj7,Canadair CRJ-702ER,American Eagle
a6e376,n543ea,crj7,Canadair CRJ-702ER,American Eagle
a6e72d,n544ea,crj7,Canadair CRJ-702ER,American Eagle
a6ebc6,n545pb,crj7,Canadair CRJ-702ER,American Eagle
a6eeb9,n546ff,crj7,Canadair CRJ-702ER,American Eagle
a7c8b3,n600qx,crj7,Canadair CRJ-700,Delta Connection
a7d3d8,n603qx,crj7,Canadair CRJ-701ER,Delta Connection
a7d3fe,n603sk,crj7,Canadair CRJ-701ER,Delta Connection
a7d78f,n604qx,crj7,Canadair CRJ-700,Delta Connection
a7d7b5,n604sk,crj7,Canadair CRJ-701ER,Delta Connection
a7db46,n605qx,crj7,Canadair CRJ-700,Delta Connection
a7df23,n606sk,crj7,Canadair CRJ-701ER,Delta Connection
a7e2da,n607sk,crj7,Canadair CRJ-701ER,Delta Connection
a7e66b,n608qx,crj7,Canadair CRJ-700,Delta Connection
a7e691,n608sk,crj7,Canadair CRJ-701ER,Delta Connection
a7ea48,n609sk,crj7,Canadair CRJ-701ER,Delta Connection
a7f3e9,n611qx,crj7,Canadair CRJ-700,Delta Connection
a7f40f,n611sk,crj7,Canadair CRJ-701ER,Delta Connection
a7f7a0,n612qx,crj7,Canadair CRJ-700,Delta Connection
a7fb57,n613qx,crj7,Canadair CRJ-701ER,Delta Connection
a7fb7d,n613sk,crj7,Canadair CRJ-701ER,Delta Connection
a83f56,n630sk,crj7,Canadair CRJ-702ER,Delta Connection
a8430d,n631sk,crj7,Canadair CRJ-702ER,Delta Connection
a846c4,n632sk,crj7,Canadair CRJ-702ER,Delta Connection
a84a7b,n633sk,crj7,Canadair CRJ-702ER,Delta Connection
a7ff0e,n614qx,crj7,Canadair CRJ-701,Delta Connection
a7ff34,n614sk,crj7,Canadair CRJ-701ER,Delta Connection
a802c5,n615qx,crj7,Canadair CRJ-700,Delta Connection
a8067c,n616qx,crj7,Canadair CRJ-701ER,Delta Connection
a80a33,n617qx,crj7,Canadair CRJ-701ER,Delta Connection
a82903,n625ca,crj7,Canadair CRJ-701ER,Delta Connection
a89812,n653ca,crj7,Canadair CRJ-700,Delta Connection
a89f80,n655ca,crj7,Canadair CRJ-700,Delta Connection
a8a337,n656ca,crj7,Canadair CRJ-700,Delta Connection
a8aaa5,n658ca,crj7,Canadair CRJ-700,Delta Connection
a8ae5c,n659ca,crj7,Canadair CRJ-700,Delta Connection
a8d224,n668ca,crj7,Canadair CRJ-700,Delta Connection
a8d5db,n669ca,crj7,Canadair CRJ-700,Delta Connection
a92ae9,n690ca,crj7,Canadair CRJ-700,Delta Connection
a86925,n641ca,crj7,Canadair CRJ-701ER,Delta Connection
a86cdc,n642ca,crj7,Canadair CRJ-700,Delta Connection
a959df,n701sk,crj7,Canadair CRJ-701ER,United Express
a95d52,n702ps,crj7,Canadair CRJ-700,American Eagle
a95d96,n702sk,crj7,Canadair CRJ-701ER,United Express
a96109,n703ps,crj7,Canadair CRJ-700,American Eagle
a9614d,n703sk,crj7,Canadair CRJ-701ER,United Express
a96877,n705ps,crj7,Canadair CRJ-700,American Eagle
a968bb,n705sk,crj7,Canadair CRJ-701ER,United Express
a96c2e,n706ps,crj7,Canadair CRJ-700,American Eagle
a96c72,n706sk,crj7,Canadair CRJ-701ER,United Express
a96f07,n707ev,crj7,Canadair CRJ-700,Delta Connection
a97029,n707sk,crj7,Canadair CRJ-701ER,United Express
a972be,n708ev,crj7,Canadair CRJ-700,Delta Connection
a9739c,n708ps,crj7,Canadair CRJ-700,American Eagle
a973e0,n708sk,crj7,Canadair CRJ-701ER,United Express
a97675,n709ev,crj7,Canadair CRJ-700,Delta Connection
a97753,n709ps,crj7,Canadair CRJ-700,American Eagle
a97797,n709sk,crj7,Canadair CRJ-701ER,United Express
a97c85,n710ev,crj7,Canadair CRJ-700,Delta Connection
a97d63,n710ps,crj7,Canadair CRJ-700,American Eagle
a97da7,n710sk,crj7,Canadair CRJ-701ER,United Express
a983f3,n712ev,crj7,Canadair CRJ-700,Delta Connection
a984d1,n712ps,crj7,Canadair CRJ-700,American Eagle
a98515,n712sk,crj7,Canadair CRJ-701ER,United Express
a987aa,n713ev,crj7,Canadair CRJ-700,Delta Connection
a988cc,n713sk,crj7,Canadair CRJ-701ER,United Express
a9903a,n715sk,crj7,Canadair CRJ-701ER,United Express
a992cf,n716ev,crj7,Canadair CRJ-700,Delta Connection
a993ad,n716ps,crj7,Canadair CRJ-700,American Eagle
a993f1,n716sk,crj7,Canadair CRJ-701ER,United Express
a99686,n717ev,crj7,Canadair CRJ-700,Delta Connection
a99a3d,n718ev,crj7,Canadair CRJ-700,Delta Connection
a99b1b,n718ps,crj7,Canadair CRJ-700,American Eagle
a99b5f,n718sk,crj7,Canadair CRJ-701ER,United Express
a99df4,n719ev,crj7,Canadair CRJ-700,Delta Connection
a99ed2,n719ps,crj7,Canadair CRJ-700,American Eagle
a99f16,n719sk,crj7,Canadair CRJ-701ER,United Express
a9a404,n720ev,crj7,Canadair CRJ-700,Delta Connection
a9e93b,n738ev,crj7,Canadair CRJ-700,Delta Connection
a9ea5d,n738sk,crj7,Canadair CRJ-701ER,United Express
a9a4e2,n720ps,crj7,Canadair CRJ-700,American Eagle
a9ab72,n722ev,crj7,Canadair CRJ-700,Delta Connection
a9af29,n723ev,crj7,Canadair CRJ-700,Delta Connection
a9b007,n723ps,crj7,Canadair CRJ-700,American Eagle
a9b2e0,n724ev,crj7,Canadair CRJ-700,Delta Connection
a9b402,n724sk,crj7,Canadair CRJ-701ER,United Express
a9b775,n725ps,crj7,Canadair CRJ-700,American Eagle
a9bb70,n726sk,crj7,Canadair CRJ-701ER,United Express
a9bf27,n727sk,crj7,Canadair CRJ-701ER,United Express
a9f302,n740ev,crj7,Canadair CRJ-700,Delta Connection
a9f424,n740sk,crj7,Canadair CRJ-701ER,United Express
a9f6b9,n741ev,crj7,Canadair CRJ-700,Delta Connection
a9fb92,n742sk,crj7,Canadair CRJ-701ER,United Express
a9ff49,n743sk,crj7,Canadair CRJ-701ER,United Express
aa01de,n744ev,crj7,Canadair CRJ-700,Delta Connection
aa0300,n744sk,crj7,Canadair CRJ-701ER,United Express
aa06b7,n745sk,crj7,Canadair CRJ-701ER,United Express
aa0a6e,n746sk,crj7,Canadair CRJ-701ER,United Express
aa10ba,n748ev,crj7,Canadair CRJ-700,Delta Connection
aa11dc,n748sk,crj7,Canadair CRJ-701ER,United Express
aa1a81,n750ev,crj7,Canadair CRJ-700,Delta Connection
aa1ba3,n750sk,crj7,Canadair CRJ-701ER,United Express
aa1e38,n751ev,crj7,Canadair CRJ-700,Delta Connection
aa1f5a,n751sk,crj7,Canadair CRJ-701ER,United Express
aa21ef,n752ev,crj7,Canadair CRJ-700,Delta Connection
aa2311,n752sk,crj7,Canadair CRJ-701ER,United Express
aa25a6,n753ev,crj7,Canadair CRJ-700,Delta Connection
aa26c8,n753sk,crj7,Canadair CRJ-701ER,United Express
aa295d,n754ev,crj7,Canadair CRJ-700,Delta Connection
aa2a7f,n754sk,crj7,Canadair CRJ-701ER,United Express
aa2d14,n755ev,crj7,Canadair CRJ-700,Delta Connection
aa2e36,n755sk,crj7,Canadair CRJ-701ER,United Express
a9c2de,n728sk,crj7,Canadair CRJ-701ER,United Express
a9cb83,n730ev,crj7,Canadair CRJ-700,Delta Connection
a9cca5,n730sk,crj7,Canadair CRJ-701ER,United Express
a9d413,n732sk,crj7,Canadair CRJ-701ER,United Express
aa31ed,n756sk,crj7,Canadair CRJ-701ER,United Express
aa3839,n758ev,crj7,Canadair CRJ-700,Delta Connection
aa395b,n758sk,crj7,Canadair CRJ-701ER,United Express
aa3bf0,n759ev,crj7,Canadair CRJ-700,Delta Connection
aa4200,n760ev,crj7,Canadair CRJ-700,Delta Connection
aa4322,n760sk,crj7,Canadair CRJ-701ER,United Express
aa466f,n761nd,crj7,Canadair CRJ-700,Delta Connection
aa4a90,n762sk,crj7,Canadair CRJ-701ER,United Express
aa4e47,n763sk,crj7,Canadair CRJ-701ER,United Express
aa51fe,n764sk,crj7,Canadair CRJ-701ER,United Express
aa55b5,n765sk,crj7,Canadair CRJ-701ER,United Express
aab99f,n790sk,crj7,Canadair CRJ-702ER,United Express
aabd56,n791sk,crj7,Canadair CRJ-702ER,United Express
aac10d,n792sk,crj7,Canadair CRJ-702ER,United Express
aa6aa1,n770sk,crj7,Canadair CRJ-701ER,United Express
aa6e58,n771sk,crj7,Canadair CRJ-701ER,United Express
aa720f,n772sk,crj7,Canadair CRJ-701ER,United Express
aa75c6,n773sk,crj7,Canadair CRJ-701ER,United Express
aa797d,n774sk,crj7,Canadair CRJ-701ER,United Express
aa80eb,n776sk,crj7,Canadair CRJ-701ER,United Express
aa8859,n778sk,crj7,Canadair CRJ-701ER,United Express
aa8c10,n779sk,crj7,Canadair CRJ-702ER,United Express
aa9220,n780sk,crj7,Canadair CRJ-702ER,United Express
aa998e,n782sk,crj7,Canadair CRJ-702ER,United Express
aa9d45,n783sk,crj7,Canadair CRJ-702ER,United Express
aaa0fc,n784sk,crj7,Canadair CRJ-702ER,United Express
aaa4b3,n785sk,crj7,Canadair CRJ-702ER,United Express
aaa86a,n786sk,crj7,Canadair CRJ-702ER,United Express
aac4c4,n793sk,crj7,Canadair CRJ-702ER,United Express
aac87b,n794sk,crj7,Canadair CRJ-702ER,United Express
aacc32,n795sk,crj7,Canadair CRJ-702ER,United Express
aacfe9,n796sk,crj7,Canadair CRJ-702ER,United Express
aad3a0,n797sk,crj7,Canadair CRJ-702ER,United Express
aa596c,n766sk,crj7,Canadair CRJ-701ER,United Express
aa5d23,n767sk,crj7,Canadair CRJ-700,SkyWest Airlines
aa60da,n768sk,crj7,Canadair CRJ-701ER,United Express
aaf2c6,n804x,crj7,Canadair CRJ-700,Private owner
aaac21,n787sk,crj7,Canadair CRJ-702ER,United Express
aaafd8,n788sk,crj7,Canadair CRJ-702ER,United Express
aab38f,n789sk,crj7,Canadair CRJ-702ER,United Express
abf6a4,n870dc,crj7,Canadair CRJ-700,Private owner
abfe12,n872dc,crj7,Bombardier Challenger 870,Private owner
506c33,s5-aay,crj7,Canadair CRJ-700,Adria Airways
60183e,ez-b024,crj7,Canadair Challenger 870,Turkmenistan Airlines
7b7026,b-4069,crj7,Canadair Challenger 870,PLAAF - China Air Force
a6d5f8,n54ea,crj7,Canadair CRJ-701ER,Elite Airways
aa8e92,n78ea,crj7,Canadair CRJ-701ER,Elite Airways
a00184,n1rl,crj7,Canadair CRJ-700,Private owner
280daa,n526ea,crj7,,
8463b4,ja12rj,crj7,Bombardier CRJ-702ER,Ibex Airlines
a04187,n1153,crj7,,
7800c9,b-4063,crj7,Bombardier Challenger 870,PLAAF - China Air Force
780075,b-4062,crj7,Bombardier Challenger 870,PLAAF - China Air Force
7b0fcd,b-4068,crj7,Bombardier Challenger 870,PLAAF - China Air Force
780074,b-4061,crj7,Bombardier Challenger 870,PLAAF - China Air Force
7b0a1b,b-4066,crj7,Bombardier Challenger 870,PLAAF - China Air Force
7b0949,b-4065,crj7,Bombardier Challenger 870,PLAAF - China Air Force
7b0eab,b-4067,crj7,Bombardier Challenger 870,PLAAF - China Air Force
506c35,s5-aaw,crj7,,
0d8135,yv2088,crj7,,
354163,n768sk,crj7,,
a6e6cd,n544ae,crj7,,
7803ce,b-4060,crj7,,
340f2b,n707sk,crj7,,
c01a1c,c-fjxb,crj7,,
31c7de,n515mj,crj7,,
846748,ja13rj,crj7,,
31c46d,n717ev,crj7,,
350856,n768sk,crj7,,
a6bfae,n534ea,crj7,,
350dbe,n611sk,crj7,,
3545d7,n794sk,crj7,,
31c7d4,n759ev,crj7,,
354664,n609sk,crj7,,
354cb1,n762sk,crj7,,
31c586,n750ev,crj7,,
2f870e,n658ca,crj7,,
31c015,n744ev,crj7,,
31c04f,n723ev,crj7,,
31ce8b,n717ev,crj7,,
31c151,n724ev,crj7,,
34086f,n724sk,crj7,,
3546a1,n606sk,crj7,,
354534,n614sk,crj7,,
31caef,n720ev,crj7,,
340244,n724sk,crj7,,
31cde9,n722ev,crj7,,
31cf57,n720ev,crj7,,
31c15a,n709ev,crj7,,
350190,n752sk,crj7,,
3548fb,n614sk,crj7,,
35439c,n604sk,crj7,,
31c98b,n753ev,crj7,,
268260,n712sk,crj7,,
340c2b,n726sk,crj7,,
31cab2,n707ev,crj7,,
31c179,n717ev,crj7,,
354007,n614sk,crj7,,
31ccfa,n515mj,crj7,,
3407b7,n740sk,crj7,,
3547ef,n606sk,crj7,,
268a28,n778sk,crj7,,
31c4ce,n748ev,crj7,,
3505db,n609sk,crj7,,
2f8070,n378ca,crj7,,
31c3d3,n753ev,crj7,,
2f80c6,n331ca,crj7,,
31cdc8,n758ev,crj7,,
340839,n707sk,crj7,,
31c036,n760ev,crj7,,
31c070,n750ev,crj7,,
31c42a,n744ev,crj7,,
31c2fc,n754ev,crj7,,
350251,n215ag,crj7,,
31c930,n719ev,crj7,,
340502,n716sk,crj7,,
35430e,n773sk,crj7,,
354204,n770sk,crj7,,
35425a,n762sk,crj7,,
3540c6,n768sk,crj7,,
354cad,n633sk,crj7,,
a63dac,n501ae,crj7,,
31c52e,n759ev,crj7,,
354064,n762sk,crj7,,
3546c8,n606sk,crj7,,
3547cb,n763sk,crj7,,
340171,n778sk,crj7,,
340698,n740sk,crj7,,
34047a,n705sk,crj7,,
340068,n760sk,crj7,,
31c043,n741ev,crj7,,
31cb89,n713ev,crj7,,
ab5666,n83ea,crj7,,
340965,n712sk,crj7,,
340282,n746sk,crj7,,
c088af,c-gztu,crj7,,
34068b,n719sk,crj7,,
31c53c,n740ev,crj7,,
31c201,n717ev,crj7,,
31c8b8,n510mj,crj7,,
31c2e0,n751ev,crj7,,
31ccfb,n515mj,crj7,,
