icao,regid,mdl,type,operator
4844ca,ph-nda,pa12,Piper PA-12,Private owner
a2a903,n2701m,pa12,Piper PA-12 Super Cruiser,Private owner
a3b3ca,n338cs,pa12,,
aa6b8a,n7701h,pa12,Piper PA-12 Super Cruiser,Private owner
a4128a,n3611m,pa12,Piper PA-12 Super Cruiser,Private owner
4b271c,hb-ovc,pa12,Piper PA-12 Super Cruiser,Private owner
a3d2ae,n3453m,pa12,,
a01003,n103bs,pa12,,
a54dd3,n4406m,pa12,,
acb612,n918tf,pa12,,
add048,n98999,pa12,,
aaa683,n78574,pa12,,
a20f4a,n2315m,pa12,,
a4695f,n3834m,pa12,,
ac1682,n87803,pa12,,
aaa313,n78495,pa12,,
a26d24,n2555m,pa12,,
a4c54f,n4060m,pa12,,
a51cd3,n4288m,pa12,,
a5588f,n4433m,pa12,,
a43b21,n3719m,pa12,,
a2a2f3,n2691m,pa12,,
a4e583,n4141m,pa12,,
a36805,n3188m,pa12,,
aa32d6,n7561h,pa12,,
a54078,n4377m,pa12,,
a3aee6,n3363m,pa12,,
aabea8,n7914h,pa12,,
a48668,n3909m,pa12,,
a2b825,n2743m,pa12,,
a52e08,n4328m,pa12,,
a2acdd,n2712m,pa12,,
a34d0f,n3111m,pa12,,
aaa286,n78454,pa12,,
458d8c,oy-cll,pa12,,
a98770,n713cm,pa12,,
add021,n98985,pa12,,
a321b6,n3000m,pa12,,
a421cf,n3654m,pa12,,
a9852f,n712tl,pa12,,
a26570,n2533m,pa12,,
acdbdf,n92798,pa12,,
a3c481,n3418m,pa12,,
a2f214,n2892m,pa12,,
a358e9,n3146t,pa12,,
a0e57e,n157pj,pa12,,
adcfdb,n98965,pa12,,
a5c772,n4712c,pa12,,
a25a6e,n2504m,pa12,,
