icao,regid,mdl,type,operator
06a058,a7-asa,c501,Cessna 501 Citation 1SP,Private owner
0d03db,xb-ixt,c501,Cessna 501 Citation ISP,Private owner
0d0897,fam3931,c501,Cessna 501 Citation 1SP,Fuerza Aerea Mexicana
300211,i-frai,c501,Cessna 501 Citation ISP,Private owner
34304a,ec-kgx,c501,Cessna 501 Citation 1/SP,Private owner
34425a,ec-lpp,c501,Cessna 501 Citation 1/SP,Private owner
399620,f-hfra,c501,Cessna 501 Citation 1SP,Airlec Air Espace
3e27c2,d-iggg,c501,Cessna	501 Citation 1,Private Owner
44016a,oe-fmk,c501,Cessna 501 Citation 1/SP,Private owner
48450f,ph-dez,c501,Cessna 501 Citation 1/SP,Stella Aviation Charter
500056,t7-tlm,c501,Cessna 501 Citation 1SP,Private owner
7c19aa,vh-fcs,c501,Cessna 501 Citation 1/SP,Private owner
7c1c2c,vh-fum,c501,Cessna 501 Citation ISP,Australasian Jet
7c43dc,vh-nou,c501,Cessna 501 Citation 1SP,Private owner
7c6c78,vh-vpm,c501,Cessna 501 Citation 1/SP,Private owner
a005c4,n100lx,c501,Cessna 501 Citation 1/SP,Private owner
a00824,n1008,c501,Cessna 501 Citation ISP,Private owner
a009f2,n101rr,c501,Cessna 501 Citation ISP,Private owner
a04b74,n118rt,c501,Cessna 501 Citation ISP,Private owner
a0519f,n12cv,c501,Cessna 501 Citation ISP,Private owner
a05336,n12vb,c501,Cessna 501 Citation ISP,Private owner
a05355,n12wh,c501,Cessna 501 Citation ISP,Private owner
a0c81f,n15cy,c501,Cessna 501 Citation 1/SP,Private owner
a07ccf,n130sp,c501,Cessna 501 Citation ISP,Private owner
a0cf84,n151sp,c501,Cessna 501 Citation ISP,Private owner
a0f08c,n16nl,c501,Cessna 501 Citation ISP,Private owner
a0f137,n16vg,c501,Cessna 501 Citation ISP,Private owner
a04748,n117ma,c501,Cessna 501 Citation ISP,Private owner
a087e9,n133sc,c501,Cessna 501 Citation 1SP,Private owner
a0a233,n14va,c501,Cessna 501 Citation 1/SP,Private owner
a06027,n123pl,c501,Cessna 501 Citation ISP,Private owner
a066aa,n125ea,c501,Cessna 501 Citation ISP,Private owner
a0776c,n129zm,c501,,
a07a7a,n13st,c501,Cessna 501 Citation ISP,Private owner
a1912d,n20rm,c501,Cessna 501 Citation ISP,Private owner
a12841,n174cf,c501,Cessna 501 Citation Eagle II,Private owner
a13f05,n18hc,c501,Cessna 501 Citation ISP,Private owner
a1c203,n212m,c501,,
a189ee,n199dj,c501,Cessna 501 Citation ISP,Private owner
a1a112,n204ca,c501,Cessna 501 Citation ISP,Private owner
a1cd42,n215na,c501,Cessna 501 Citation ISP,Private owner
a1cf98,n2158u,c501,Cessna 501 Citation 1/SP,Private owner
a1d809,n218jg,c501,Cessna 501 Citation 1/SP,Private owner
a1df17,n22el,c501,Cessna 501 Citation ISP,Private owner
a233d5,n241bf,c501,Cessna 501 Citation ISP,Private owner
a26f0d,n256p,c501,Cessna 501 Citation ISP,Private owner
a2915f,n2648x,c501,Cessna 501 Citation ISP,Private owner
a22658,n238bg,c501,Cessna 501 Citation ISP,Private owner
a2a62c,n27ww,c501,Cessna 501 Citation ISP,Private owner
a2f85e,n2904,c501,Cessna 501 Citation ISP,Private owner
a3399e,n307d,c501,Cessna 501 Citation ISP,Private owner
a34c3f,n311tp,c501,Cessna 501 Citation ISP,Private owner
a34c71,n311vp,c501,Cessna 501 Citation ISP,Private owner
a37760,n322st,c501,Cessna 501 Citation ISP,Private owner
a37e26,n324l,c501,Cessna 501 Citation ISP,Private owner
a31b43,n3gn,c501,Cessna 501 Citation ISP,Private owner
a31ca6,n3wt,c501,Cessna 501 Citation ISP,Private owner
a32364,n301dr,c501,Cessna 501 Citation ISP,Private owner
a38d35,n328na,c501,Cessna 501 Citation ISP,Private owner
a364e1,n318dn,c501,Cessna 501 Citation ISP,Private owner
a3b7fb,n339hp,c501,Cessna 501 Citation ISP,Private owner
a3d86a,n347mh,c501,Cessna 501 Citation ISP,Private owner
a48127,n39hh,c501,Cessna 501 Citation ISP,Private owner
a4008d,n357tx,c501,Cessna 501 Citation ISP,Private owner
a41053,n361de,c501,Cessna 501 Citation ISP,Private owner
a4d26f,n41gt,c501,Cessna 501 Citation ISP,Private owner
a57177,n45tl,c501,Cessna 501 Citation ISP,Private owner
a580fb,n454ac,c501,Cessna 501 Citation ISP,Private owner
a58530,n455fd,c501,Cessna 501 Citation 1/SP,Private owner
a6378a,n5zn,c501,Cessna 501 Citation ISP,Private owner
a63da7,n501a,c501,,
a63da9,n501ab,c501,,
a63dab,n501ad,c501,Cessna 501 Citation ISP,Private owner
a63dad,n501af,c501,Cessna 501 Citation ISP,Private owner
a63db9,n501at,c501,Cessna 501 Citation ISP,Private owner
a63dc2,n501bb,c501,Cessna 501 Citattion ISP,Barefoot Aviation
a63ddb,n501cb,c501,Cessna 501 Citation ISP,Private owner
a63ddd,n501cd,c501,Cessna 501 Citation ISP,Private owner
a63ddf,n501cf,c501,Cessna 501 Citation ISP,Private owner
a63de7,n501cp,c501,Cessna 501 Citation ISP,Private owner
a63df6,n501dd,c501,Cessna 501 Citation ISP,Private owner
a63e0c,n501ea,c501,Cessna 501 Citation ISP,Private owner
a63e2d,n501fj,c501,Cessna 501 Citation ISP,Private owner
a63e3d,n501g,c501,Cessna 501 Citation ISP,Private owner
a63e67,n501hs,c501,Cessna 501 Citation ISP,Private owner
a63e73,n501jd,c501,Cessna 501 Citation ISP,Private owner
a63e7b,n501jm,c501,Cessna 501 Citation ISP,Private owner
a63e94,n501km,c501,Cessna 501 Citation ISP,Private owner
a63ebc,n501mb,c501,Cessna 501 Citation ISP,Private owner
a63ec0,n501mf,c501,Cessna 501 Citation ISP,Private owner
a63eea,n501ny,c501,Cessna 501 Citation ISP,Private owner
a63f00,n501pv,c501,Cessna 501 Citation ISP,Private owner
a63f21,n501rc,c501,Cessna 501 Citation ISP,Private owner
a63f25,n501rg,c501,Cessna 501 Citation ISP,Private owner
a63f45,n501sp,c501,Cessna 501 Citation ISP,Private owner
a63f52,n501tb,c501,Cessna 501 Citation 1/SP,Private owner
a63f5e,n501tp,c501,Cessna 501 Citation ISP,Private owner
a63f9d,n501wb,c501,Cessna 501 Citation ISP,Private owner
a63fa6,n501wl,c501,Cessna 501 Citation ISP,Private owner
a63fb4,n501x,c501,Cessna 501 Citation 1SP,Private owner
a64193,n502cc,c501,Cessna 501 Citation 1SP,Private owner
a64c9e,n505bb,c501,Cessna 501 Citation ISP,Private owner
a64cbb,n505cf,c501,Cessna 501 Citation ISP,Private owner
a64d53,n505jh,c501,,
a64e03,n505rj,c501,Cessna 501 Citation ISP,Private owner
a651e9,n506tf,c501,Cessna 501 Citation 1/SP,Private owner
a65fa5,n51ft,c501,,
a665d8,n511hc,c501,Cessna 501 Citation ISP,Private owner
a68849,n52tl,c501,Cessna 501 Citation ISP,Private owner
a69cda,n525pv,c501,Cessna 501 Citation ISP,Private owner
a70446,n551ms,c501,Cessna 501 Citation ISP,Private owner
a706e2,n552aj,c501,Cessna 501 Citation ISP,Private owner
a70ff0,n554t,c501,Cessna 501 Citation ISP,Private owner
a712f4,n555kw,c501,Cessna 501 Citation ISP,Private owner
a725a0,n56lw,c501,Cessna 501 Citation ISP,Private owner
a725d8,n56pb,c501,Cessna 501 Citation ISP,Private owner
a7268a,n56we,c501,Cessna 501 Citation ISP,Private owner
a73b58,n565v,c501,Cessna 501 Citation ISP,Private owner
a6a368,n527ew,c501,Cessna 501 Citation ISP,Private owner
a6a702,n528ds,c501,Cessna 501 Citation ISP,Private owner
a74c90,n57fc,c501,Cessna 501 Citation ISP,Private owner
a6de1e,n5411,c501,Cessna 501 Citation ISP,Private owner
a7c55f,n60ew,c501,Cessna 501 Citation 1SP,Private owner
a7a8ba,n593bw,c501,Cessna 501 Citation ISP,Private owner
a7ef5b,n610gg,c501,Cessna 501 Citation ISP,Private owner
a830a2,n627e,c501,Cessna 501 Citation ISP,Private owner
a88c6a,n65ww,c501,Cessna 501 Citation ISP,Private owner
a88cd6,n650bc,c501,Cessna 501 Citation ISP,Private owner
a85532,n636n,c501,Cessna 501 Citation ISP,Private owner
a86303,n64bh,c501,Cessna 501 Citation ISP,Private owner
a8b203,n66bk,c501,Cessna 501 Citation ISP,Private owner
a8c7eb,n665mm,c501,Cessna 501 Citation 1SP,Private owner
a8f237,n676cc,c501,Cessna 501 Citation ISP,Private owner
a8f68d,n677jm,c501,Cessna 501 Citation ISP,Private owner
a90ac4,n682bf,c501,Cessna 501 Citation ISP,Private owner
a92cc1,n690wy,c501,Cessna 501 Citation ISP,Private owner
a97aae,n71l,c501,Cessna 501 Citation ISP,Private owner
a97abc,n71lp,c501,Cessna 501 Citation 1SP,Private owner
a9e68c,n737rj,c501,Cessna 501 Citation 1/SP,Private owner
a9504d,n7en,c501,Cessna 501 Citation 1/SP,Private owner
a95107,n7mz,c501,Cessna 501 Citation 1/SP,Private owner
a9518f,n7tk,c501,Cessna 501 Citation 1SP,Private Owner
a9526e,n70cg,c501,Cessna 501 Citation ISP,Private owner
a95363,n70nb,c501,Cessna 501 Citation ISP,Private owner
a9af89,n723jr,c501,Cessna 501 Citation ISP,Private owner
aabc8a,n791jf,c501,Cessna 501 Citation ISP,Private owner
aac32b,n793aa,c501,Cessna 501 Citation ISP,Private owner
ab0769,n81eb,c501,Cessna 501 Citation ISP,Private owner
aae034,n80ha,c501,,
aae11f,n80sl,c501,Cessna 501 Citation ISP,Private owner
aa672f,n77fd,c501,Cessna 501 Citation ISP,Private owner
ab2e8b,n82aj,c501,Cessna 501 Citation II,Private owner
ab2edf,n82dt,c501,,
ab2fc7,n82p,c501,Cessna 501 Citation ISP,Private owner
ab44c4,n825ps,c501,Cessna 501 Citation ISP,Private owner
aaf25b,n804st,c501,Cessna 501 Citation Eagle I,Private owner
ac91f1,n909ps,c501,Cessna 501 Citation ISP,Private owner
ac9460,n91ap,c501,Cessna 501 Citation ISP,Private owner
ac9508,n91hg,c501,Cessna 501 Citation ISP,Private owner
ac9600,n91te,c501,Cessna 501 Citation ISP,Private owner
ac9741,n910g,c501,Cessna 501 Citation ISP,Private owner
acc1ff,n921be,c501,Cessna 501 Citation ISP,Private owner
ac3cdf,n888pn,c501,Cessna 501 Citation ISP,Private owner
ac40dc,n889sh,c501,Cessna 501 Citattion ISP,Private owner
ac6cbb,n9zb,c501,Cessna 501 Citation ISP,Private owner
ad407e,n953hc,c501,Cessna 501 Citation ISP,Private owner
adf536,n999ms,c501,Cessna 501 Citation ISP,Private owner
adf56c,n999pw,c501,Cessna 501 Citation ISP,Private owner
ada8df,n98av,c501,Cessna 501 Citation ISP,Private owner
adc1ca,n986ds,c501,Cessna 501 Citation ISP,Private owner
add086,n99ck,c501,Cessna 501 Citation ISP,Private owner
ad7640,n967b,c501,Cessna 501 Citation ISP,Private owner
ade60c,n995jp,c501,Cessna 501 Citation ISP,Private owner
c07078,c-gqpj,c501,Cessna 501 Citation Stallion,Air Partners
c0784c,c-gtol,c501,Cessna 501 Citation 1/SP,Private owner
e48277,pp-eif,c501,Cessna 501 Citation ISP,Private owner
a63eca,n501mr,c501,Cessna 501 Citation ISP,Private owner
a34ba0,xb-tmg,c501,Cessna 501 Citation I,Private owner
a0da9e,n154sc,c501,Cessna 501 Citation ISP,Private owner
a28614,n2617u,c501,Cessna 501 Citation ISP,Private owner
a10876,n166fa,c501,Cessna 501 Citation ISP,Private owner
a2080c,n23vk,c501,Cessna 501 Citation ISP,Private owner
a89f5f,n655at,c501,Cessna 501 Citation ISP,Private owner
a54961,n44mk,c501,Cessna 501 Citation ISP,Private owner
ab0a5d,n810lg,c501,Cessna 501 Citation ISP,Private owner
adf617,n999ws,c501,Cessna 501 Citation ISP,Private owner
a02cfd,n110jb,c501,Cessna 501 Citation ISP,Private owner
a56c69,n449dt,c501,Cessna 501 Citation Eagle II,Private owner
00a872,zs-php,c501,Cessna 501 Citation 1SP,Private owner
a63dbf,n501az,c501,Cessna 501 Citation ISP,Private owner
a3957f,n33ww,c501,Cessna 501 Citation ISP,Private owner
