icao,regid,mdl,type,operator
43e90d,m-abeu,lj45,Learjet 45,Ryanair
43ea06,m-abgv,lj45,Learjet 45,Ryanair
4ac979,se-rky,lj45,Learjet 45,Ambulansflyg
43ea86,m-abja,lj45,Learjet 45,Ryanair
008644,zs-cjb,lj45,,
4bca62,tc-rsb,lj45,,
4b8da2,tc-cmb,lj45,,
