icao,regid,mdl,type,operator
e40050,fab5923,e314,Embraer A-29B Super Tucano,Brazilian Air Force
e400e0,fab5919,e314,Embraer A-29 Super Tucano,Brazilian Air Force
e400e5,fab5924,e314,Embraer A29B Super Tucano,Brazilian air force
e400e7,fab5718,e314,Embraer A-29A Super Tucano,Brazilian Air Force
e400f1,fab5938,e314,Embraer A-29B Super Tucano,Brazilian Air Force
e400f7,fab5939,e314,Embraer A-29B Super Tucano,Brazilian Air Force
e400f8,fab5940,e314,Embraer A-29B Super Tucano,Brazilian Air Force
e40550,fab5943,e314,Embraer A-29B Super Tucano,Brazilian Air Force
e40160,fab5959,e314,Embraer A-29B Super Tucano,Brazilian Air Force
e400fa,fab5949,e314,Embraer A-29B Super Tucano,Brazilian Air Force
e49202,pt-zop,e314,,
e49201,pt-zoq,e314,,
e491fc,pt-zog,e314,,
e49200,pt-zon,e314,,
e400fc,fab5715,e314,Embraer EMB314 Super Tucano,Brazilian Air Force
e400ed,fab5714,e314,Embraer EMB 314,Brazilian Air Force
e40103,fab1541,e314,Embraer A-29A Super Tucano,Brazilian Air Force
e400fd,fab5716,e314,Embraer A-29A Super Tucano,Brazilian Air Force
e40410,fab59,e314,Embraer E314 Super Tucano,Brazilian Air Force
e4015a,fab5729,e314,Embraer A-29a Super Tucano,Brazilian Air Force
e400cf,fab5951,e314,Embraer E314,Brazilian Air Force
e400cc,fab5914,e314,,
e40164,fab5956,e314,,
e400bc,fab5902,e314,,
e400ca,fab5952,e314,,
e400cd,fab5925,e314,,
e400c3,fab5906,e314,,
e400c2,fab5905,e314,,
e4015c,fab5731,e314,,
e40105,fab5713,e314,,
e400c4,fab5954,e314,,
e4016a,fab5962,e314,,
e4010c,fab5947,e314,,
e400ec,fab5915,e314,,
e491b3,pt-znv,e314,,
05cc01,tz-01c,e314,,
05cc02,tz-02c,e314,,
05cc04,tz-04c,e314,,
05cc03,tz-03c,e314,,
e80657,fach-458,e314,,
e40109,fab5946,e314,,
e40106,fab5945,e314,,
