icao,regid,mdl,type,operator
4d02d2,lx-mik,l39,Aero Vodochody L39C Albatros,Private owner
502c5c,yl-kst,l39,Aero Vodochody L-39C Albatros,Baltic Bees Jet Team
511036,es-tlb,l39,Aero L-39 Albatros,Breitling Jet Team
511040,es-ylz,l39,Aero L-39 Albatros,Skyline Aviation
511056,es-tlh,l39,Aero L-39C Albatros,Lions Air
511068,es-raz,l39,Aero L-39C Albatros,Lions Air
511080,es-tln,l39,Aero L-39C Albatros,Team Russ
511083,es-tlq,l39,Aero L-39C Albatros,RUSS Aerobatic Team
51108e,es-tle,l39,Aero L39ZO Albatros,Skyline Aviation
5110b6,es-,l39,Aero L-39 Albatros,Breitling Jet Team
49d31f,ok-mja,l39,Aero L-39 Albatros,Private owner
7c6c4b,vh-vod,l39,Boeing 737-8BK,Virgin Australia
7c702c,vh-wfy,l39,Aero Vodochody L-39C,Private owner
a091eb,n136em,l39,Aero L-39 Albatros,Private owner
a09d11,n139en,l39,Aero Vodochody L39C,Private owner
a09d15,n139es,l39,Aero Vodochody L39C,Private owner
a09dee,n139pj,l39,Aero Vodochody L39,Private owner
a09ef9,n1390a,l39,Aero Vodochody L-139 Albatros,Private owner
a1c874,n214ax,l39,Aero Vodochody L39ZA,Private owner
a1cc2b,n215ax,l39,Aero Vodochody L39ZA,Private owner
a1cfe2,n216ax,l39,Aero Vodochody L39ZA,Private owner
a1ed72,n223pg,l39,Aero Vodochody L39,Private owner
a24b97,n247sg,l39,Aero Vodochody L39C,Private owner
a480ea,n39ex,l39,Aero Vodochody L39,Private owner
a48142,n39jk,l39,Aero L-39 Albatros,Private owner
a4814c,n39jv,l39,Aero L-39 Albatros,Private owner
a54a63,n44xt,l39,,
ab0ad6,n810rc,l39,Aero Vodochody L39C,Private owner
c81d83,zk-ccp,l39,Aero L-39C Albatros,Private owner
a3b97e,n339za,l39,Aero L-39 Albatros,Private owner
5110b5,es-tlt,l39,Aero L-39 Albatros,Breitling Jet Team
511091,yl-kst,l39,Aero L-39 Albatros,Baltic Bees Jet Team
502c65,yl-ksm,l39,Aero L-39 Albatros,Baltic Bees Jet Team
511081,es-tlo,l39,Aero L-39 Albatros,AeroHooldus
5110bc,es-tlu,l39,Aero L-39 Albatros,Breitling Jet Team
5110a0,es-tls,l39,,
511047,es-ylf,l39,,
511048,es-tlf,l39,,
a09dc4,n139ms,l39,,
505fb1,5302,l39,,
a22a40,n239df,l39,,
511035,es-ylx,l39,,
a9a15e,n72bt,l39,,
a0571e,n12076,l39,,
259231,yl-kss,l39,,
a09db2,n139lz,l39,,
259229,ly-f50,l39,,
a09d9f,n139le,l39,,
5110d8,es-tlv,l39,,
a48233,n39ua,l39,,
a0ac41,n142xx,l39,,
a15874,n186rg,l39,,
511082,es-tlp,l39,,
259230,ly-f51,l39,,
a09d9a,n139l,l39,,
7c3334,vh-kee,l39,,
a09cf1,n139df,l39,,
5110d9,es-tgv,l39,,
a3b86b,n339na,l39,,
a09df1,n139pm,l39,,
a480a1,n39bz,l39,,
