icao,regid,mdl,type,operator
00b09d,zs-ska,f70,Fokker 70,AirQuarius
0c800c,pz-tfa,f70,Fokker 70,Fly All Ways
440023,oe-lfj,f70,Fokker 70,Austrian Airlines
440025,oe-lfi,f70,Fokker 70,Austrian Airlines
440c7b,oe-lfh,f70,Fokker 70,Austrian Airlines
440c84,oe-lfp,f70,Fokker 70,Austrian Airlines
440c9b,oe-lfq,f70,Fokker 70,Austrian Airlines
440c9c,oe-lfr,f70,Fokker 70,Austrian Airlines
4840ce,ph-kbx,f70,Fokker 70,Netherlands Government
4840d3,ph-kza,f70,Fokker 70,KLM Cityhopper
4840d4,ph-kzb,f70,Fokker 70,KLM Cityhopper
4840d5,ph-kzc,f70,Fokker 70,KLM Cityhopper
4840d6,ph-kzd,f70,Fokker 70,KLM Cityhopper
4840e2,ph-kze,f70,Fokker 70,KLM Cityhopper
4840e3,ph-kzf,f70,Fokker 70,KLM Cityhopper
4840e6,ph-kzi,f70,Fokker 70,KLM Cityhopper
4840e7,ph-kzk,f70,Fokker 70,KLM Cityhopper
4840fd,ph-wxc,f70,Fokker 70,KLM Cityhopper
484125,p4-fkb,f70,Fokker 70,InselAir Aruba
48416f,ph-kzm,f70,Fokker 70,KLM Cityhopper
484170,ph-kzl,f70,Fokker 70,KLM Cityhopper
4841a4,ph-kzn,f70,Fokker 70,KLM Cityhopper
4841b8,ph-kzo,f70,Fokker 70,KLM Cityhopper
4841b9,ph-kzp,f70,Fokker 70,KLM Cityhopper
4841ba,ph-kzr,f70,Fokker 70,KLM Cityhopper
484337,p4-fka,f70,Fokker 70,InselAir Aruba
484365,p4-fkc,f70,Fokker 70,InselAir Aruba
4843c6,ph-wxd,f70,Fokker 70,KLM Cityhopper
484b00,ph-kzs,f70,Fokker 70,KLM Cityhopper
484b01,ph-kzt,f70,Fokker 70,KLM Cityhopper
484b02,ph-kzu,f70,Fokker 70,KLM Cityhopper
7c2e45,vh-jfb,f70,Fokker 70,Alliance Airlines
7c2e48,vh-jfe,f70,Fokker 70,Alliance Airlines
7c434c,vh-nku,f70,Fokker 70,Alliance Airlines
7c5351,vh-qqr,f70,Fokker 70,Alliance Airlines
7c5355,vh-qqv,f70,Fokker 70,Alliance Airlines
7c5356,vh-qqw,f70,Fokker 70,Alliance Airlines
7c5357,vh-qqx,f70,Fokker 70,Alliance Airlines
7c5358,vh-qqy,f70,Fokker 70,Alliance Airlines
8980a3,p2-anr,f70,Fokker 70,Air Niugini
8980aa,p2-ans,f70,Fokker 70,Air Niugini
a3769f,n322k,f70,Fokker F70,Ford Motor Company
8980ca,p2-ant,f70,Fokker 70,Air Niugini
8980d3,p2-anu,f70,,
4850ac,p4-fkd,f70,Fokker 70,InselAir Aruba
8980d4,p2-anv,f70,,
0c800d,pz-tfb,f70,,
7c4348,vh-nkq,f70,,
7c32db,vh-kbx,f70,,
8a0500,pk-tnr,f70,,
4c8066,5b-dda,f70,,
4176e2,002,f70,,
8980e0,p2-any,f70,,
4c806d,5b-dbb,f70,,
5c2e48,vh-jfe,f70,,
