icao,regid,mdl,type,operator
343606,ec-ldx,ball,Ultramagic N300,Vol de Coloms
344586,ec-mak,ball,Gas Balloon,Private owner
3f30ac,d-owbi,ball,Balloon NL-510/STU,Ballonbau Woerner
3fc31d,d-olib,ball,Balloon,Private owner
3fd39d,d-oron,ball,Balloon,Private owner
3fd6cf,d-ostz,ball,Balloon,Private owner
448a2b,oo-bqk,ball,Lindstrand LBL-260A,Private owner
484692,ph-sal,ball,Cameron A-275,Private owner
484a42,ph-grv,ball,Cameron	A-250,Greetzz V.o.F.
484c28,ph-grr,ball,Cameron A-450LW,Greetzz Equipment B.V.
484ee2,ph-faj,ball,Kubicek BB70Z,Private owner
4b2b47,hb-qkd,ball,Balony Kubicek BB37N,Private owner
4b2b49,hb-qkf,ball,Ballonbau NL-STU/1000,Private owner
4b2bdb,hb-qpv,ball,Ultramagic M-145,Private owner
4b2c09,hb-qrp,ball,Ultramagic M-145,Private owner
a1b46e,n209lb,ball,Beech G58 Baron,Private owner
a4a937,n4pc,ball,Lindstrand Sphere-105,Private owner
3fdf72,d-owba,ball,Balloon,Private owner
440557,oe-see,ball,Hot Air Balloon,Private owner
3fc640,d-ommy,ball,Hot Air Balloon,Private owner
3f3489,d-ofun,ball,Hot Air Balloon,Private owner
3f282e,d-obw,ball,Balloon,Private owner
3fd8a5,d-otmb,ball,Balloon,Private owner
3fc72c,d-omwa,ball,Balloon,Private owner
4b2b86,hb-qmo,ball,Balloon Ultramagic N-180,Air Ballonteam
3fd6b8,d-ostc,ball,Balloon,Private owner
3fd57f,d-ohsb,ball,Balloon,Private owner
44057c,oe-soe,ball,,
4b2c84,hb-qwi,ball,Schroder fire baloon,Private owner
ba1f03,balloon,ball,Balloon,Google Loon
ba1f09,balloon,ball,Balloon,Google Loon
ba1f16,balloon,ball,Balloon,Google Loon
ba1f06,balloon,ball,Balloon,Google Loon
ba1f0b,balloon,ball,Balloon,Google Loon
ba1029,balloon,ball,Balloon,Google Loon
ba1f18,balloon,ball,Balloon,Google Loon
ba1f17,balloon,ball,Balloon,Google Loon
ba1f19,balloon,ball,Balloon,Google Loon
ba102b,balloon,ball,Balloon,Google Loon
ba1037,balloon,ball,Balloon,Google Loon
ba1030,balloon,ball,Balloon,Google Loon
ba1008,balloon,ball,Balloon,Google Loon
405452,g-cial,ball,Cameron Z-77,Private owner
3fd6ce,d-osty,ball,Balloon,Private owner
4b2c49,hb-qub,ball,Kubicek BB22XR,Private owner
4405fd,oe-rlb,ball,Hot Air Balloon,Private owner
ba101a,balloon,ball,Balloon,Google Loon
3f3298,d-ofbk,ball,Balloon,Private owner
3f3214,d-oewi,ball,Balloon,Private owner
010170,10170,ball,,
ba10b2,balloon,ball,Balloon,Google Loon
ba104b,balloon,ball,Balloon,Google Loon
ba104c,balloon,ball,Balloon,Google Loon
ba104e,balloon,ball,Balloon,Google Loon
ba10f6,balloon,ball,Balloon,Google Loon
ba107f,balloon,ball,Balloon,Google Loon
ba1041,balloon,ball,Balloon,Google Loon
ba1024,balloon,ball,Balloon,Google Loon
38683b,f-ppse,ball,Leys VL 1050,Private owner
4b2c3f,hb-qtr,ball,Kubicek BB37Z,Private owner
4b2c3b,hb-qtn,ball,Balony Kubicek BB37Z,Private owner
ba107b,balloon,ball,Balloon,Google Loon
ba1108,hbal403,ball,Balloon,Google Loon
ba1007,balloon,ball,Balloon,Google Loon
ba1084,balloon,ball,Balloon,Google Loon
ba10f5,hbal400,ball,Balloon,Google Loon
ba1044,balloon,ball,Balloon,Google Loon
ba107e,balloon,ball,Balloon,Google Loon
ba102c,balloon,ball,Balloon,Google Loon
44086a,oe-zzq,ball,,Private owner
ba1080,balloon,ball,Balloon,Google Loon
ba1050,balloon,ball,Balloon,Google Loon
ba10ed,balloon,ball,Balloon,Google Loon
ba10f0,balloon,ball,Balloon,Google Loon
4845fb,ph-kts,ball,Wörner NL-STU/1000,Private owner
484f1f,ph-tph,ball,Cameron Z-210,Private owner
ba10c0,balloon,ball,Balloon,Google Loon
ba1098,balloon,ball,Balloon,Google Loon
ba10b8,balloon,ball,Balloon,Google Loon
ba109a,balloon,ball,Balloon,Google Loon
484c2d,ph-laz,ball,Balloon Ultramagic N-300,Private owner
3fdd14,d-ovds,ball,Balloon,Private owner
ba1053,balloon,ball,Balloon,Google Loon
ba1081,balloon,ball,Balloon,Google Loon
4b2c0f,hb-qrv,ball,Wörner Balloon,Association Fribourg
ba104d,balloon,ball,Balloon,Google Loon
4b2b5e,hb-qla,ball,BB85Z,Private owner
3f2fa9,d-odyn,ball,Balloon,Private owner
4488b4,oo-bet,ball,Balloon,Private owner
4b2cdc,hb-qzs,ball,Ultramagic N-180,Private owner
484b87,ph-vnl,ball,Ultramagic N-210,Private owner
3fd4d5,d-osan,ball,Balloon,Private owner
4b2bcd,hb-qph,ball,Kubicek BB22Z,Private owner
180b54,ra-2900g,ball,"""Morton"" Roziere balloon",MORTON
ba10f3,balloon,ball,Balloon,Google Loon
4405e6,oe-szb,ball,BB 30,Ballonsportclub Graz Heinrichstraße 7
4b2b94,hb-qnc,ball,Ultramagic M-145,Take - Off Balloon
4b2b05,hb-qhp,ball,,
ba1088,balloon,ball,Balloon,Google Loon
3fd34e,d-orlm,ball,Balloon,Private owner
3fc472,d-olve,ball,Balloon,Private owner
4b2b77,hb-qlz,ball,Kubicek BB60Z,Private owner
4b03ad,hb-bkf,ball,Cameron O-160,Private owner
3f3129,d-oenh,ball,Balloon,Private owner
484cab,ph-lkp,ball,Schroeder Fire Balloons G,Private owner
ba1127,balloon,ball,Balloon,Google Loon
a085cd,n1326d,ball,Cameron O-90,Private Owner
3fdf7d,d-owbl,ball,Balloon,Private owner
ba1123,balloon,ball,Balloon,Google Loon
3fe0bd,d-ownt,ball,Balloon,Private owner
4b2c92,hb-qww,ball,Ultramagic M-120,Private owner
3fcdbf,d-orol,ball,Balloon,Private owner
4849f7,ph-nlv,ball,Cameron A-415,Haven Management B.V.
3f2c0b,d-ocox,ball,Balloon,Private owner
3fca3f,d-ooah,ball,Balloon,Private owner
3fc73e,d-omws,ball,Balloon,Private owner
4848b1,ph-spl,ball,Ultramagic S-160,Private owner
448837,oo-baw,ball,Ultramagic N-180,Belair Flying people
3f3795,d-ogyn,ball,Balloon,Private owner
3f2b98,d-ockm,ball,Balloon,Private owner
4b2c64,hb-qvc,ball,Ultramagic M-65C,Private owner
3fd23e,d-orba,ball,Balloon,Private owner
4b2c4b,hb-qud,ball,Cameron Balloons Z-120,"Centre alpin international, de Ballons à air chau"
3f2b1d,d-ocft,ball,Balloon,Private owner
3f2a61,d-obyn,ball,Balloon,Private owner
3f3f1b,d-ojup,ball,Balloon,Private owner
3fdf74,d-owbc,ball,BF Worner NL-640/STU,Private owner
3fdf7e,d-owbm,ball,Balloon,Private owner
3fc576,d-omfe,ball,Balloon,Private owner
3f309b,d-owml,ball,Balloon,Private owner
387ddb,f-pall,ball,,
38a33b,f-ppgb,ball,,
a64d49,n505hy,ball,,
484c27,ph-grw,ball,Cameron Z-600,Private owner
3fd6e6,d-oeim,ball,Balloon,Private owner
ba11e4,balloon,ball,,
484f2a,ph-gas,ball,Cameron A-210,Private owner
4b2b95,hb-qnd,ball,Schroder fire baloon G 42/24,Ballongruppe Zugersee
4b2cd5,hb-qzl,ball,,
4be422,rsist,ball,,
484f28,ph-ier,ball,,
4b2c6e,hb-qvm,ball,,
ba1272,balloon,ball,,
ba1270,balloon,ball,,
ba129f,balloon,ball,,
ba1259,balloon,ball,,
ba120d,balloon,ball,,
ba1283,balloon,ball,,
ba1205,balloon,ball,,
ba124d,balloon,ball,,
ba122f,balloon,ball,,
ba125d,balloon,ball,,
ba123f,balloon,ball,,
ba1234,balloon,ball,,
ba120b,balloon,ball,,
ba1255,balloon,ball,,
ba1239,balloon,ball,,
ba1221,balloon,ball,,
ba1257,balloon,ball,,
ba11dc,balloon,ball,,
ba1212,balloon,ball,,
ba124c,balloon,ball,,
ba1203,balloon,ball,,
ba122e,balloon,ball,,
3fc560,d-omus,ball,,
3fe009,d-owgv,ball,,
300510,i-cfco,ball,,
a3ee3e,n352wq,ball,,
ba144b,balloon,ball,,
ba1447,balloon,ball,,
ba1404,balloon,ball,,
ba1446,balloon,ball,,
ba1464,balloon,ball,,
3f3593,d-oget,ball,,
ba1316,balloon,ball,,
ba1442,balloon,ball,,
ba141d,balloon,ball,,
ba1320,balloon,ball,,
ba13c5,balloon,ball,,
ba13b8,balloon,ball,,
ba1388,balloon,ball,,
ba13cf,balloon,ball,,
ba1384,balloon,ball,,
ba12e9,balloon,ball,,
ba12e2,balloon,ball,,
ba1362,balloon,ball,,
ba1354,balloon,ball,,
ba12de,balloon,ball,,
ba1383,balloon,ball,,
ba1374,balloon,ball,,
ba134e,balloon,ball,,
ba141f,balloon,ball,,
ba13a5,balloon,ball,,
ba136c,balloon,ball,,
ba1321,balloon,ball,,
ba12e8,balloon,ball,,
ba1421,balloon,ball,,
ba1387,balloon,ball,,
ba130d,balloon,ball,,
ba137e,balloon,ball,,
ba137f,balloon,ball,,
ba136a,balloon,ball,,
ba1357,balloon,ball,,
ba1352,balloon,ball,,
ba12fa,balloon,ball,,
ba12db,balloon,ball,,
ba138c,balloon,ball,,
ba13a9,balloon,ball,,
ba12dc,balloon,ball,,
ba1393,balloon,ball,,
ba12ee,balloon,ball,,
ba13ac,balloon,ball,,
ba136b,balloon,ball,,
ba1370,balloon,ball,,
ba139f,balloon,ball,,
ba1378,balloon,ball,,
ba12f9,balloon,ball,,
ba13e1,balloon,ball,,
ba1417,balloon,ball,,
ba1405,balloon,ball,,
ba1455,balloon,ball,,
4b2c02,hb-qri,ball,,
ba144c,balloon,ball,,
ba143b,balloon,ball,,
ba140a,balloon,ball,,
ba143d,balloon,ball,,
ba144e,balloon,ball,,
ba1398,balloon,ball,,
ba1458,balloon,ball,,
ba13c2,balloon,ball,,
ba1456,balloon,ball,,
ba144d,balloon,ball,,
ba13eb,balloon,ball,,
484fd3,ph-sor,ball,,
4b2c70,hb-qvo,ball,,
ba1497,balloon,ball,,
a09383,n136wv,ball,,
a25ce6,n251th,ball,,
ba13ff,balloon,ball,,
ba146d,balloon,ball,,
ba1440,balloon,ball,,
ba1492,balloon,ball,,
ba147c,balloon,ball,,
ba1462,balloon,ball,,
ba145d,balloon,ball,,
ba13ec,balloon,ball,,
ba147f,balloon,ball,,
ba1461,balloon,ball,,
ba1472,balloon,ball,,
ba148b,balloon,ball,,
ba1483,balloon,ball,,
ba1479,balloon,ball,,
484ca2,ph-rkc,ball,,
ba147b,balloon,ball,,
ba1487,balloon,ball,,
ba1481,balloon,ball,,
4b2c71,hb-qvp,ball,,
a0194f,n105wv,ball,,
4b2b8c,hb-qmu,ball,,
ba1460,balloon,ball,,
ba1477,balloon,ball,,
ba1475,balloon,ball,,
ba147e,balloon,ball,,
a96f2d,n707gh,ball,,
4b2bdc,hb-qpw,ball,,
3f3089,d-oehd,ball,,
4b2c07,hb-qrn,ball,,
ba147d,balloon,ball,,
ba13fa,balloon,ball,,
ba147a,balloon,ball,,
ba14ad,balloon,ball,,
ba145f,balloon,ball,,
ba14a5,balloon,ball,,
4b2c8f,hb-qwa,ball,,
301749,i-mlsa,ball,,
ba1491,balloon,ball,,
a0d299,n152lb,ball,,
ba1474,balloon,ball,,
ba13f5,balloon,ball,,
ba14a2,balloon,ball,,
a07a89,n13th,ball,,
aae135,n80th,ball,,
ba1480,balloon,ball,,
ba1493,balloon,ball,,
ba14aa,balloon,ball,,
ba1437,balloon,ball,,
a26bc2,n255th,ball,,
ba14b6,balloon,ball,,
ba1490,balloon,ball,,
ba14b7,balloon,ball,,
ba1486,balloon,ball,,
ba149f,balloon,ball,,
a1d836,n218lb,ball,,
a19e24,n203lb,ball,,
a1a1db,n204lb,ball,,
3f3519,d-ogab,ball,,
a22ea2,n24lb,ball,,
a09d9c,n139lb,ball,,
a16927,n190lb,ball,,
a1f0d9,n224lb,ball,,
a1f490,n225lb,ball,,
a13b98,n179lb,ball,,
a0fdcf,n163lb,ball,,
a210ea,n232lb,ball,,
a14ccd,n183lb,ball,,
a186df,baloon,ball,,
a16317,n189lb,ball,,
a1ed22,n223lb,ball,,
a1e5b4,n221lb,ball,,
3fc30e,d-olhm,ball,,
4b2c8b,hb-qwp,ball,,
3f2e55,d-odll,ball,,
3f38b4,d-ohjo,ball,,
4b2af1,hb-qgv,ball,,
a2237d,n237lb,ball,,
a22734,n238lb,ball,,
a0aed1,n143lb,ball,,
a26f79,n256th,ball,,
a17803,n194lb,ball,,
4b2b80,hb-qmi,ball,,
3f2564,d-oabk,ball,,
44096f,oe-rat,ball,,
1059f6,ra-23030,ball,,
a23869,n242lb,ball,,
a1be35,n211lb,ball,,
a1ffb5,n228lb,ball,,
a1f847,n226lb,ball,,
4b2b67,hb-qlj,ball,,
a26756,n254lb,ball,,
a23c20,n243lb,ball,,
a22aeb,n239lb,ball,,
a2680b,n254th,ball,,
a2ab2f,n271lb,ball,,
a2b654,n274lb,ball,,
a2639f,n253lb,ball,,
a25fe8,n252lb,ball,,
a20d33,n231lb,ball,,
a283b0,n261lb,ball,,
a2438e,n245lb,ball,,
a2f676,n290lb,ball,,
a28b1e,n263lb,ball,,
a24eb3,n248lb,ball,,
a27632,n258lb,ball,,
a299fa,n267lb,ball,,
a2aee6,n272lb,ball,,
a2da1c,n283lb,ball,,
a2ecaf,n288lb,ball,,
a2d665,n282lb,ball,,
a2bdc2,n276lb,ball,,
a2ba0b,n275lb,ball,,
a1b6d4,n2097w,ball,,
a2ddd3,n284lb,ball,,
a2c8e7,n279lb,ball,,
a11062,n168lb,ball,,
a108f4,n166lb,ball,,
a2e541,n286lb,ball,,
a2a168,n269lb,ball,,
a2a778,n270lb,ball,,
a2c530,n278lb,ball,,
a2e18a,n285lb,ball,,
a3693c,n319lb,ball,,
a36f4c,n320lb,ball,,
