icao,regid,mdl,type,operator
a00013,n1as,g44,Grumman G-44,Private owner
a08ede,n135mg,g44,Grumman G-44,Private owner
a4b473,n402e,g44,Grumman G-44A,Private owner
a54b48,n440gw,g44,Grumman G-44A,Private owner
a8fcba,n67867,g44,Grumman G-44,Private owner
c002e8,c-fbcp,g44,Grumman G-44,Private owner
