icao,regid,mdl,type,operator
401780,g-awei,d6cr,Druine D.62B Condor,Private Owner
4019c2,g-badm,d6cr,Druine D.62B Condor,Private owner
40180f,g-axgs,d6cr,Druine Condor-D.62B,SAS Flying Group
4036c3,g-buof,d6cr,Druine Condor-D.62B,Private owner
401811,g-axgz,d6cr,Druine D.62B Condor,Private Owner
