icao,regid,mdl,type,operator
3b7658,096,e121,Embraer EMB-121AA Xingu,Armee de l'Air Francaise
3b766f,f-zjcr,e121,,
3b7723,107,e121,Embraer EMB-121AA Xingu,French Air Force
3b7724,r105,e121,Embraer EMB-121AA Xingu,French Air Force
3b7728,099yp,e121,,
3b772c,092,e121,Embraer EMB-121AA Xingu,French Air Force
3b772e,090zf,e121,,
3b7731,084,e121,Embraer EMB-121AA Xingu,French Air Force
3b7732,083,e121,Embraer EMB-121AA Xingu,French Air Force
3b7733,082,e121,Embraer EMB-121AA Xingu,French Air Force
3b7735,078,e121,Embraer EMB-121AA Xingu,French Air Force
3b7739,072,e121,Embraer EMB-121AA Xingu,French Air Force
3b773c,064,e121,Embraer EMB-121AA Xingu,French Air Force
3b773e,054,e121,Embraer EMB-121 Xingu,French Air Force
3b9baa,078,e121,Embraer EMB-121AA Xingu,French Air Force
3b9bac,081,e121,Embraer EMB-121AN Xingu,French Navy
3b9bb0,71,e121,EMBRAER EMB-121AN Xingu,French Navy
3b9bb2,68,e121,,
