icao,regid,mdl,type,operator
48d825,0205,an28,PZL-Mielec M-28B-1R Bryza,Polish Air Force
5082e7,ur-nte,an28,Antonov An-28,Antonov Design Bureau
a3908b,11-0329,an28,PZL C-145A Skytruck,US Air Force Special Operation
