icao,regid,mdl,type,operator
30037b,i-oryo,c152,Cessna 152,Aero Club Bergamo
3005ea,i-cnto,c152,Cessna C152,
390605,f-gbqf,c152,Reims-Cessna F152,Aero Club de Belves Perigord
3909af,f-gcnp,c152,Cessna Reims F152,Private owner
390c75,f-gddv,c152,Cessna F152,Private owner
3d0807,d-ebhf,c152,Cessna 152,Private owner
3d08d4,d-ebpc,c152,Cessna 152,Private owner
3d0ae0,d-ecjg,c152,Cessna 182N Skylane,Private owner
3d0d36,d-edgg,c152,Cessna 152,Private owner
3d12ac,d-efia,c152,Cessna 152,Private owner
3d12c6,d-efja,c152,Cessna 152,Private Owner
3d1345,d-efnx,c152,Cessna 	152,Private owner
3d1375,d-efpt,c152,Cessna	152,Private owner
3d15f5,d-egoj,c152,Cessna 152,Private owner
3d168f,d-eguh,c152,Cessna 152,Private Owner
3d1879,d-ehnd,c152,Cessna 152,Private Owner
3d1930,d-ehue,c152,Cessna 152,Air Berlin
3d1b13,d-eimt,c152,Cessna F152,Private owner
3d1b46,d-eios,c152,Reims Aviation 	F152,Private owner
3d1b5a,d-eipm,c152,Cessna 152,Private owner
395624,f-gvre,c152,Cessna 152,Private owner
3995f1,f-hfpr,c152,Reims F152,"Aeropilot SARL, 95 Osny"
3995f2,f-hfps,c152,,
3d1bb9,d-eitd,c152,Cessna 152,Flugschule FLL
3d1bc0,d-eitk,c152,Reims Aviation F152,Private owner
3d1c39,d-eiyb,c152,Cessna 152,Private owner
3d209a,d-ekpe,c152,Reims Aviation	F152,Private Owner
3d2b1b,d-eoop,c152,Cessna 152,Private owner
3d3314,d-erpc,c152,Cessna 152,Private owner
3d384c,d-etom,c152,Cessna 152,Private owner
3d1b9b,d-eirz,c152,Cessna 152,Luftfahrtgesellschaft Walter
40105e,g-boai,c152,Cessna 152,Private owner
3d3fce,d-ewkk,c152,Cessna	152,Private owner
3d46bb,d-ezap,c152,Cessna 152,Private owner
4013a5,g-bfek,c152,Reims Cessna F152,Staverton Flying School
401ce2,g-mflm,c152,Reims Cessna F152,Multiflight
401ce7,g-bffw,c152,Cessna 152,Stapleford Flying Club
401ced,g-bfgl,c152,Cessna 152,Private owner
401d11,g-bflu,c152,Reims-Cessna F152,Private owner
401d17,g-bfmk,c152,Reims Cessna FA152,Private owner
401d22,g-bfof,c152,Reims Cessna F152,ACS ENGINEERING LTD
401d5e,g-opam,c152,Cessna Reims F152,Private owner
401d5f,g-bfzu,c152,Cessna FA152,Private owner
401d61,g-bgaa,c152,Reims Cessna F152,Private owner
401d62,g-bgab,c152,Reims Cessna F152,Tg Aviation Ltd
401db5,g-hfcl,c152,Cessna 152,Private owner
401e0d,g-bhaa,c152,Cessna 152,Private owner
401e0e,g-bhad,c152,Cessna 152,Private owner
401e20,g-bhdm,c152,Reims Cessna F152,Private owner
401e28,g-bhed,c152,Reims Cessna F152,Tg Aviation Ltd
401e2d,g-bhen,c152,Reims Cessna F152,Private owner
401e43,g-bhhg,c152,Reims Cessna F152,Tg Aviation Ltd
401e95,g-bhui,c152,Cessna 152,Private owner
401eb2,g-bhyx,c152,Cessna 152,Stapleford Flying Club
401f0f,g-bilr,c152,Cessna 152,Private owner
401f40,g-bitf,c152,Reims-Cessna F152,Private owner
401fe8,g-bjvt,c152,Reims Cessna F152,Private owner
401feb,g-bjwh,c152,Reims Cessna F152,Private Owner
4021f0,g-hfct,c152,Cessna 152,Stapleford Flying Club
402708,g-bvtm,c152,Reims Aviation	F152 II,The Royal Air Force Halton Aer
402748,g-bmxb,c152,Cessna 152,Private owner
402749,g-bmxc,c152,Cessna 152,MK Aero Support Ltd
402774,g-bmtb,c152,Cessna 152,Private owner
4027a5,g-wacb,c152,Cessna F152,Private owner
4027aa,g-wace,c152,Reims Cessna F152,Private owner
4027ee,g-wacg,c152,Cessna 152,Private owner
4028ca,g-bnjc,c152,Cessna 152,Stapleford Flying Club
4028db,g-bnkr,c152,Cessna 152,Private owner
4028e5,g-bnki,c152,Cessna 152,Private owner
402901,g-bnhj,c152,Cessna 152,Private owner
402941,g-bnrl,c152,Cessna 152,Private owner
402954,g-bnmf,c152,Cessna 152,Private owner
402956,g-bnsn,c152,Cessna 152,Private owner
40298f,g-bnut,c152,Cessna 152,Stapleford Flying Club
4029cd,g-bnul,c152,Cessna 152,Private owner
402ac2,g-boir,c152,Cessna 152,Private owner
402b1e,g-bonw,c152,Cessna 152,Private owner
402bc3,g-lams,c152,Reims Aviation F152,APB Leasing Ltd
402c40,g-boyl,c152,Cessna 152,Private owner
402c4b,g-booi,c152,Cessna 152,Stapleford Flying Club
402d8c,g-gfib,c152,Cessna F152,Private owner
402ecc,g-brbp,c152,Cessna 152,Private owner
40307e,g-brtd,c152,Cessna 152,Private owner
40310d,g-bscz,c152,Cessna 152,Private owner
403170,g-bsfp,c152,Cessna 152,Private owner
4031bc,g-bsdp,c152,Cessna 152,Private owner
4033d8,g-btgw,c152,Cessna 152,Stapleford Flying Club
4033d9,g-btgx,c152,Cessna 152,Stapleford Flying Club
4034ff,g-btvw,c152,Cessna 152,Private owner
403bad,g-bwnb,c152,Cessna 152,S Warwickshire Scool of Flying
403bae,g-bwnc,c152,Cessna 152,Private owner
403d44,g-jimh,c152,Reims Cessna F152,Private owner
403ef0,g-bxtb,c152,Cessna 152,Private owner
403f88,g-bxvb,c152,Cessna 152,Private owner
403f9e,g-bxvy,c152,Cessna 152,Stapleford Flying Club
4041c7,g-bymj,c152,Cessna 152,Stapleford Flying Club
4042d1,g-bzec,c152,Cessna 152,Private owner
404371,g-bzhe,c152,Cessna 152,Private owner
404372,g-bzhf,c152,Cessna 152,Private owner
40440d,g-pfsl,c152,Cessna F152,Private owner
40562e,g-ceyg,c152,Cessna 152,Private owner
40562f,g-ceyh,c152,Cessna 152,Private owner
405a16,g-bhna,c152,Reims Cessna F152,Private owner
4068b3,g-shba,c152,Cessna F152,Private owner
4069dc,g-cicc,c152,Cessna 152,Private owner
406c20,g-egsl,c152,Cessna F152,Private owner
406c4c,g-lomn,c152,Cessna 152,North Weald Flying Group Ltd
406e92,g-cipy,c152,Cessna F152,Swiftair Maintenance Ltd
44aef3,oo-kws,c152,Cessna	152,Private owner
44b2ca,oo-lvj,c152,Cessna	152,Private owner
44d872,oo-vcr,c152,Cessna 152,Private owner
46066a,oh-cle,c152,Cessna 152,Private owner
460694,oh-cmu,c152,Cessna 152,Jukolan Pilotit RY.
47193d,ha-jon,c152,Cessna 152,Private owner
4738ea,ha-vok,c152,Cessna 152,Private owner
48456d,ph-hle,c152,Cessna 152,Private owner
484735,ph-ach,c152,Reims F152,Private owner
48475e,ph-scx,c152,Cessna 152,Stella Aviation Charter B.V.
4847d8,ph-cds,c152,Cessna 152,Private owner
4847d9,ph-jvb,c152,Cessna 152,Stella Aviation Charter B.V.
4847ea,ph-skg,c152,Cessna 152,Stella Aviation Charter B.V.
484811,ph-dkm,c152,Cessna 152,Private owner
484823,ph-dke,c152,Reims Cessna F152,Private owner
484908,ph-vsn,c152,Reims-Cessna F152,Private owner
484b65,ph-stq,c152,Reims Cessna F152,Stella Aviation Charter B.V.
4b0589,hb-ccn,c152,Cessna 152,Private owner
4b05ca,hb-cfa,c152,Cessna 152,Private owner
4b05d1,hb-cfh,c152,Reims Cessna F152,Private owner
4b05ee,hb-cgk,c152,Cessna 152,Private owner
4b062f,hb-cix,c152,Cessna 152,Private owner
4b0630,hb-ciy,c152,Cessna 152,Private owner
4b0648,hb-cjw,c152,Cessna152,Private owner
4b06a2,hb-cni,c152,Cessna 152,Private owner
4b06a4,hb-cnk,c152,Reims Cessna F152,Private owner
4b06ac,hb-cns,c152,Reims Cessna F152,Private owner
4b06f0,hb-cqi,c152,Cessna 152,Private owner
4b07b3,hb-cxv,c152,Reims Cessna F152,Private owner
4b07b4,hb-cxw,c152,Cessna 152,Private owner
4b07bd,hb-cyf,c152,Reims Cessna F152,Private owner
4b07c7,hb-cyp,c152,Reims Cessna F152,Private owner
4b07cf,hb-cyx,c152,Cessna 152,Private owner
488138,sp-akv,c152,Cessna 152,Private owner
48892f,sp-ckp,c152,Reims-Cessna F152,Private owner
48b008,sp-mai,c152,Cessna 152,Private owner
490670,cs-asp,c152,Cessna 152,Private owner
4906aa,cs-auj,c152,Cessna 152,Private owner
4906c2,cs-avb,c152,Cessna 152,Private owner
490727,cs-ayg,c152,Cessna F152,Private owner
49072e,cs-ayn,c152,Cessna A152 Aerobat,Private owner
4910f5,cs-dgu,c152,Cessna 152,Private owner
4910f6,cs-dgv,c152,Cessna 152,Private owner
491121,cs-dia,c152,Cessna 152,Private owner
491122,cs-dib,c152,Cessna 150/152,Omni Aviacao e Tecnologia
49d00c,ok-xai,c152,Boeing 737-522,SmartWings
49d0a7,ok-pav,c152,Airbus A310-325,Czech Airlines
49d0b3,ok-sup,c152,Cessna 152,Private owner
49d0b8,ok-had,c152,Cessna 152,Private owner
49d109,ok-fox,c152,Boeing 737-8BK,Travel Service
49d1a4,ok-hfa,c152,Reims Aviation	F152,Private owner
49d2be,ok-rys,c152,Cessna C152,
49d2c1,ok-mmc,c152,Cessna 152,Czech Aviation
49d2fa,ok-fab,c152,Cessna 152,Private owner
49d321,ok-pes,c152,Cessna 152 II,Private owner
49d33b,ok-vyr,c152,Reims-Cessna F152,Private owner
a0043c,n10vf,c152,Cessna 152,Private owner
a085da,n1326s,c152,Cessna 152,Private owner
a0d1bf,n152bj,c152,Cessna 152,Private owner
a0d1c7,n152bs,c152,Cessna 152,Private owner
a0d235,n152gb,c152,Cessna 152,Private owner
a0d2b6,n152mf,c152,Cessna 152,Private owner
a0d2c5,n152mw,c152,Cessna 152,Private owner
a0d336,n152sj,c152,Cessna 152,Private owner
a0d356,n152tr,c152,Cessna 152,Private owner
a0d365,n152uf,c152,Cessna 152,Private owner
a0d679,n153mt,c152,Cessna 152,Private owner
a0d6ee,n153sk,c152,Cessna 152,Private owner
a0daa5,n154sk,c152,Cessna 152,Private owner
a0de5c,n155sk,c152,Cessna 152,Private owner
a0e981,n158sk,c152,Cessna 152,Private owner
a0fa73,n162pt,c152,Cessna 152,Private owner
a06d11,n1265p,c152,Cessna 152,Private owner
a14f92,n184ak,c152,Cessna 152,Private owner
a154df,n185sr,c152,Cessna 152,Private owner
a1185b,n17rr,c152,Cessna 152,Private owner
a11ad0,n170su,c152,Cessna 152,Private owner
a1334b,n177bd,c152,Cessna 152,Private owner
a1c197,n212gs,c152,Cessna 152,Private owner
a1c205,n212mb,c152,Cessna 152,Private owner
a18e75,n2ms,c152,Cessna 152,Private owner
a18fee,n20ct,c152,Cessna 152,Private owner
a1d009,n216cl,c152,Cessna 152,Private owner
a1d02b,n216dv,c152,Cessna 152,Private owner
a23ab1,n24261,c152,Cessna 152,Private owner
a23ab6,n24266,c152,Cessna 152,Private owner
a23b1f,n24296,c152,Cessna 152,Private owner
a23e01,n24333,c152,Cessna 152,Private owner
a23e47,n24353,c152,Cessna 152,Private owner
a23e6a,n24363,c152,Cessna 152,Private owner
a241d9,n24441,c152,Cessna 152,Private owner
a1f3d4,n225cp,c152,Cessna 152,Private owner
a2456e,n24532,c152,Cessna 152,Private owner
a24c79,n24708,c152,Cessna 152,Private owner
a24d22,n24752,c152,Cessna 152,Private owner
a24d49,n24766,c152,Cessna 152,Private owner
a24d6b,n24775,c152,Cessna 152,Private owner
a2504f,n24814,c152,Cessna 152,Private owner
a25092,n24831,c152,Cessna 152,Private owner
a250de,n24857,c152,Cessna 152,Private owner
a25121,n24874,c152,Cessna 152,Private owner
a25147,n24887,c152,Cessna 152,Private owner
a25168,n24895,c152,Cessna 152,Private owner
a2544a,n24932,c152,Cessna 152,Private owner
a25474,n24949,c152,Cessna 152,Private owner
a254fe,n24987,c152,Cessna 152,Private owner
a2551b,n24991,c152,Cessna 152,Private owner
a2558f,n25ef,c152,Cessna 152,Private owner
a25a3d,n25028,c152,Cessna 152,Private owner
a261a4,n25221,c152,Cessna 152,Private owner
a26211,n25255,c152,Cessna 152,Private owner
a26279,n25284,c152,Cessna 152,Private owner
a2653e,n25317,c152,Cessna 152,Private owner
a2655f,n25325,c152,Cessna 152,Private owner
a265c4,n25351,c152,Cessna 152,Private owner
a265e8,n25362,c152,Cessna 152,Private owner
a26658,n25399,c152,Cessna 152,Private owner
a26934,n25430,c152,Cessna 152,Private owner
a269a4,n25467,c152,Cessna 152,Private owner
a26a09,n25493,c152,Cessna 152,Private owner
a26ca8,n25513,c152,Cessna 152,Private owner
a26cd0,n25528,c152,Cessna 152,Private owner
a26d79,n25572,c152,Cessna 152,Private owner
a26d7a,n25573,c152,Cessna 152,Private owner
a274c5,n25763,c152,Cessna 152,Private owner
a274e7,n25772,c152,Cessna 152,Private owner
a274ee,n25779,c152,Cessna 152,Private owner
a277ed,n25820,c152,Cessna 152,Private owner
a27816,n25836,c152,Cessna 152,Private owner
a27858,n25852,c152,Cessna 152,Private owner
a27879,n25860,c152,Cessna 152,San Diego Flight  Training
a2953b,n2659z,c152,Cessna 152,Private owner
a278eb,n25899,c152,Cessna 152,Private owner
a27b85,n25914,c152,Cessna 152,Private owner
a27b89,n25918,c152,Cessna 152,Private owner
a27c79,n25983,c152,Cessna 152,Private owner
a27c99,n25990,c152,Cessna 152,Private owner
a27c9b,n25992,c152,Cessna 152,Private owner
a27c9e,n25995,c152,Cessna 152,Private owner
a33d6a,n308dw,c152,Cessna 152,Private owner
a38e85,n3281b,c152,Cessna 152,Private owner
a39479,n33lj,c152,Cessna 152,Private owner
a33245,n305dw,c152,Cessna 152,Private owner
a3a2c2,n333um,c152,Cessna 152,Private owner
a3ee30,n352wa,c152,Cessna 152,Private owner
a55f8b,n4450c,c152,Cessna 152,Private owner
a58bdc,n4568f,c152,Cessna 152,Private owner
a5973b,n45994,c152,Cessna 152,Private owner
a59c53,n46021,c152,Cessna 152,Private owner
a5a038,n4614b,c152,Cessna 152,Private owner
a5a40f,n46249,c152,Cessna 152,Private owner
a5a44d,n46261,c152,Cessna 152,Private owner
a5a7d2,n4635l,c152,Cessna 152,Private owner
a5a86f,n46393,c152,Cessna 152,Private owner
a5ab00,n4641p,c152,Cessna 152,Private owner
a5ab0e,n46413,c152,Cessna 152,Private owner
a5ab24,n4642q,c152,Cessna 152,Private owner
a5abe0,n46473,c152,Cessna 152,Private owner
a5ac07,n46487,c152,Cessna 152,Private owner
a5aefa,n4653l,c152,Cessna 152,Private owner
a5af14,n4654b,c152,Cessna 152,Sierra Academy of Aeronautics
a5b679,n46733,c152,Cessna 152,Private owner
a5b6a1,n46748,c152,Cessna 152,Private owner
a5b6a5,n4675b,c152,Cessna 152,Private owner
a5b9c7,n46803,c152,Cessna 152,Private owner
a5babc,n46873,c152,Cessna 152,Private owner
a5bae5,n46889,c152,Cessna 152,Private owner
a5be2d,n46953,c152,Cessna 152,Private owner
a5be51,n46964,c152,Cessna 152,Private owner
a5d910,n476tc,c152,Cessna 152,Private owner
a5d9ea,n4761l,c152,Cessna 152,Private owner
a5def5,n478bk,c152,Cessna 152,Private owner
a5e1f8,n47856,c152,Cessna 152,Private owner
a5e435,n479tc,c152,Cessna 152,Private owner
a5eb54,n48024,c152,Cessna 152,Private owner
a503e3,n422jp,c152,Cessna 152,Private owner
a5ebe8,n4807b,c152,Cessna 152,Private owner
a5ef76,n48156,c152,Cessna 152,Private owner
a5efe5,n4819b,c152,Cessna 152,Private owner
a5f27c,n48204,c152,Cessna 152,Private owner
a5f2c0,n48222,c152,Cessna 152,Private owner
a5f396,n48286,c152,Cessna 152,Private owner
a5f69b,n48333,c152,Cessna 152,Private owner
a5f6bb,n48340,c152,Cessna 152,Private owner
a5fa72,n48440,c152,Cessna 152,Private owner
a5fd8c,n4850h,c152,Cessna 152,Private owner
a5fde4,n48521,c152,Cessna 152,Private owner
a5fe77,n48568,c152,Cessna 152,Private owner
a6013d,n4860b,c152,Cessna 152,Private owner
a60177,n48610,c152,Cessna 152,Private owner
a601c4,n48637,c152,Cessna 152,Private owner
a6022c,n48666,c152,Cessna 152,Private owner
a6028f,n48690,c152,Cessna 152,Private owner
a60556,n48725,c152,Cessna 152,Private owner
a605c1,n48757,c152,Cessna 152,Private owner
a605df,n48762,c152,Cessna 152,Private owner
a6064a,n48794,c152,Cessna 152,Private owner
a608c6,n48804,c152,Cessna 152,Private owner
a608e5,n48810,c152,Cessna 152,Private owner
a6097d,n4886b,c152,Cessna 152,Private owner
a6099c,n48868,c152,Cessna 152,Private owner
a60c79,n48900,c152,Cessna 152,Private owner
a60ce4,n48932,c152,Cessna 152,Private owner
a60d4c,n48961,c152,Cessna 152,Private owner
a60d4d,n48962,c152,Cessna 152,Private owner
a60d53,n48968,c152,Cessna 152,Private owner
a60d70,n48972,c152,Cessna 152,Private owner
a60d7a,n4898b,c152,Cessna 152,Private owner
a60d95,n48984,c152,Cessna 152,Private owner
a60db4,n48990,c152,Cessna 152,Private owner
a60db7,n48993,c152,Cessna 152,Private owner
a61278,n4900h,c152,Cessna 152,Private owner
a612fe,n4904b,c152,Cessna 152,Private Owner
a61327,n4905h,c152,Cessna 152,Private owner
a6135b,n49060,c152,Cessna 152,Private owner
a613c4,n49090,c152,Cessna 152,Private owner
a613c8,n49094,c152,Cessna 152,Private owner
a616ce,n49142,c152,Cessna 152,Private owner
a616e4,n4915p,c152,Cessna 152,Private owner
a616f0,n49151,c152,Cessna 152,Private owner
a616f7,n49158,c152,Cessna 152,Private owner
a616fb,n4916b,c152,Cessna 152,Private owner
a61747,n4918h,c152,Cessna 152,Private owner
a6175d,n49185,c152,Cessna 152,Private owner
a6177c,n49191,c152,Cessna 152,Private owner
a6177f,n49194,c152,Cessna 152,Private owner
a61a26,n4922b,c152,Cessna 152,Private owner
a61aa6,n49250,c152,Cessna 152,Private owner
a61af2,n49276,c152,Cessna 152,Private owner
a61b0f,n49280,c152,Cessna 152,Private owner
a61b34,n49292,c152,Cessna 152,Private owner
a61de9,n4932p,c152,Cessna 152,Private owner
a61e06,n4933h,c152,Cessna 152,Private owner
a61e3b,n49341,c152,Cessna 152,Private owner
a61e98,n4937p,c152,Cessna 152,Private owner
a5c3c6,n4702p,c152,Cessna 152,Private owner
a5c430,n4705q,c152,Cessna 152,Private owner
a5c74a,n47108,c152,Cessna 152,Private owner
a5c74e,n4711b,c152,Cessna 152,Private owner
a5c794,n4713b,c152,Cessna 152,Private owner
a5c7ae,n47133,c152,Cessna 152,Private owner
a5c829,n4717l,c152,Cessna 152,Private owner
a5c880,n47193,c152,Cessna 152,Private owner
a5ca34,n472tc,c152,Cessna 152,Private owner
a5cb51,n4723h,c152,Cessna 152,Private owner
a5cb57,n4723p,c152,Cessna 152,Private owner
a5cbb4,n4726b,c152,Cessna 152,Private owner
a5cbbd,n4726l,c152,Cessna 152,Private owner
a5cbdd,n4727h,c152,Cessna 152,Private owner
a5ced7,n47314,c152,Cessna 152,Private owner
a5d6c2,n4755p,c152,Cessna 152,Private owner
a5257c,lv-ate,c152,Piper PA-32-300,Private owner
a62194,n4942b,c152,Cessna 152,Private owner
a6219a,n4942h,c152,Cessna 152,Private owner
a621af,n49424,c152,Cessna 152,Private owner
a621d2,n49434,c152,Cessna 152,Private owner
a621d6,n49438,c152,Cessna 152,Private owner
a621d7,n49439,c152,Cessna 152,Private owner
a621f8,n49447,c152,Cessna 152,Private owner
a62217,n49453,c152,Cessna 152,Private owner
a6252e,n4951h,c152,Cessna 152,Private owner
a625f9,n4957a,c152,Cessna A152,Private owner
a6290b,n4962l,c152,Cessna 152,Private owner
a62954,n4964p,c152,Cessna 152,Private owner
a629ec,n49681,c152,Cessna 152,Private owner
a62d94,n4978l,c152,Cessna 152,Private owner
a62da6,n49784,c152,Cessna 152,Private owner
a62da7,n49785,c152,Cessna 152,Private owner
a6308b,n49824,c152,Cessna 152,Private owner
a63185,n49899,c152,Cessna 152,Private owner
a63462,n49931,c152,Cessna 152,Private owner
a63518,n49988,c152,Cessna 152,Private owner
a648e8,n504bc,c152,Cessna 152,Private owner
a65b00,n5087l,c152,Cessna 152,Private owner
a65b23,n5088l,c152,Cessna 152,Private owner
a663f8,n5101p,c152,Cessna 152,Private owner
a66484,n5105p,c152,Cessna 152,Private owner
a664be,n5107b,c152,Cessna 152,Private owner
a66504,n5109b,c152,Cessna 152,Private owner
a66b3d,n5120h,c152,Cessna 152,Private owner
a66b89,n5122p,c152,Cessna 152,Flight Academy of New Orleans
a6a946,n5282b,c152,Cessna 152,Private owner
a6a9de,n5286p,c152,Cessna 152,Private owner
a67ded,n5171b,c152,Cessna 152,Private owner
a6862d,n5197b,c152,Cessna 152,Private owner
a69328,n5223l,c152,Cessna 152,Private owner
a696e2,n5233p,c152,Cessna 152,Private owner
a697a8,n5239b,c152,Cessna 152,Private owner
a69a54,n5241q,c152,Cessna 152,Private owner
a69b03,n5246q,c152,Cessna 152,Private owner
a69c36,n525hf,c152,Cessna 152,Private owner
a70a57,n5528p,c152,Cessna 152,Private owner
a70d13,n5531h,c152,Cessna 152,Private owner
a71484,n5551l,c152,Cessna 152,Private owner
a6b2f0,n5301h,c152,Cessna 152,Private owner
a6b7a0,n5318m,c152,Cessna 152,Private owner
a6bb26,n53268,c152,Cessna 152,Private owner
a6be0f,n5331b,c152,Cessna 152,Private owner
a6bea7,n5335p,c152,Cessna 152,Private owner
a6beea,n5337l,c152,Cessna 152,Private owner
a6bf44,n53396,c152,Cessna 152,Private owner
a6bf46,n53398,c152,Cessna 152,Private owner
a6c2bb,n5348b,c152,Cessna 152,Private owner
a6c615,n5355p,c152,Cessna 152,Private owner
a6c616,n5355q,c152,Cessna 152,Private owner
a6c655,n5357h,c152,Cessna 152,Private owner
a6c9ed,n5366m,c152,Cessna 152,Private owner
a6ccd2,n5370m,c152,Cessna 152,Private owner
a6cde0,n5378b,c152,Cessna 152,Private owner
a6d117,n5384p,c152,Cessna 152,Private owner
a6d1c4,n5389m,c152,Cessna 152,Private owner
a6d1f5,n539b,c152,Cessna 152,Private owner
a672a5,n5140b,c152,Cessna 152,Private owner
a672ab,n5140h,c152,Cessna 152,Private owner
a6767f,n5151b,c152,Cessna 152,Private owner
a67ac2,n5165b,c152,Cessna 152,Private owner
a72832,n560pc,c152,Cessna 152,Private owner
a73b71,n565w,c152,Cessna 152,Private owner
a6a625,n5276m,c152,Cessna 152,Private owner
a6dab5,n5403h,c152,Cessna 152,Private owner
a6dad2,n5404b,c152,Cessna 152,Private owner
a6daff,n5405m,c152,Cessna 152,Private owner
a6e1c0,n5420p,c152,Cessna 152,Private owner
a6e1e3,n5421p,c152,Cessna 152,Private owner
a6e92c,n5440m,c152,Cessna 152,Private owner
a6e968,n5442b,c152,Cessna 152,Private owner
a6e994,n5443l,c152,Cessna 152,Private owner
a6ea20,n5447l,c152,Cessna 152,Private owner
a6ea43,n5448l,c152,Cessna 152,Private owner
a6ece6,n5450q,c152,Cessna 152,Private owner
a6f0b9,n5461h,c152,Cessna 152,Private owner
a6f8f3,n5487b,c152,Cessna 152,Private owner
a6fbe4,n5491p,c152,Cessna 152,Private owner
a6fc4d,n5494p,c152,Cessna 152,Private owner
a793c9,n588br,c152,Cessna 152,Private owner
a7c28d,n6a,c152,Cessna 152,Private owner
a7de30,n606gs,c152,Cessna 152,Private owner
a7e580,n608fm,c152,Cessna 152,Private owner
a7e80a,n6085m,c152,Cessna 152,Private owner
a7ec07,n6097m,c152,Cessna 152,Private owner
a7f4ff,n6111q,c152,Cessna 152,Private owner
a7f5ce,n6117m,c152,Cessna 152,Private owner
a7f890,n6120m,c152,Cessna 152,Private owner
a7fc90,n6132q,c152,Cessna 152,Private owner
a7fcf6,n6135m,c152,Cessna 152,Private owner
a7fd62,n6138q,c152,Cessna 152,Private owner
a836e5,n6284m,c152,Cessna 152,Private owner
a83a75,n6293h,c152,Cessna 152,Private owner
a83a9c,n6294m,c152,Cessna 152,Private owner
a840ac,n6304m,c152,Cessna 152,Private owner
a84326,n631tk,c152,Cessna 152,Private owner
a84463,n6314m,c152,Cessna 152,Private owner
a847b1,n6321m,c152,Cessna 152,Private owner
a847b3,n6321p,c152,Cessna 152,Private owner
a84f41,n6342l,c152,Cessna 152,Private owner
a84fd0,n6346p,c152,Cessna 152,Private owner
a8500a,n6348b,c152,Cessna 152,Private owner
a853ab,n6357q,c152,Cessna 152,Private owner
a800d3,n6146q,c152,Cessna 152,Private owner
a803b5,n6150m,c152,Cessna 152,Private owner
a80c5a,n6179h,c152,Cessna 152,Private owner
a813ac,n6198q,c152,Cessna 152,Private owner
a813cf,n6199q,c152,Cessna 152,Private owner
a8192f,n6204p,c152,Cessna 152,Private owner
a81b3a,n621pa,c152,Cessna 152,Private owner
a822a8,n623pa,c152,Cessna 152,Private owner
a823c9,n6230q,c152,Cessna 152,Private owner
a8265f,n624pa,c152,Cessna 152,Private owner
a8288b,n6248b,c152,Cessna 152,Private owner
a82b5a,n6251q,c152,Cessna 152,Private owner
a8890d,n6490l,c152,Cessna 152,Private owner
a889a9,n64942,c152,Cessna 152,Private owner
a889b0,n64949,c152,Cessna 152,Private owner
a88a03,n6497m,c152,Cessna 152,Private owner
a88a11,n64971,c152,Cessna 152,Private owner
a896b2,n6521q,c152,Cessna 152,Private owner
a89b17,n6536p,c152,Cessna 152,Private owner
a89b93,n65398,c152,Cessna 152,Private owner
a89e08,n65401,c152,Cessna 152,Private owner
a89e0e,n65407,c152,Cessna 152,Private owner
a89e2f,n65415,c152,Cessna 152,Private owner
a89e31,n65417,c152,Cessna 152,Private owner
a89e75,n65435,c152,Cessna 152,Private owner
a89e79,n65439,c152,Cessna 152,Private owner
a89e93,n65440,c152,Cessna 152,Private owner
a89e9c,n65449,c152,Cessna 152,Private owner
a856b0,n6362m,c152,Cessna 152,Private owner
a85b39,n6378m,c152,Cessna 152,Private owner
a85b5c,n6379m,c152,Cessna 152,Private owner
a85e8a,n6385q,c152,Cessna 152,Private owner
a862ca,n6399m,c152,Cessna 152,Private owner
a89f4a,n65498,c152,Cessna 152,Private owner
a8a250,n65546,c152,Cessna 152,Private owner
a8a253,n65549,c152,Cessna 152,Private owner
a8a26e,n65551,c152,Cessna 152,Private owner
a8a2db,n65585,c152,Cessna 152,Private owner
a8a2fb,n65592,c152,Cessna 152,Private owner
a8a57a,n65605,c152,Cessna 152,Private owner
a8a58a,n6561l,c152,Cessna 152,Private owner
a8a598,n65610,c152,Cessna 152,Private owner
a8a59b,n65613,c152,Cessna 152,Private owner
a8b0f5,n6593l,c152,Cessna 152,Private owner
a8b161,n6596p,c152,Cessna 152,Private owner
a8b171,n65965,c152,Cessna 152,Private owner
a8b74e,n6605p,c152,Cessna 152,Private owner
a8b7ab,n6608b,c152,Cessna 152,Private owner
a8cc4b,n666uf,c152,Cessna 152,Private owner
a8d88a,n66938,c152,Cessna 152,Private owner
a8d8ad,n66948,c152,Cessna 152,Private owner
a8d8cc,n66954,c152,Cessna 152,Private owner
a8d90e,n66970,c152,Cessna 152,Private owner
a8d955,n66991,c152,Cessna 152,Private owner
a8e94e,n67300,c152,Cessna 152,Private owner
a8e955,n67307,c152,Cessna 152,Private owner
a8e996,n67322,c152,Cessna 152,Private owner
a8e998,n67324,c152,Cessna 152,Private owner
a8e9bc,n67335,c152,Cessna 152,Private owner
a8ea6a,n67384,c152,Cessna 152,Private owner
a8ed09,n67404,c152,Cessna 152,Private owner
a8ed6f,n67431,c152,Cessna 152,Private owner
a8edfe,n67474,c152,Cessna 152,Private owner
a8f4e5,n67639,c152,Cessna 152,Private owner
a8f506,n67647,c152,Cessna 152,Private owner
a8f507,n67648,c152,Cessna 152,Private owner
a8f523,n67651,c152,Cessna 152,Private owner
a8f529,n67657,c152,Cessna 152,Private owner
a8f82d,n67703,c152,Cessna 152,Private owner
a8f84d,n67710,c152,Cessna 152,Private owner
a8f893,n67730,c152,Cessna 152,Private owner
a8f8fc,n67760,c152,Cessna 152,Private owner
a8f927,n67778,c152,Cessna 152,Private owner
a8f949,n67787,c152,Cessna 152,Private owner
a8f96b,n67796,c152,Cessna 152,Private owner
a8f96c,n67797,c152,Cessna 152,Private owner
a8fbe8,n67807,c152,Cessna 152,Private owner
a8fc0c,n67818,c152,Cessna 152,Private owner
a8fc6d,n67840,c152,Cessna 152,Private owner
a8fc76,n67849,c152,Cessna 152,Private owner
a8fc92,n67852,c152,Cessna 152,Private owner
a8fd01,n67888,c152,Cessna 152,Private owner
a8fd02,n67889,c152,Cessna 152,Private owner
a90001,n67930,c152,Cessna 152,Private owner
a90090,n67973,c152,Cessna 152,Private owner
a900d4,n67991,c152,Cessna 152,Private owner
a900d8,n67995,c152,Cessna 152,Private owner
a900d9,n67996,c152,Cessna 152,Private owner
a905a9,n68001,c152,Cessna 152,Private owner
a90a9f,n68195,c152,Cessna 152,Private owner
a90d86,n68237,c152,Cessna 152,Private owner
a90e54,n68293,c152,Cessna 152,Private owner
a9111c,n68329,c152,Cessna 152,Private owner
a91138,n68332,c152,Cessna 152,Private owner
a9115d,n68344,c152,Cessna 152,Private owner
a91162,n68349,c152,Cessna 152,Private owner
a9117f,n68353,c152,Cessna 152,Private owner
a91486,n68402,c152,Cessna 152,Private owner
a914cc,n68422,c152,Cessna 152,Private owner
a9157e,n68475,c152,Cessna 152,Private owner
a91fcf,n68713,c152,Cessna 152,Private owner
a91ff6,n68727,c152,Cessna 152,Private owner
a92017,n68735,c152,Cessna 152,Private owner
a92082,n68767,c152,Cessna 152,Private owner
a92383,n68810,c152,Cessna 152,Private owner
a92385,n68812,c152,Cessna 152,Private owner
a92387,n68814,c152,Cessna 152,Private owner
a92410,n68851,c152,Cessna 152,Private owner
a927ea,n68961,c152,Cessna 152,Private owner
a92d4b,n69011,c152,Cessna 152,Private owner
a92d4c,n69012,c152,Cessna 152,Private owner
a92d50,n69016,c152,Cessna 152,Private owner
a92dd9,n69053,c152,Cessna 152,Private owner
a92e24,n69078,c152,Cessna 152,Private owner
a93149,n69132,c152,Cessna 152,Private owner
a9316f,n69145,c152,Cessna 152,Private owner
a868da,n6409m,c152,Cessna 152,Private owner
a87005,n6427q,c152,Cessna 152,Private owner
a873dc,n6438m,c152,Cessna 152,Private owner
a877b6,n6449m,c152,Cessna 152,Private owner
a87a28,n6450b,c152,Cessna 152,Private owner
a87abe,n6454m,c152,Cessna 152,Private owner
a87b06,n6456p,c152,Cessna 152,Private owner
a87de8,n6460l,c152,Cessna 152,Private owner
a87e55,n6463q,c152,Cessna 152,Private owner
a87f26,n6469p,c152,Cessna 152,Private owner
a88252,n6475q,c152,Cessna 152,Private owner
a885ad,n64823,c152,Cessna 152,Private owner
a886a0,n64891,c152,Cessna 152,Private owner
a886a4,n64895,c152,Cessna 152,Private owner
a8ee20,n67483,c152,Cessna 152,Private owner
a8ee45,n67495,c152,Cessna 152,Private owner
a8f0bf,n67503,c152,Cessna 152,Private owner
a8f0e1,n67512,c152,Cessna 152,Private owner
a8f12c,n67537,c152,Cessna 152,Private owner
a96f36,n707gs,c152,Cessna 152,Private owner
a98cc2,n714uy,c152,Cessna 152,Private owner
a98ccb,n714vg,c152,Cessna 152,Private owner
a98ccc,n714vh,c152,Cessna 152,Private owner
a98ce1,n714wd,c152,Cessna 152,Private owner
a98ce2,n714we,c152,Cessna 152,Private owner
a98cf8,n714xb,c152,Cessna 152,Private owner
a98d0d,n714xy,c152,Cessna 152,Private owner
a98d13,n714yd,c152,Cessna 152,Private owner
a98d2a,n714zb,c152,Cessna 152,Private owner
a931d7,n69174,c152,Cessna 152,Private owner
a931fe,n69188,c152,Cessna 152,Private owner
a931ff,n69189,c152,Cessna 152,Private owner
a933be,n692sk,c152,Cessna 152,Private owner
a9349a,n69205,c152,Cessna 152,Private owner
a9349c,n69207,c152,Cessna 152,Private owner
a934bb,n69213,c152,Cessna 152,Private owner
a9354c,n69258,c152,Cessna 152,Private owner
a9b062,n723th,c152,Cessna 152,Private owner
aa0ed8,n747zp,c152,Cessna 152,Private owner
aa340e,n757ad,c152,Cessna 152,Private owner
aa3413,n757aj,c152,Cessna 152,Private owner
aa3428,n757be,c152,Cessna 152,Private owner
aa3440,n757cd,c152,Cessna 152,Private owner
aa3448,n757cm,c152,Cessna 152,Private owner
aa344e,n757ct,c152,Cessna 152,Private owner
aa345a,n757de,c152,Cessna 152,Private owner
aa3482,n757ev,c152,Cessna 152,Private owner
aa34b6,n757gx,c152,Cessna 152,Private owner
aa34d0,n757hy,c152,Cessna 152,Private owner
aa34d6,n757jd,c152,Cessna 152,Private owner
aa3511,n757ln,c152,Cessna 152,Private owner
aa351b,n757ly,c152,Cessna 152,Private owner
aa352b,n757mp,c152,Cessna 152,Private owner
aa353f,n757nj,c152,Cessna 152,Private owner
aa3545,n757nq,c152,Cessna 152,Private owner
aa355d,n757pp,c152,Cessna 152,Private owner
aa3570,n757qh,c152,Cessna 152,Private owner
aa3571,n757qj,c152,Cessna 152,Private owner
aa3596,n757rw,c152,Cessna 152,Private owner
aa359d,n757sc,c152,Cessna 152,Private owner
aa35af,n757sw,c152,Cessna 152,Private owner
aa35d0,n757ud,c152,Cessna 152,Private owner
aa35dc,n757ur,c152,Cessna 152,Private owner
aa35e7,n757vb,c152,Cessna 152,Private owner
aa3613,n757ww,c152,Cessna 152,Private owner
aa363a,n757yk,c152,Cessna 152,Private owner
aa363c,n757ym,c152,Cessna 152,Private owner
aa3648,n757yz,c152,Cessna 152,Private owner
aa3656,n757zn,c152,Cessna 152,Private owner
aa4e3e,n763sa,c152,Cessna 152,Private owner
aadfc8,n80ct,c152,Cessna 152,Private owner
ab67de,n834gt,c152,Cessna 152,Private owner
aaf664,n805w,c152,Cessna 152,Private owner
aaf800,n80587,c152,Cessna 152,Private owner
aaaec7,n788fm,c152,Cessna 152,Private owner
abc123,lv-ono,c152,Cessna 152,Private owner
ab7e9d,n84mk,c152,Cessna 152,Private owner
ac7be2,n903sa,c152,Cessna 152,Private owner
ac950c,n91hl,c152,Cessna 152,Private owner
accae0,n923sa,c152,Cessna 152,Private owner
ac480c,n89021,c152,Cessna 152,Private owner
ac4878,n89054,c152,Cessna 152,Private owner
ac48e1,n89084,c152,Cessna 152,Private owner
ac4b7e,n89102,c152,Cessna 152,Private owner
ac4ba3,n89114,c152,Cessna 152,Private owner
ac4c9a,n89186,c152,Cessna 152,Private owner
ac4f5b,n89215,c152,Cessna 152,Private owner
ac4f7f,n89226,c152,Cessna 152,Private owner
ac52eb,n89301,c152,Cessna 152,Private owner
ac530f,n89312,c152,Cessna 152,Private owner
ac5356,n89333,c152,Cessna 152,Private owner
ac53a1,n89358,c152,Cessna 152,Private owner
ac5405,n89383,c152,Cessna 152,Private owner
ac570d,n89433,c152,Cessna 152,Private owner
ac5756,n89456,c152,Cessna 152,Private owner
ac5a84,n89519,c152,Cessna 152,Private owner
ac5aa2,n89524,c152,Cessna 152,Private owner
ac5aca,n89539,c152,Cessna 152,Private owner
ac5ae7,n89543,c152,Cessna 152,Private owner
ace8f5,n93069,c152,Cessna 152,Private owner
ac5ec0,n89652,c152,Cessna 152,Private owner
ac5f28,n89681,c152,Cessna 152,Private owner
ac6213,n89727,c152,Cessna 152,Private owner
ac62de,n89780,c152,Cessna 152,Private owner
ac6335,n89859,c152,Cessna 152,Private owner
ac65a5,n89815,c152,Cessna 152,Private owner
ac6652,n89863,c152,Cessna 152,Private owner
ac6658,n89869,c152,Cessna 152,Private owner
ac69a0,n89933,c152,Cessna 152,Private owner
ac6a4c,n89980,c152,Cessna 152,Private owner
aca37a,n913ta,c152,Cessna 152,Private owner
acec19,n93122,c152,Cessna 152,Private owner
acf038,n93251,c152,Cessna 152,Private owner
acf25f,n933sa,c152,Cessna 152,Private owner
acf368,n93316,c152,Cessna 152,Private owner
acf555,n934jh,c152,Cessna 152,Private owner
ad3b81,n95153,c152,Cessna 152,Private owner
ad3da6,n952sa,c152,Cessna 152,Private owner
ad415d,n953sa,c152,Cessna 152,Private owner
ad4514,n954sa,c152,Cessna 152,Private owner
ad4643,n95429,c152,Cessna 152,Private owner
acf763,n93434,c152,Cessna 152,Private owner
acfafb,n93528,c152,Cessna 152,Private owner
acfb5c,n93550,c152,Cessna 152,Private owner
acfeab,n93621,c152,Cessna 152,Private owner
ad0284,n93730,c152,Cessna 152,Private owner
ad063c,n93831,c152,Cessna 152,Private owner
ad918c,n9733a,c152,Cessna 152,Private owner
ad4684,n95444,c152,Cessna 152,Private owner
ad4685,n95445,c152,Cessna 152,Private owner
ad46cf,n95469,c152,Cessna 152,Private owner
ad46ee,n95475,c152,Cessna 152,Private owner
ad4a1d,n95539,c152,Cessna 152,Private owner
ad4a5a,n95550,c152,Cessna 152,Private owner
ad4b65,n956er,c152,Cessna 152,Private owner
ad4d68,n95606,c152,Cessna 152,Private owner
ad4ea0,n95693,c152,Cessna 152,Private owner
ad5161,n95722,c152,Cessna 152,Private owner
ad525b,n95797,c152,Cessna 152,Private owner
ad5517,n95821,c152,Cessna 152,Private owner
ad553a,n95831,c152,Cessna 152,Private owner
ad56be,n959gt,c152,Cessna 152,Private owner
ad58f6,n95936,c152,Cessna 152,Private owner
ad09d6,n93927,c152,Cessna 152,Private owner
ad0ea8,n940rj,c152,Cessna 152,Private owner
ad1375,n94112,c152,Cessna 152,Private owner
ad13c1,n94138,c152,Cessna 152,Private owner
ad17e1,n94268,c152,Cessna 152,Private owner
ad1825,n94286,c152,Cessna 152,Private owner
ad1844,n94292,c152,Cessna 152,Private owner
ad5fd4,n96092,c152,Cessna 152,Private owner
ad1b94,n94364,c152,Cessna 152,Private owner
ad1e75,n94400,c152,Cessna 152,Private owner
ad1f08,n94447,c152,Cessna 152,Private owner
ad1f50,n94469,c152,Cessna 152,Private owner
ad2231,n94505,c152,Cessna 152,Private owner
ad2252,n94513,c152,Cessna 152,Private owner
ad22dd,n94552,c152,Cessna 152,Private owner
ad2303,n94565,c152,Cessna 152,Private owner
ad2328,n94577,c152,Cessna 152,Private owner
ad234d,n94589,c152,Cessna 152,Private owner
ad2508,n946sf,c152,Cessna 152,Private owner
ad25ec,n94609,c152,Cessna 152,Private owner
ad262f,n94626,c152,Cessna 152,Private owner
ad2678,n94649,c152,Cessna 152,Private owner
ad2692,n94650,c152,Cessna 152,Private owner
ad269b,n94659,c152,Cessna 152,Private owner
ad28bf,n947sf,c152,Cessna 152,Private owner
ad29c6,n94719,c152,Cessna 152,Private owner
ad6eba,n965aa,c152,Cessna 152,Private owner
ad2d99,n94822,c152,Cessna 152,Private owner
ad2e4e,n94878,c152,Cessna 152,Private owner
ad2e8d,n94891,c152,Cessna 152,Private owner
ad317a,n94939,c152,Cessna 152,Private owner
ad371d,n95005,c152,Cessna 152,Private owner
ad375f,n95021,c152,Cessna 152,Private owner
ad3ad2,n95103,c152,Cessna 152,Private owner
ad853a,n970se,c152,Cessna 152,Private owner
ad87e5,n971fm,c152,Cessna 152,Private owner
c056c2,c-ggwf,c152,,
a26cad,n25518,c152,Cessna 152,Private owner
a6685f,n5116q,c152,Cessna 152,Private owner
a67331,n5144b,c152,Cessna 152,Private owner
a818e7,n6202m,c152,Cessna 152,Private owner
a6225b,n49471,c152,Cessna 152,Private owner
ad59c7,n95995,c152,Cessna 152,Private owner
ad22dc,n94551,c152,Cessna 152,Private owner
a62908,n4962h,c152,Cessna 152,Private owner
c88070,dq-fti,c152,Cessna A152 Aerobat,Pacific Flying School
a8859d,n6482m,c152,Cessna 152,Private owner
a8a2da,n65584,c152,Cessna 152,Private owner
a45a94,n38su,c152,Cessna 152,Private owner
a23de2,n24327,c152,Cessna 152,Private owner
a8aa17,n6577q,c152,Cessna 152,Private owner
449983,oo-flc,c152,Reims Cessna F152,Sabena Aero Club
a5c472,n4707l,c152,Cessna 152,Private owner
a9113a,n68334,c152,Cessna 152,Private owner
ad0f9f,n94006,c152,Cessna 152,Private owner
aace6f,n796bg,c152,Cessna 152,Private owner
a4d3c7,n41wm,c152,Cessna 152,Private owner
a0e564,n157nh,c152,Cessna 152,Private owner
a61770,n4919p,c152,Cessna 152,Private owner
a88f87,n6503m,c152,Cessna 152,Private owner
ab7da6,n84bn,c152,Cessna 152,Private owner
aa3524,n757mg,c152,Cessna 152,Private owner
a92d76,n69029,c152,Cessna 152,Private owner
a00de7,n102uc,c152,Cessna 152,Private owner
ad5fd8,n96096,c152,Cessna 152,Private owner
ac5ac4,n89533,c152,Cessna 152,Private owner
a8d8ab,n66946,c152,Cessna 152,Private owner
ad46ed,n95474,c152,Cessna 152,Private owner
ac669c,n89887,c152,Cessna 152,Private owner
a84ff1,n6347m,c152,Cessna 152,Private owner
a6fbb5,n5490b,c152,Cessna 152,Private owner
a82851,n6246p,c152,Cessna 152,Private owner
a1ea3d,n222um,c152,Cessna 152,Private owner
406f04,g-ppls,c152,Reims Cessna F152,Private owner
a89e0f,n65408,c152,Cessna 152,Private owner
a250f0,n2486q,c152,Cessna 152,Private owner
ac6635,n89859,c152,Cessna 152,Private owner
a25a82,n25047,c152,Cessna 152,Private owner
3d3719,d-etcr,c152,Cessna 152,Private owner
a68c24,n5206m,c152,Cessna 152,Private owner
a037d6,n113fa,c152,Cessna 152,Private owner
a8413b,n6308q,c152,Cessna 152,Private owner
a5abf2,n4648l,c152,Cessna 152,Private owner
a67717,n5155p,c152,Cessna 152,Private owner
add109,n99hr,c152,Cessna 152,Private owner
a5191b,n4278l,c152,Cessna 152,Private owner
a261a8,n25225,c152,Cessna 152,Private owner
ad1846,n94294,c152,Cessna 152,Private owner
300439,i-cntr,c152,Cessna 152,Private owner
a86f0d,n6420m,c152,Cessna 152,Private owner
a5dde7,n4773l,c152,Cessna 152,Private owner
a67ee2,n5178b,c152,Cessna 152,Private owner
a6987f,n524hf,c152,Cessna 152,Private owner
a70d17,n5531m,c152,Cessna 152,Private owner
a5dacc,n47672,c152,Cessna 152,Private owner
a6308c,n49825,c152,Cessna 152,Private owner
aa34dc,n757jk,c152,Cessna 152,Private owner
a827e9,n6243q,c152,Cessna 152,Private owner
a6c9a9,n5364p,c152,Cessna 152,Private owner
a833df,n6279p,c152,Cessna 152,Private owner
ad2324,n94573,c152,Cessna 152,Private owner
a6fcfd,n5499q,c152,Cessna 152,Private owner
a7f164,n6102h,c152,Cessna 152,Private owner
a90d3e,n68215,c152,Cessna 152,Private owner
a63533,n49990,c152,Cessna 152,Private owner
a90d5c,n68220,c152,Cessna 152,Private owner
a60957,n48849,c152,Cessna 152,Private owner
a85b0c,n6377b,c152,Cessna 152,Private owner
a91fcc,n68710,c152,Cessna 152,Private owner
a5e20a,n4786p,c152,Cessna 152,Private owner
ad179a,n94247,c152,Cessna 152,Private owner
a6be07,n53304,c152,Cessna 152,Private owner
a26c84,n25502,c152,Cessna 152,Private owner
a0087d,n101at,c152,Cessna 152,Private owner
49108f,cs-ddo,c152,Cessna A152 Aerobat,Private owner
406eb7,g-huxy,c152,Cessna 152,Private owner
ac69a1,n89934,c152,Cessna 152,Private owner
a9358b,n69271,c152,Cessna 152,Private owner
aa357c,n757qv,c152,Cessna 152,Private owner
a881c3,n6471m,c152,Cessna 152,Private owner
a8ed0a,n67405,c152,Cessna 152,Private owner
49d383,ok-pmf,c152,Piper PA-46,Private owner
403003,g-brnd,c152,Cessna 152,Private owner
3d1be6,d-eiuw,c152,Reims Cessna FA152 Aerobat,Private owner
aa3529,n757mm,c152,Cessna 152,Private owner
a9275d,n68920,c152,Cessna 152,Private owner
a605bd,n48753,c152,Cessna 152,Private owner
a87392,n6436h,c152,Cessna 152,Private owner
3d2b38,d-eops,c152,Reims Cessna 152,Private owner
a609c0,n48879,c152,Cessna 152,Private owner
49d2b0,ok-skp,c152,Cessna F152,Private owner
4028c6,g-bniv,c152,Cessna 152,Private owner
a98c8e,n714sw,c152,Cessna 152,Private owner
a867a2,n6400q,c152,Cessna 152,Private owner
a6508a,n506de,c152,Cessna 152,Private owner
a0119e,n103uc,c152,Cessna 152,Private owner
ad269a,n94658,c152,Cessna 152,Private owner
a8f896,n67733,c152,Cessna 152,Private owner
a6d4c2,n5394b,c152,Cessna 152,Private owner
a8fc2c,n67825,c152,Cessna 152,Private owner
a17375,n193bm,c152,Cessna 152,Private owner
a6733a,n5144l,c152,Cessna 152,Private owner
a2414c,n24400,c152,Cessna 152,Private owner
a681f6,n5183p,c152,Cessna 152,Private owner
49d23c,ok-ogc,c152,Cessna 152,Aeroklub Tocna
a90d3a,n68211,c152,Cessna 152,Private owner
acec1b,n93124,c152,Cessna 152,Private owner
a8d8f2,n66967,c152,Cessna 152,Private owner
a5ebe4,n48068,c152,Cessna 152,Private owner
402917,g-gfig,c152,Cessna 152,Private owner
3d187b,d-ehnf,c152,Cessna 152,Private owner
44026f,oe-crs,c152,Cessna 152,Airli
a5d73c,n47586,c152,Cessna 152,Private owner
3d2707,d-enal,c152,Cessna 152,Private owner
a25169,n24896,c152,Cessna 152,Private owner
ad222c,n94500,c152,Cessna 152,Private owner
c07d7b,c-gvnm,c152,Cessna 152,Private owner
a8730d,n6432q,c152,Cessna 152,Private owner
aa3907,n758pa,c152,Cessna 152,Private owner
a5db06,n4769q,c152,Cessna 152,Private owner
a2454b,n24522,c152,Cessna 152,Private owner
a23e8d,n24373,c152,Cessna 152,Private owner
c02eef,c-fruc,c152,Cessna 152,Private owner
a0d2e8,n152pf,c152,Cessna 152,Private owner
a5b262,n4661b,c152,Cessna 152,Private owner
a85af3,n6376m,c152,Cessna 152,Private owner
a5f395,n48285,c152,Cessna 152,Private owner
aa3434,n757bs,c152,Cessna 152,Private owner
a0d319,n152re,c152,Cessna 152,Private owner
a0d252,n152hf,c152,Cessna 152,Private owner
3d1abb,d-eijj,c152,Cessna 152,Private owner
40277b,g-owow,c152,Cessna 152,Private owner
a5faff,n48481,c152,Cessna 152,Private owner
a612d3,n49024,c152,Cessna 152,Private owner
4051f4,g-cepx,c152,Cessna 152,Private owner
ad5189,n95737,c152,Cessna 152,Private owner
aa365a,n757zs,c152,Cessna 152,Private owner
a80467,n6155q,c152,Cessna 152,Private owner
a98d2f,n714zg,c152,Cessna 152,Private owner
3d2aae,d-eokk,c152,Cessna C152,Private owner
a6ca33,n5368m,c152,Cessna 152,Private owner
a69ddb,n5250b,c152,Cessna 152,Private owner
392303,f-giyd,c152,Cessna 152,Private owner
acf767,n93438,c152,Cessna 152,Private owner
a885f9,n64849,c152,Cessna 152,Private owner
a9316c,n69142,c152,Cessna 152,Private owner
ad2297,n94532,c152,Cessna 152,Private owner
3d14c7,d-egct,c152,Cessna F152,Private owner
390e32,f-gdrs,c152,Reims-Cessna F152,Aeroclub d'Angouleme
ad2a74,n94768,c152,Cessna 152,Private owner
a91580,n68477,c152,Cessna 152,Private owner
a08db8,n1349z,c152,Cessna 152,Private owner
a5ebbf,n48056,c152,Cessna 152,Private owner
a06413,n124rp,c152,Cessna 152,Private owner
3908f4,f-gchu,c152,Reims-Cessna F152,Aero Club du Bassin D'Arcachon
ac6679,n89877,c152,Cessna 152,Private owner
a89426,n65199,c152,Cessna 152,Private owner
a7fc89,n6132h,c152,Cessna 152,Private owner
a60cea,n48938,c152,Cessna 152,Private owner
3d450d,d-eykb,c152,Cessna F152,Private owner
402915,g-wach,c152,Cessna FA152 Aerobat,Airways Aero Associations
402095,g-bkwy,c152,Cessna F152,Northumbria Flying School
a5ac16,n4649m,c152,Cessna 152,Private owner
a87f1a,n6469b,c152,Cessna 152,Private owner
a5d738,n47582,c152,Cessna 152,Private owner
a83cef,n63rw,c152,Cessna 152,Private owner
40317c,g-mass,c152,Cessna 152,MK Aero Support
a5fe6f,n48560,c152,Cessna 152,Private owner
a69745,n5236h,c152,Cessna 152,Private owner
a5aad1,n4640b,c152,Cessna 152,Private owner
a62d81,n49772,c152,Cessna 152,Private owner
3d0f58,d-eebg,c152,Cessna F152,Private owner
a6309d,n4983m,c152,Cessna 152,Private owner
a269e3,n25480,c152,Cessna 152,Private owner
a8f498,n67612,c152,Cessna 152,Private owner
a8a2dc,n65586,c152,Cessna 152,Private owner
a8ffe2,n67924,c152,Cessna 152,Private owner
a66482,n5105m,c152,Cessna 152,Private owner
a87de9,n6460m,c152,Cessna 152,Private owner
aa3500,n757kw,c152,Cessna 152,Private owner
a88628,n6486l,c152,Cessna 152,Private owner
a1a019,n2034n,c152,Cessna 152,Private owner
a98d17,n714yh,c152,Cessna 152,Private owner
a596d5,n45967,c152,Cessna 152,Private owner
3d13d8,d-efto,c152,Reims R152,Private owner
402146,g-btal,c152,Cessna 152,Herefordshire Aero Club
c087bb,c-gzkk,c152,Cessna 152,Private owner
c06630,c-gmsd,c152,Cessna 152,Private owner
a8ed94,n67443,c152,Cessna 152,Private owner
a882ba,n6478p,c152,Cessna 152,Private owner
a5eafd,n4800m,c152,Cessna 152,Private owner
c0331f,c-ftji,c152,Cessna 152,Private owner
ac8ed9,n908wa,c152,Cessna 152,Private owner
a6c65b,n5357p,c152,Cessna 152,Private owner
ad5238,n95787,c152,Cessna 152,Private owner
ac6938,n89904,c152,Cessna 152,Private owner
3d1a31,d-eieb,c152,Cessna F152,BWLV Motorflugschule
3d04d1,d-eabp,c152,Cessna F152 II,Private owner
3d19c8,d-eiaa,c152,Cessna F152,Private owner
aa35c7,n757tv,c152,Cessna 152,Private owner
3d1322,d-efmo,c152,Cessna 152,Private owner
4847ad,ph-cbg,c152,Reims Cessna F152,Private owner
a84bd1,n6334m,c152,Cessna 152,Private owner
a8a576,n65601,c152,Cessna 152,Private owner
49d3a0,ok-fad,c152,Cessna A152 Aerobat,Flying Academy
a6f82b,n5481m,c152,Cessna 152,Private owner
a8fc71,n67844,c152,Cessna 152,Private owner
aa34be,n757he,c152,Cessna 152,Private owner
a5fa09,n48410,c152,Cessna 152,Private owner
a8c598,n6641h,c152,Cessna 152,Private owner
aa359e,n757sd,c152,Cessna 152,Private owner
c07064,c-gqop,c152,Cessna 152,Private owner
aa35d2,n757uf,c152,Cessna 152,Private owner
ac53e6,n89377,c152,Cessna 152,Private owner
a26cac,n25517,c152,Cessna 152,Private owner
acf05d,n93263,c152,Cessna 152,Private owner
a60281,n4869l,c152,Cessna 152,Private owner
a9a8c4,n721rk,c152,Cessna 152,Private owner
a8e954,n67306,c152,Cessna 152,Private owner
a709e8,n5525h,c152,Cessna 152,Private owner
4407ca,oe-cmy,c152,Reims-Cessna F152,Private owner
a616ef,n49150,c152,Cessna 152,Private owner
a5da90,n4766b,c152,Cessna 152,Private owner
3d2333,d-elot,c152,Reims Aviation F152M,Flugschule Hamburg
390604,f-gbqe,c152,Cessna F152,Aero Club Paul Tissandier
a93499,n69204,c152,Cessna 152,Private owner
a67e56,n5174b,c152,Cessna 152,Private owner
ace81c,n93002,c152,Cessna 152,Private owner
406f51,g-ciuh,c152,Cessna 152,Private owner
a8006a,n6143q,c152,Cessna 152,Private owner
a609e1,n48887,c152,Cessna 152,Private owner
a98d3b,n714zu,c152,Cessna 152,Private owner
406f85,g-ciuu,c152,Reims Cessna F152,Private owner
a0265b,n109cf,c152,Cessna 152,Private owner
aa3659,n757zr,c152,Cessna 152,Private owner
a274a3,n25754,c152,Cessna 152,Private owner
7c0b55,vh-civ,c152,Cessna 152,Aircraft Assemblers Australia
a621ce,n49430,c152,Cessna 152,Private owner
a40dcd,n360rk,c152,Cessna 152,Private owner
a0d33c,n152sq,c152,Cessna 152,Private owner
a2428f,n24498,c152,Cessna 152,Private owner
a65e4e,n5094l,c152,Cessna 152,Private owner
a61686,n49120,c152,Cessna 152,Private owner
a98c96,n714td,c152,Cessna 152,Private owner
a23ed9,n24399,c152,Cessna 152,Private owner
ac53e1,n89372,c152,Cessna 152,Private owner
a269c6,n25476,c152,Cessna 152,Private owner
a61386,n49078,c152,Cessna 152,Private owner
c08936,c-gzyz,c152,Cessna 152,Private owner
a61aca,n49261,c152,Cessna 152,Private owner
a254f8,n24981,c152,Cessna 152,Private owner
a62902,n4962b,c152,Cessna 152,Private owner
a62569,n49527,c152,Cessna 152,Private owner
a93173,n69149,c152,Cessna 152,Private owner
3d2372,d-elre,c152,Cessna F152 II,Private owner
a920ca,n68789,c152,Cessna 152,Private owner
3d187c,d-ehng,c152,Cessna F152,Private owner
ac4836,n89038,c152,Cessna 152,Private owner
a56466,n4468q,c152,Cessna 152,Private owner
a050d0,n1196d,c152,Cessna 152,Private owner
a1d803,n218ja,c152,Cessna 152,Private owner
a92018,n68736,c152,Cessna 152,Private owner
ac6231,n89732,c152,Cessna 152,Private owner
ad423d,n95300,c152,Cessna 152,Private owner
a0d2a9,n152lt,c152,Cessna 152,Private owner
a25aa5,n25057,c152,Cessna 152,Private owner
a86fbf,n6425q,c152,Cessna 152,Private owner
00a7c5,zs-pay,c152,Cessna 152,Private owner
ac5b75,n89585,c152,Cessna 152,Private owner
a693f1,n5229b,c152,Cessna 152,Private owner
aa35de,n757ut,c152,Cessna 152,Private owner
a26586,n25339,c152,Cessna 152,Private owner
a98c95,n714tc,c152,Cessna 152,Private owner
4606ba,oh-cog,c152,Cessna 152,Salpauslento Oy
a8d6d9,n669ne,c152,Cessna 152,Private owner
a25522,n24998,c152,Cessna 152,Private owner
a609cc,n4888l,c152,Cessna 152,Private owner
a8f1fb,n67594,c152,Cessna 152,Private owner
acc5a2,n922ak,c152,Cessna 152,Private owner
a6060c,n4878b,c152,Cessna 152,Private owner
acec84,n93154,c152,Cessna 152,Private owner
a85762,n6367q,c152,Cessna 152,Private owner
a61af8,n4928b,c152,Cessna 152,Private owner
a6313e,n49878,c152,Cessna 152,Private owner
a62d16,n49740,c152,Cessna 152,Private owner
a6128e,n49005,c152,Cessna 152,Private owner
abb721,n854km,c152,Cessna 152,Private owner
491212,cs-dpr,c152,Cessna 152,Private owner
a9155f,n68469,c152,Cessna 152,Private owner
a6225a,n49470,c152,Cessna 152,Private owner
acec80,n93150,c152,Cessna 152,Private owner
a269a6,n25469,c152,Cessna 152,Private owner
a2426a,n24486,c152,Cessna 152,Private owner
aa364a,n757za,c152,Cessna 152,Private owner
abbdee,n856da,c152,Cessna 152,Private owner
4050a3,g-cefm,c152,Cessna 152,Private owner
a5b26f,n4661q,c152,Cessna 152,Private owner
a61ad5,n4927b,c152,Cessna 152,Private owner
ad588b,n95904,c152,Cessna 152,Private owner
a25094,n24833,c152,Cessna 152,Private owner
a897c6,n6529l,c152,Cessna 152,Private owner
a63115,n49862,c152,Cessna 152,Private owner
a88f83,n6503h,c152,Cessna 152,Private owner
a5de70,n4777h,c152,Cessna 152,Private owner
49d2bc,ok-stb,c152,Reims-Cessna F152,Air Czech
a62d51,n4976p,c152,Cessna 152,Private owner
a92386,n68813,c152,Cessna 152,Private owner
a3bef4,n340sx,c152,Cessna 152,Private owner
ad4d8a,n95615,c152,Cessna 152,Private owner
44d86c,oo-vcl,c152,Cessna FA152 Aerobat,Private owner
ad4a60,n95556,c152,Cessna 152,Private owner
a0d200,n152dz,c152,Cessna 152,Private owner
aa34f1,n757kf,c152,Cessna 152,Private owner
a60996,n48862,c152,Cessna 152,Private owner
a812f9,n6193l,c152,Cessna 152,Private owner
a268f4,n25416,c152,Cessna 152,Private owner
a6decf,n5416b,c152,Cessna 152,Private owner
3908ef,f-gchp,c152,Reims F152,Private owner
a6ba64,n5321p,c152,Cessna 152,Private owner
40702d,g-cixp,c152,Cessna 152,Private owner
a8ed91,n67440,c152,Cessna 152,Private owner
a682bc,n5189b,c152,Cessna 152,Private owner
aca731,n914ta,c152,Cessna 152,Private owner
aae897,n80146,c152,Cessna 152,Private owner
a5b2ee,n4665b,c152,Cessna 152,Private owner
a27c0d,n25950,c152,Cessna 152,Private owner
401e61,g-bhmg,c152,Reims Cessna FA152,Private owner
a23dff,n24331,c152,Cessna 152,Private owner
3d1c3d,d-eiyf,c152,Cessna F152,Private owner
a5d6f7,n47567,c152,Cessna 152,Private owner
a90d3b,n68212,c152,Cessna 152,Private owner
a2548e,n24950,c152,Cessna 152,Private owner
a261c9,n25233,c152,Cessna 152,Private owner
a98d0c,n714xx,c152,Cessna 152,Private owner
a0d317,n152rc,c152,Cessna 152,Private owner
a87b49,n6458l,c152,Cessna 152,Private owner
ad31c0,n94959,c152,Cessna 152,Private owner
402900,g-figa,c152,Cessna 152,Private owner
7c23be,vh-hcg,c152,,
acfafc,n93529,c152,,
401db1,g-bglg,c152,,
aa361f,n757xh,c152,,
a60950,n48842,c152,,
a70de5,n5537h,c152,Cessna 152,Private owner
aa6428,n769ne,c152,Cessna 152,Private owner
a6f090,n5460b,c152,Cessna 152,Private owner
a6825c,n5186l,c152,Cessna 152,Private owner
a80089,n6144l,c152,,
a0d1d8,n152cj,c152,,
a6edfd,n5458p,c152,,
ad144e,n94179,c152,,
a88a15,n64975,c152,,
a8d915,n66977,c152,Cessna 152,Private owner
c06ea0,c-gpxf,c152,Cessna 152,Private owner
ad0aaa,n93989,c152,,
3d1a59,d-eifp,c152,,
4028eb,g-bnkc,c152,,
a6d0f2,n5383m,c152,,
4715ce,ha-igs,c152,,
4b057f,hb-ccd,c152,,
a245b5,n24553,c152,,
a8ed28,n67410,c152,,
a8a5ae,n6562m,c152,,
a8e6b5,n67286,c152,,
a5af43,n4655p,c152,,
a6a24a,n5265l,c152,,
a0d270,n152jl,c152,,
402b8a,g-gfid,c152,,
ad29c1,n94714,c152,,
c07b99,c-guuy,c152,,
ac5ec1,n89653,c152,,
392639,f-gjrz,c152,,
ad2321,n94570,c152,,
402009,g-bkaz,c152,,
aa35be,n757tl,c152,,
a8d8c9,n66951,c152,,
ad4a5b,n95551,c152,,
a26d7d,n25576,c152,,
a58547,n455gb,c152,,
a6c586,n5351l,c152,,
aa34e8,n757jx,c152,,
a50f4f,n425mk,c152,,
a66bc3,n5124b,c152,,
a8372b,n6286m,c152,,
3d1304,d-eflk,c152,,
300438,i-cnts,c152,,
a89058,n6509l,c152,,
a5f9e6,n48400,c152,,
49d2f1,ok-hot,c152,,
7394f5,4x-cgb,c152,,
a01555,n104uc,c152,,
403e36,g-bxjm,c152,,
46066b,oh-clf,c152,,
a5cf63,n47354,c152,,
a80444,n6154q,c152,,
44a0c5,oo-hfe,c152,,
a26011,n252mt,c152,,
a8ffe0,n67922,c152,,
402d8f,g-bpme,c152,,
402919,g-bnje,c152,,
7394f6,4x-chg,c152,,
a93495,n69200,c152,,
ac5aed,n89549,c152,,
a269c4,n25474,c152,,
a5eb98,n48042,c152,,
406a6b,g-eekk,c152,,
a8ea48,n67375,c152,,
a0316b,n111rk,c152,,
a8a2d9,n65583,c152,,
7c4343,vh-nkl,c152,,
a900e1,n68ac,c152,,
40277c,g-bmta,c152,,
3006eb,i-garc,c152,,
aafbd3,n80690,c152,,
ac7ffd,n904wa,c152,,
5110e4,es-ecl,c152,,
404ef0,g-cdtx,c152,,
40325d,g-bsto,c152,,
48a5c9,sp-kok,c152,,
4021ca,g-flip,c152,,
ac6255,n89743,c152,,
4b05fe,hb-cha,c152,,
a85f09,n6389b,c152,,
a0190c,n105uc,c152,,
acfed4,n93637,c152,,
403baf,g-bwnd,c152,,
44d86d,oo-vcm,c152,,
49d3c9,ok-fag,c152,,
a5fde5,n48522,c152,,
a24528,n24512,c152,,
403193,g-bsdo,c152,,
402953,g-bnjh,c152,,
a5a739,n46308,c152,,
44091f,oe-cla,c152,,
a27c59,n25976,c152,,
aa34cb,n757ht,c152,,
4028dd,g-bnks,c152,,
3006c6,i-amcr,c152,,
3d2918,d-enuu,c152,,
3d1453,d-efyh,c152,,
4606b4,oh-coa,c152,,
a852b6,n6350q,c152,,
a5c406,n4704h,c152,,
a5f308,n48244,c152,,
a61a43,n49226,c152,,
a59c52,n46020,c152,,
46ccc9,sx-sfi,c152,,
4408a3,oe-cfe,c152,,
a6f128,n5464p,c152,,
49d3c8,ok-faf,c152,,
a5b30c,n46657,c152,,
a42e53,n369gb,c152,,
3d19e8,d-eibg,c152,,
aa34e9,n757jy,c152,,
ad22de,n94553,c152,,
39b113,f-hmit,c152,,
a6052e,n48710,c152,,
e88d25,zp-bab,c152,,
a62528,n4951b,c152,,
ad222e,n94502,c152,,
a8eddb,n67464,c152,,
a5ba10,n46826,c152,,
505df2,om-ero,c152,,
300633,i-bgbg,c152,,
44b2c3,oo-lvc,c152,,
40274a,g-bmxa,c152,,
acfaf9,n93526,c152,,
ad45f8,n95404,c152,,
aa34cf,n757hx,c152,,
a8f474,n67601,c152,,
a5a39f,n46212,c152,,
ad7b02,n968ms,c152,,
460790,oh-cwm,c152,,
3d19e7,d-eibf,c152,,
48d02b,sp-wbl,c152,,
48a512,sp-kit,c152,,
7c701e,vh-wfk,c152,,
3d1c3b,d-eiyd,c152,,
a81c5b,n6210q,c152,,
ac48bb,n89071,c152,,
a5c757,n4711l,c152,,
a5a386,n4621b,c152,,
a91fd0,n68714,c152,,
ac5e9d,n89642,c152,,
4408bd,oe-cfd,c152,,
a2456c,n24530,c152,,
a5c43d,n47053,c152,,
3d1237,d-efdn,c152,,
a6306c,n49818,c152,,
a0d207,n152ef,c152,,
401e10,g-bhai,c152,,
401f10,g-bils,c152,,
ad2ad5,n94790,c152,,
3d0617,d-eaod,c152,,
4aaf14,se-kxt,c152,,
46065a,oh-cko,c152,,
a7fd82,n6139m,c152,,
a8ea6d,n67387,c152,,
a61eed,n49394,c152,,
a8acd5,n6580l,c152,,
a9ef8c,n7395l,c152,,
a6090b,n48823,c152,,
aa3543,n757nn,c152,,
390520,f-gbja,c152,,
3995ec,f-hfpm,c152,,
aa348f,n757fh,c152,,
4896b7,sp-fzy,c152,,
a629e0,n4968p,c152,,
3d1af5,d-eilp,c152,,
3d4592,d-eype,c152,,
3d1df6,d-ejpe,c152,,
a8f109,n67527,c152,,
a6b714,n5314m,c152,,
ac61c8,n89702,c152,,
a92dba,n69047,c152,,
a91184,n68358,c152,,
aa362e,n757xy,c152,,
402567,g-bmcn,c152,,
a7145e,n5550h,c152,,
a26a0d,n25497,c152,,
a61eb5,n4938h,c152,,
a9d95c,n7336b,c152,,
a5f305,n48241,c152,,
3d04ab,d-eead,c152,,
ad13dc,n94140,c152,,
a6c564,n5350m,c152,,
7c6718,vh-une,c152,,
a60580,n4874b,c152,,
a0d1f4,n152dm,c152,,
a69a9a,n5243q,c152,,
a927ca,n68954,c152,,
a8e628,n67245,c152,,
a86f52,n6422l,c152,,
a61dba,n4931b,c152,,
3d14ca,d-egcw,c152,,
ac977b,n910jh,c152,,
7c195c,vh-fam,c152,,
a5ce99,n4730b,c152,,
a81320,n6194q,c152,,
a92db6,n69043,c152,,
aa35d5,n757uj,c152,,
a1e2c3,n220u,c152,,
a6221a,n49456,c152,,
a609bf,n48878,c152,,
4042d0,g-bzeb,c152,,
a0d33b,n152sp,c152,,
a23e6b,n24364,c152,,
aa2f5f,n7553b,c152,,
a0d29a,n152lc,c152,,
a66be6,n5125b,c152,,
49d3cd,ok-ltc,c152,,
401d36,g-bfrv,c152,,
ac1db7,n88yw,c152,,
a5a370,n4620q,c152,,
3d2624,d-emrs,c152,,
a0d1ab,n152ap,c152,,
a98c93,n714ta,c152,,
a5af3d,n4655h,c152,,
a90de8,n68260,c152,,
a23dbb,n24313,c152,,
3d18a9,d-ehoz,c152,,
a0d1c2,n152bm,c152,,
a61782,n49197,c152,,
3938af,f-gofp,c152,,
a9153c,n68459,c152,,
ac65a2,n89812,c152,,
ad59c5,n95993,c152,,
49d363,ok-iri,c152,,
a833dd,n6279m,c152,,
a505f9,n4224h,c152,,
404e34,g-sela,c152,,
403100,g-bscp,c152,,
a8f1b4,n67573,c152,,
49d394,ok-ika,c152,,
a0d337,n152sk,c152,,
44aef0,oo-kwp,c152,,
a5a055,n46146,c152,,
44026e,oe-cnc,c152,,
a98cee,n714ws,c152,,
ad686f,n963ms,c152,,
a840f4,n6306p,c152,,
a63088,n49821,c152,,
ac5f4d,n89693,c152,,
a8ccf7,n66603,c152,,
391db9,f-ghnz,c152,,
3d15cd,d-egmv,c152,,
4028e2,g-bnkv,c152,,
48a62d,sp-ksn,c152,,
a8fc04,n67810,c152,,
406116,g-cgfg,c152,,
