icao,regid,mdl,type,operator
4b2d16,hb-rby,pp3,Pilatus P3-05,Private owner
4b2d1b,hb-rcd,pp3,Pilatus P3-05,Private owner
a60415,n487rd,pp3,Pilatus P3-05,Private Owner
abb35a,n853jw,pp3,Pilatus P3-05,Private owner
4b2d23,hb-rcl,pp3,Pilatus P3-05,Atal Aviation
