icao,regid,mdl,type,operator
132768,rf-32768,ber2,Beriev BE-200,Ministry of Emergency Situatio
102a28,rf-21512,ber2,Beriev Be-200 ChS Altair,TANTK Beriev
147ffe,rf-32766,ber2,,
132302,rf-31130,ber2,,
147990,rf-31120,ber2,,
