icao,regid,mdl,type,operator
447d29,6m-bi,h60,Sikorsky 	S-70A-42,Austrian Air Force
447d28,6m-bh,h60,Sikorsky S-70A-42,Austrian Air Force
a09553,n137bh,h60,Sikorsky S-70A-27,Private owner
447d25,6m-be,h60,Sikorsky S-70A-42,Austrian Air Force
a18dd6,n2fh,h60,Sikorsky S-70C,Private owner
a08de5,n135bh,h60,Sikorsky S-70A-27,Private owner
a11759,n17fh,h60,Sikorsky UH-60A,Brainerd Helicopters
aaea99,n802pj,h60,Sikorsky UH-60A,PJ Helicopters
aaee50,n803pj,h60,Sikorsky UH-60A,PJ Helicopters
447d23,6m-bc,h60,Sikorsky S-70A-42,Austrian Air Force
447d27,6m-bg,h60,,
a0c8d1,n15la,h60,,
a6c8d1,n536xn,h60,,
a6c962,n5362n,h60,,
0ac37b,pnc-0611,h60,,
aaf207,n804pj,h60,,
0ac37c,pnc-0612,h60,,
ac6aff,n9fh,h60,,
0ac394,pnc-0618,h60,,
