icao,regid,mdl,type,operator
48510f,ph-yxy,velo,Velocity XL-RG-5,Private owner
a00a73,n101wv,velo,,
a0535e,n12ws,velo,Amateur Velocity 173FGE,Private owner
a031db,n111vx,velo,Amateur Velocity,Private owner
a12472,n173bg,velo,Amateur Velocity 173 FXD GR,Private owner
a1b905,n21va,velo,Amateur Velocity SE-FG,Private owner
a32373,n301ef,velo,,
a40b01,n36lv,velo,Amateur Velocity XL-5 RG,Private owner
a40e39,n360ft,velo,Piper PA-28-161,Private owner
a50374,n422ec,velo,,
a51e69,n429px,velo,S Velocity Sefg,Private owner
a6601e,n51lp,velo,Amateur Velocity 173RG Elite,Private owner
a6e0e2,n542rs,velo,Amateur Velocity XL RG5,Private owner
a6fd1b,n55aj,velo,Velocity Elite,Private owner
a7c3eb,n6q,velo,Amateur Velocity RG Elite,Private owner
a94635,n697rg,velo,,
aa86b1,n7779x,velo,Amateur Velocity XL/RG,Private owner
ac3a39,n8870l,velo,Amateur Velocity XL Elite,Private owner
484ae5,ph-acw,velo,Velocity 173 FG,Private owner
a1150a,n169vt,velo,,
a05bc4,n122gp,velo,,
aa2e77,n755v,velo,,
a8ac07,n658se,velo,,
a9ad12,n722xl,velo,,
a1df00,n22dn,velo,,
a1e9fb,n222rw,velo,,
a7749d,n58lv,velo,,
add13d,n99kt,velo,,
