icao,regid,mdl,type,operator
484568,ph-jfh,c10t,Cessna P210N Pressurized Centu,Private owner
4b07c1,hb-cyj,c10t,Cessna P210R Pressurized Centu,Private Owner
a8b312,n66nf,c10t,Cessna P210R,Private owner
3d320a,d-erew,c10t,,
