icao,regid,mdl,type,operator
a0b368,n144va,rv14,Vans RV-14,Private owner
a1ca3a,n214va,rv14,Vans RV-14A,Private owner
7c2dc5,vh-jbr,rv14,Van's RV-14,Private owner
a1f9c6,n2261,rv14,Vans RV-14,Private owner
7c75a5,vh-xiv,rv14,Vans RV-14,Private owner
a18ab6,n199mj,rv14,,
7c7c8c,vh-yvy,rv14,,
a0bd4a,n147gc,rv14,,
a3572a,n314rf,rv14,,
00cf02,zu-vrf,rv14,,
7c304a,vh-jto,rv14,,
7c61d3,vh-tlx,rv14,,
a5db76,n477dr,rv14,,
a0a191,n14np,rv14,,
a56a57,n448wp,rv14,,
a35691,n314kc,rv14,,
a5ad4d,n465mm,rv14,,
ac37e2,n887am,rv14,,
ad28b4,n947rv,rv14,,
a1d45b,n217jr,rv14,,
a0a059,n14ab,rv14,,
7c57d5,vh-rmv,rv14,,
ab536e,n829ms,rv14,,
a82d74,n626km,rv14,,
a1ca03,n214sw,rv14,,
a1ca5b,n214wj,rv14,,
addb8a,n992rb,rv14,,
aa5c5b,n767jk,rv14,,
ad9bef,n976wm,rv14,,
a36da9,n32tj,rv14,,
a4f9a8,n42dy,rv14,,
aaae48,n788ak,rv14,,
a4d464,n410ct,rv14,,
a4cfcd,n409tv,rv14,,
a82ba3,n6253t,rv14,,
a3f534,n354rv,rv14,,
acd567,n926kt,rv14,,
a0a74a,n141kb,rv14,,
a4e40a,n414lv,rv14,,
a79b82,n59er,rv14,,
aca763,n914va,rv14,,
ab383e,n82190,rv14,,
a41f4f,n365em,rv14,,
a22fe3,n24yy,rv14,,
