icao,regid,mdl,type,operator
343615,ec-ktc,d28t,Dornier Do-28-G92 Skyservant,Calima Aviacion
3e1bf9,d-ibuf,d28t,Dornier 	Do-128-6,TU Braunschweig
470042,ha-aco,d28t,Dornier Do-28D-2 Skyservant,Private owner
47134d,ha-hib,d28t,Dornier Do-28D-2 Skyservant,Private owner
4738e2,ha-voc,d28t,Dornier Do-28G-2 Skyservant,Private owner
