icao,regid,mdl,type,operator
406bdb,g-tndr,p208,Tecnam P-2008-JC,Private owner
406ce5,g-jsfc,p208,Tecnam P2008-JC,Private owner
406e06,g-tsfc,p208,Tecnam P.2008-JC,Private owner
48d020,sp-wba,p208,Tecnam P2008JC,Private owner
48d028,sp-wbi,p208,Tecnam P2008JC,Private owner
49d091,ok-ils,p208,Tecnam P-2008,Private owner
7cc3c8,24-8398,p208,Tecnam P-2008,Private owner
a1b178,n208tv,p208,Tecnam P-2008,Private owner
a23917,n242ta,p208,Tecnam P-2008,Private owner
a200c6,n228x,p208,Tecnam P-2008,Private owner
a4197e,n363x,p208,Tecnam P2008,Private owner
a5a316,n462x,p208,Tecnam P-2008,Private owner
a5f982,n484x,p208,Tecnam P-2008,Private owner
a71355,n555pt,p208,Tecnam P-2008,Private owner
a7d7c5,n604ta,p208,Tecnam P-2008,Private owner
c82095,zk-mbn,p208,Tecnam P-2008,Private owner
c82096,zk-msa,p208,Tecnam P-2008,Private owner
c820b7,zk-wnz,p208,Tecnam P2008,Private owner
c822d4,zk-wow,p208,Tecnam P-2008,Private owner
c81ed7,zk-kdw,p208,Tecnam P-2008,Private owner
c820c1,zk-zzd,p208,Tecnam P-2008,Private owner
3005b7,i-ozza,p208,Tecnam P2008,Cirrus Aviation
49d13b,ok-dme,p208,Tecnam P-2008,Private owner
40709e,g-rfca,p208,Tecnam P2008,The Waddington Flying Club
49d2d7,ok-iaf,p208,Tecnam P-2008,Private owner
4b1ba5,hb-kmf,p208,Tecnam P2008,Motorfluggruppe Fricktal
4070f2,g-olic,p208,Tecnam P2008-JC,Stapleford Flying Club
4b1ba8,hb-kmi,p208,Tecnam P2008,Flugschule Basel
48aca1,sp-lfb,p208,Tecnam P2008JC,LOT Flight Academy
406e51,g-zoob,p208,Tecnam P2008-JC,Century Aviation
48aca2,sp-lfc,p208,Tecnam P2008JC,LOT Flight Academy
39a711,f-hjyr,p208,Tecnam P2008,ACAFN
488290,sp-awr,p208,Tecnam P2008 JC,Aeroklub Wrocławski
4b1ba1,hb-kmb,p208,Tecnam P2008 JC,Club Aéronautique Swissair Genève / CASG
4b1ba7,hb-kmh,p208,,
ac46fe,n890ta,p208,,
e072d1,lv-gkq,p208,,
e2003e,lv-s030,p208,,
4b1ba6,hb-kmg,p208,,
a06dea,n127ce,p208,,
a1b165,n208ta,p208,,
e2004e,lv-s040,p208,,
a79193,n587ta,p208,,
4b1bab,hb-kml,p208,,
aadb2b,n799tp,p208,,
ac4ab5,n891ta,p208,,
a7d40e,n603ta,p208,,
a1f7fd,n226hc,p208,,
398d95,f-hdmv,p208,,
a87f5c,n647bg,p208,,
300690,i-ozzb,p208,,
407384,g-rfcb,p208,,
a52ae9,n432dt,p208,,
39d666,f-hvtg,p208,,
39d665,f-hvtf,p208,,
a64e70,n505vt,p208,,
31dc12,i-b628,p208,,
39d013,f-huat,p208,,
49d31b,ok-ndb,p208,,
4b1ba9,hb-kmj,p208,,
398a65,f-hctf,p208,,
6b1417,hi981,p208,,
aaf263,n804ta,p208,,
39c5cd,f-hron,p208,,
407296,g-otnm,p208,,
a93017,n691ta,p208,,
adf4c3,n999hb,p208,,
a02def,n110tu,p208,,
4a31b0,yr-lmp,p208,,
a1b05b,n208gk,p208,,
39b9d2,f-hoos,p208,,
3005da,i-acaq,p208,,
30063a,i-mung,p208,,
39bd60,f-hpla,p208,,
aa8e41,n78av,p208,,
c82479,zk-rjn,p208,,
4bd4fa,tc-ugz,p208,,
a04439,n116tu,p208,,
a13aad,n179as,p208,,
39b9cf,f-hoop,p208,,
4a3496,yr-mdu,p208,,
3d0fa0,d-eeea,p208,,
