icao,regid,mdl,type,operator
424776,vp-ccn,glex,Bombardier Global Express XRS,Private owner
780b27,b-8105,glex,Bombardier BD700 Global 6000,Private owner
780b28,b-8197,glex,Bombardier BD700 Global 6000,Private owner
780819,b-8196,glex,Bombardier Global 6000,Lily Jet
4ac9b9,se-rmy,glex,Bombardier BD700 Global 6000,Saab Aircraft
4ac9b4,se-rmt,glex,Bombardier BD700 Global 6000,Saab Aircraft
780bc3,b-8195,glex,,
