icao,regid,mdl,type,operator
3002db,i-pvlj,da40,Diamond DA40 Diamond Star,Private owner
300334,i-pvlk,da40,Diamond DA40 Diamond Star,Private owner
3443cf,ec-lrf,da40,Diamond DA40 Diamond Star,Private owner
3450d4,ec-mhq,da40,Diamond DA-40NG Diamond Star,Private owner
393531,f-gnjr,da40,Diamond DA40 Star,Private owner
393539,f-gnjz,da40,Diamond DA-40D Diamond Star,Private owner
394864,f-gsde,da40,Diamond DA-40D Diamond Star,Private owner
3952a1,f-guvb,da40,Diamond DA40D Star,Private owner
3952a2,f-guvc,da40,Diamond DA-40D Diamond Star,Private owner
3952a7,f-guvh,da40,Diamond DA-40D Diamond Star,Private owner
3952ab,f-guvl,da40,Diamond DA-40D Diamond Star,Private owner
3952b2,f-guvs,da40,Diamond DA-40D Diamond Star,Private owner
3952b3,f-guvt,da40,Diamond DA-40D Diamond Star,Private owner
3952b5,f-guvv,da40,Diamond DA-40D,"Lor'n'air SAS, 57 Feves"
3952b7,f-guvx,da40,Diamond DA-40D Diamond Star,Private owner
3d0db0,d-edky,da40,Diamond DA40D Star,Private owner
3d1061,d-eell,da40,Diamond DA40D Star,Private owner
3d1188,d-eewu,da40,Diamond DA40 Diamond Star,Private owner
3d121c,d-efcm,da40,Diamond DA40 Diamond Star,Private owner
3d1723,d-egzz,da40,Diamond DA40 Diamond Star,Private owner
3d199f,d-ehyl,da40,Diamond DA40D Star,Private owner
39658f,f-gzmp,da40,Diamond DA-40D Diamond Star,Private owner
39802b,f-habl,da40,Diamond DA40D Star,Private owner
3980d2,f-hags,da40,Diamond DA-42NG Twin Star,Private owner
3981e8,f-hapi,da40,Diamond DA40D Star,Private owner
39824f,f-hasp,da40,Diamond DA-40,Private owner
398980,f-hcma,da40,Diamond DA40 Diamond Star,ENAC
398981,f-hcmb,da40,Diamond DA40 Diamond Star,ENAC
398982,f-hcmc,da40,Diamond DA40 Diamond Star,ENAC
398983,f-hcmd,da40,Diamond DA40 Diamond Star,ENAC
398984,f-hcme,da40,Diamond DA40 Diamond Star,ENAC
398985,f-hcmf,da40,Diamond DA40 Diamond Star,ENAC
398986,f-hcmg,da40,Diamond DA40 Diamond Star,ENAC
398987,f-hcmh,da40,Diamond DA40 Diamond Star,ENAC
398988,f-hcmi,da40,Diamond DA40 Diamond Star,ENAC
398c08,f-hdai,da40,Diamond DA-40,Private owner
398c0b,f-hdal,da40,Diamond DA40 Diamond Star,Private owner
398c15,f-hdav,da40,Diamond DA-40 Diamond Star,Private owner
398c19,f-hdaz,da40,Diamond DA-40D,Private owner
398c64,f-hdde,da40,Diamond DA-40D,"ESMA SA, 34 Maugio"
398c65,f-hddf,da40,Diamond DA-40D Diamond Star,Private owner
398d03,f-hdid,da40,Diamond DA-40D Diamond Star,Private owner
39ba88,f-houi,da40,Diamond DA-40 Diamond Star,Private owner
39bf01,f-hpyb,da40,Diamond DA-40D Diamond Star,Private owner
39c953,f-hskt,da40,Diamond DA-40D Diamond Star,Private owner
39d18c,f-humm,da40,Diamond DA-40NG Diamond Star,Aero Club Brest Finistere
3d1fe8,d-ekii,da40,Diamond DA40 Diamond Star,Private owner
3d21f6,d-elco,da40,Diamond DA-40 Diamond Star,Private owner
3d222d,d-eler,da40,Diamond Aircraft Industries	DA,Private Owner
3d2caf,d-eped,da40,Diamond DA-40 Diamond Star,Private owner
3d2ef0,d-eqai,da40,DA40,Private Owner
3d31c1,d-ercb,da40,Diamond DA-40D,Private owner
3d31ec,d-erds,da40,Diamond Star DA 40,Private owner
3d3216,d-erfi,da40,Grob G115B,Private owner
3d321a,d-erfm,da40,Diamond DA40D Star,Private owner
3d3355,d-errp,da40,Diamond Aircraft Industries 	D,Private owner
3d3475,d-escr,da40,Diamond DA40TDI Star,Private owner
3d356d,d-esmf,da40,Diamond DA40 Diamond Star,Private owner
3d3582,d-esna,da40,Diamond DA40 Diamond Star,Private owner
3d3c61,d-evcr,da40,Diamond DA-4,Private owner
3d3ecb,d-ewal,da40,Diamond DA40D Star,Private owner
3d3ed0,d-ewaq,da40,Diamond Aircraft Industries	DA,Westflug Aachen
400dd9,g-kaft,da40,Diamond DA40 Diamond Star,Private owner
400f8c,g-dakm,da40,Diamond DA-40D Diamond Star,Private owner
400fbd,g-occf,da40,Diamond DA40 Diamond Star,Private owner
400fbe,g-occg,da40,Diamond DA40 Star D,Private owner
400ff0,g-occh,da40,Diamond DA40 Star D,Private owner
401065,g-sptt,da40,Diamond DA-40D Diamond Star,Private owner
401067,g-occu,da40,Diamond DA-40D,Diamond Aircraft UK Ltd
401088,g-opsp,da40,Diamond DA40 Diamond Star,Private owner
401130,g-soho,da40,Diamond DA40 Star D,Private owner
3d4102,d-ewwg,da40,Diamond DA40 Star,Private owner
3d41fd,d-exfx,da40,Diamond DA40 Diamond Star,Private owner
3d46c4,d-ezay,da40,Diamond DA40 Diamond Star,Private owner
3d491d,d-ezyb,da40,Diamond DA40 Star,Private owner
4011c7,g-emmm,da40,Diamond DA40 Diamond Star,Private owner
4011ec,g-sfly,da40,Diamond DA40 Diamond Star,Private owner
40125e,g-zany,da40,Diamond DA40 Diamond Star,Private owner
400bd2,g-emdm,da40,Diamond DA40 Star,Private owner
404605,g-cbfa,da40,Diamond DA40 Diamond Star,Private owner
404994,g-ccfu,da40,Diamond DA40 Diamond Star,Private owner
404a07,g-wbvs,da40,Diamond DA-40D,Private owner
404a1d,g-ccki,da40,Diamond DA40 Star D,Private owner
404a6c,g-cclw,da40,Diamond DA40 Diamond Star,Private owner
405839,g-dzky,da40,Diamond DA40 Diamond Star,Private owner
40583a,g-cezr,da40,Diamond DA40 Diamond Star,Private owner
405db2,g-cfjo,da40,Diamond DA40 Diamond Star,Private owner
406001,g-cwis,da40,Diamond DA40 Diamond Star,Private owner
4061a6,g-gcfm,da40,Diamond DA40D Star,Private owner
4064df,g-plip,da40,Diamond DA40 Star,Private owner
4069fd,g-sueo,da40,Diamond DA40NG,Private owner
4400a7,oe-vpu,da40,Diamond DA40 Diamond Star,Private owner
44011b,oe-dts,da40,Diamond DA-40 Diamond Star,Private owner
4401c5,oe-krg,da40,Diamond DA-40D,Private
440243,oe-dar,da40,Diamond DA40 Diamond Star,Private owner
440265,oe-dsm,da40,Diamond DA40 Diamond Star,Private owner
44027c,oe-dge,da40,Diamond DA-40 Star,Private owner
44027e,oe-kwr,da40,,
4402a8,oe-kbu,da40,Diamond DA-40 Diamond Star,"Fliegerclub Bussard, Pasching"
4402c1,oe-kvk,da40,Diamond DA40TDI,Private owner
4402e0,oe-dgp,da40,Diamond DA40D Star,Private owner
440306,oe-dbj,da40,Diamond DA-40D,"Ostend Air College, Oostende B"
440502,oe-ddc,da40,Diamond DA40D Star,Ostend Air College
440535,oe-kde,da40,Diamond DA-40 NG,Private owner
44053f,oe-kfl,da40,Diamond DA.40NG Star,Private owner
4407d4,oe-krj,da40,Diamond DA 40NG,Private owner
44b434,oo-mat,da40,Diamond DA40 Diamond Star,Private owner
458d10,oy-chp,da40,Diamond DA 40D,Private owner
45b332,oy-lyr,da40,Diamond DA40 Diamond Star,Private owner
45c847,oy-rbg,da40,Diamond DA-40 Diamond Star,Private owner
45c848,oy-rbh,da40,Diamond DA40 Diamond Star,Private owner
460927,oh-dmd,da40,Diamond DA 40D Star TDI,Turun Lentokerho - Ãbo Flygkl
461a74,oh-kam,da40,Diamond DA-40 NG,Aeropole
461a7a,oh-kas,da40,Diamond DA-40 Diamond Star,Private owner
463181,oh-stl,da40,Diamond DA40,Private owner
463282,oh-tdi,da40,Diamond DA40 Diamond Star,Private owner
47ac02,ln-ftq,da40,Cessna 172S,Pilot Flyskole AS
47ad37,ln-ftp,da40,Diamond DA40 NG,Sky Management AS
47ad38,ln-fto,da40,Diamond DA 40 NG Star,Private owner
47ad9d,ln-ftm,da40,Diamond DA40 NG,Sky Management AS
4841b0,ph-rad,da40,Diamond DA40 Diamond Star,Private owner
4841be,ph-rab,da40,Diamond DA40 Diamond Star,Private owner
4841bf,ph-rac,da40,Diamond DA40 Diamond Star,Private owner
48442d,ph-dai,da40,Diamond DA40 Diamond Star,Private owner
48442e,ph-jlk,da40,Diamond DA40 Diamond Star,Private owner
484438,ph-fld,da40,Diamond DA40 Diamond Star,Private owner
484474,ph-tdi,da40,Diamond DA40 Diamond Star,Private owner
4845af,ph-usl,da40,Diamond DA-40 Diamond Star,Private owner
4847da,ph-gsy,da40,Diamond DA40 Diamond Star,Private owner
48492a,ph-tin,da40,Diamond DA40 Diamond Star,Private owner
48492b,ph-pca,da40,Diamond DA40 Diamond Star,Private owner
4ab19a,se-llz,da40,Diamond DA-40 Diamond Star,Ljungbyheds Flygklubb
4ab1f0,se-lop,da40,Diamond DA-40 Diamond Star,Private owner
4ab284,se-ltd,da40,Diamond DA40 Diamond Star,Airways Flygutbildning
4ab2ce,se-lvn,da40,Diamond DA40 Diamond Star,Airways Flygutbildning
4ab321,se-lya,da40,Diamond DA40 Diamond Star,Private owner
4ab32f,se-lyo,da40,Diamond DA40 Diamond Star,Airways Flygutbildning
4ab443,se-mbc,da40,Diamond DA-40 Diamond Star,Private Owner
4ab444,se-mbd,da40,Diamond Aircraft Industries	DA,Private Owner
4ab463,se-mcc,da40,Diamond DA-40D TDI Diamond Sta,Sturup Flygklubb
4ab46b,se-mck,da40,Diamond DA40D,Private owner
4ab496,se-mdv,da40,Diamond DA40 Diamond Star,Private owner
484fa5,ph-egm,da40,Diamond DA40 Diamond Star,Private owner
48500a,ph-emw,da40,Diamond DA40 Diamond Star,Private owner
48504b,ph-tds,da40,Diamond DA 40 Diamond Star,Private owner
4851a9,ph-jit,da40,Diamond DA 40 NG Star,Private owner
48c2f2,sp-ryt,da40,Diamond DA40,Private Owner
48c6a5,sp-szf,da40,Diamond DA-40D Diamond Star TD,Fly Polska
49d06b,ok-paz,da40,Diamond DA-40D,Private owner
4b2fd8,hb-sdc,da40,Diamond DA40,Private owner
4b2fd9,hb-sdd,da40,Diamond DA 40 D,TDI Flyers Birrfeld
4b2fdf,hb-sdj,da40,,
4b2fe0,hb-sdk,da40,Diamond DA40D Star,Private owner
4b2fe3,hb-sdn,da40,Diamond DA 40 NG,Private owner
4b2fe9,hb-sdt,da40,Diamond DA40D Star,Private owner
4b2fea,hb-sdu,da40,Diamond DA40 Diamond Star,Private owner
4b2feb,hb-sdv,da40,Diamond DA-40,AvilÃ¹ SA
4b3026,hb-sgc,da40,Diamond DA-40D,Private owner
4b3031,hb-sgn,da40,Diamond DA-40 NG,Swiss Aviation Training Ltd
4b3032,hb-sgo,da40,Diamond DA-40 NG,Swiss Aviation Training Ltd
4b3033,hb-sgp,da40,Diamond DA-40 NG,Swiss Aviation Training Ltd
4b3035,hb-sgr,da40,Diamond DA 40 NG,Swiss Aviation Training Ltd.
4b3036,hb-sgs,da40,Diamond DA-40 NG,Swiss Aviation Training Ltd
4b3118,hb-spk,da40,Diamond DA40 Diamond Star,Private owner
4cc0a3,tf-kfd,da40,Diamond DA40 Diamond Star,Keilir Aviation Academy
4cc489,tf-kfc,da40,Diamond DA40 Diamond Star,Keilir Aviation Academy
4d0321,lx-avd,da40,Diamond DA-40,Aviasport II
4d2041,9h-aga,da40,Diamond Star DA-40D,Diamond Flight Training Malta
505d8f,om-klo,da40,DIAMOND DA40-180,SEAGLE AIR â FTO s.r.o. ZÃ¡h
4bd042,tc-tbb,da40,Diamond DA-40 Diamond Star,Private owner
4bd046,tc-tbf,da40,Diamond DA-40 Diamond Star,Private owner
4bd047,tc-tbg,da40,Diamond DA-40 Diamond Star,Private owner
49d171,ok-muf,da40,Diamond DA-40D Diamond Star TD,Private owner
510091,ew-414ll,da40,Diamond DA-40 Diamond Star,Private owner
7100f2,hz-sae,da40,Diamond DA-40NG Diamond Star,Private owner
7c0b0b,vh-cgt,da40,Diamond DA-40 Diamond Star,Private owner
7c1065,vh-div,da40,Diamond DA-40 Diamond Star,Private owner
7c1617,vh-end,da40,Diamond DA-40 Diamond Star,Private owner
7c1687,vh-eqh,da40,Diamond DA-40 Diamond Star,Private owner
7c1689,vh-eqj,da40,Diamond DA-40 Diamond Star,Private owner
7c168a,vh-eqk,da40,Diamond DA-40 Diamond Star,Flight Training Adelaide
7c168b,vh-eql,da40,Diamond DA-40 Diamond Star,Private owner
7c16a8,vh-ere,da40,Diamond DA-40 Diamond Star,Flight Training Adelaide
7c43f9,vh-npn,da40,Bell 212,Private owner
7c4e42,vh-pqs,da40,Diamond DA-40 Diamond Star,Private owner
7c4f2c,vh-pxa,da40,Diamond DA40 Diamond Star,Private owner
7c56d1,vh-rfn,da40,Diamond DA-40 Diamond Star,Private owner
7c6693,vh-ujp,da40,Diamond DA-40 Diamond Star,Private owner
7c6719,vh-unf,da40,Diamond DA-40 Diamond Star,Private owner
7c671b,vh-unh,da40,Diamond DA40,Private owner
7c671d,vh-unj,da40,Diamond DA-40 Diamond Star,Private owner
7c6725,vh-unr,da40,Diamond DA-40 Diamond Star,Private owner
7c6728,vh-unu,da40,Diamond DA-40 Diamond Star,Private owner
7c6729,vh-unv,da40,Diamond DA-40 Diamond Star,Private owner
7c7a87,vh-yhl,da40,Diamond DA-40 Diamond Star,Private owner
7c7a88,vh-yhm,da40,Diamond DA-40 Diamond Star,Private owner
7c7a8b,vh-yhp,da40,Diamond DA40D Star,Private owner
7c7ad3,vh-yjp,da40,Diamond DA-40 Diamond Star,Private owner
7c7b56,vh-ync,da40,Diamond DA-40 Diamond Star,Private owner
7c7b5a,vh-yng,da40,Diamond DA-40 Diamond Star,Private owner
7c7b5b,vh-ynh,da40,Diamond DA-40 Diamond Star,Private owner
7c7b5c,vh-yni,da40,Diamond DA-40 Diamond Star,Private owner
7c7b5d,vh-ynj,da40,Diamond DA-40 Diamond Star,Private owner
7c7b5e,vh-ynk,da40,Diamond DA-40 Diamond Star,Private owner
7c7b5f,vh-ynl,da40,Diamond DA-40 Diamond Star,Private owner
7c7b60,vh-ynm,da40,Diamond DA-40 Diamond Star,Private owner
7c7b61,vh-ynn,da40,Diamond DA-40 Diamond Star,Private owner
7c7b63,vh-ynp,da40,Diamond DA-40 Diamond Star,Private owner
7c7b64,vh-ynq,da40,Diamond DA-40 Diamond Star,Private owner
7c7b65,vh-ynr,da40,Diamond DA-40 Diamond Star,Private owner
7c7b69,vh-ynv,da40,Diamond DA-40 Diamond Star,Flight Training Adelaide
7c7ba1,vh-ypf,da40,Diamond DA-40NG Diamond Star,Private owner
7c7ba3,vh-yph,da40,Diamond DA-40NG Diamond Star,Private owner
7c7ba5,vh-ypj,da40,Diamond DA-40NG Diamond Star,Private owner
a0191d,n105uv,da40,Diamond DA-40 Diamond Star,Private owner
a01f99,n107kc,da40,Diamond DA40 Diamond Star,Private owner
a0208b,n107uv,da40,Diamond DA-40 Diamond Star,Private owner
a022a4,n108cf,da40,Diamond DA-40 Diamond Star,Private owner
8990fc,b-88003,da40,Diamond DA-40NG Diamond Star,APEX Flight Academy
a00941,n101jp,da40,Diamond DA-40 Diamond Star,Private owner
a011af,n103uv,da40,Diamond DA40 Diamond Star,Private owner
a01459,n104ja,da40,Diamond DA-40 Diamond Star,Private owner
a01566,n104uv,da40,Diamond DA-40 Diamond Star,Private owner
a04a8d,n118gm,da40,Diamond DA-40 Diamond Star,Private owner
a02c25,n11zm,da40,Diamond DA-40 Diamond Star,Private owner
a0b9d0,n146jp,da40,,
a0bab4,n146ts,da40,Diamond DA40 Diamond Star,Private owner
a0c04b,n1479g,da40,Diamond DA40 Diamond Star,Private owner
a0cb86,n150pt,da40,Diamond DA40 Diamond Star,Private owner
a07b8d,n130ds,da40,Diamond DA-40 Diamond Star,Private owner
a0d5b0,n153ds,da40,Diamond DA-40 Diamond Star,Private owner
a0d967,n154ds,da40,Diamond DA-40 Diamond Star,Private owner
a0e1cf,n156ps,da40,Diamond DA-40 Diamond Star,Private owner
a0ecf4,n159ps,da40,Diamond DA-40 Diamond Star,Private owner
a0f284,n160jp,da40,Diamond DA-40 Diamond Star,Private owner
a0f9bd,n162gl,da40,Diamond DA40 Diamond Star,Private owner
a043b0,n116ng,da40,Diamond DA-40 Diamond Star,Private owner
a08b63,n134ps,da40,Diamond DA-40 Diamond Star,Private owner
a092a7,n136n,da40,Diamond DA-40 Diamond Star,Private owner
a09616,n137kc,da40,Diamond DA-40 Diamond Star,Private owner
a09df6,n139ps,da40,Diamond DA-40 Diamond Star,Private owner
a0a1ad,n14ps,da40,Diamond DA-40 Diamond Star,Private owner
a0a721,n141hl,da40,Diamond DA-40 Diamond Star,Private owner
a06002,n123mz,da40,Diamond DA-40 Diamond Star,Private owner
a06004,n123na,da40,Diamond DA-40 Diamond Star,Private owner
a066f5,n125ha,da40,Diamond DA-40 Diamond Star,Private owner
a066ff,n125hl,da40,Diamond DA-40 Diamond Star,Private owner
a06e97,n127kc,da40,Diamond DA-40 Diamond Star,Private owner
a14c22,n183df,da40,Diamond DA-40 Diamond Star,Private owner
a15b09,n187ds,da40,Diamond DA-40 Diamond Star,Private owner
a10452,n165as,da40,Diamond DA-40 Diamond Star,Private owner
a10597,n165ps,da40,Diamond DA-40 Diamond Star,Private owner
a0af50,n143rd,da40,Diamond DA-40 Diamond Star,Private owner
a0b262,n144jp,da40,Diamond DA-40 Diamond Star,Private owner
a1088e,n166g,da40,Diamond DA-40 Diamond Star,Private owner
a11a41,n170ma,da40,,
a11d18,n171cb,da40,Diamond DA-40 Diamond Star,Private owner
a11e3a,n171ps,da40,Diamond DA-40 Diamond Star,Private owner
a11e7a,n171sf,da40,Diamond DA40 Diamond Star,Private owner
a06fc0,n127x,da40,Diamond DA-40 Diamond Star,Private owner
a0733d,n128us,da40,Diamond DA-40 Diamond Star,Private owner
a07576,n129dk,da40,Diamond DA-40 Diamond Star,Private owner
a16ff5,n192ds,da40,Diamond DA-40 Diamond Star,Private owner
a17383,n193ca,da40,Diamond DA40 Diamond Star,Private owner
a1739e,n193dc,da40,Diamond DA-40 Diamond Star,Private owner
a19062,n20hj,da40,Diamond DA-40 Diamond Star,Private owner
a19a7c,n202ls,da40,Diamond DA-40 Diamond Star,Private owner
a12528,n173jp,da40,Diamond DA-40 Diamond Star,Private owner
a12566,n173ma,da40,Diamond DA-40 Diamond Star,Private owner
a125da,n173rs,da40,Diamond DA-40 Diamond Star,Private owner
a12c0c,n175da,da40,Diamond DA-40 Diamond Star,Private owner
a12fd3,n176ds,da40,Diamond DA-40 Diamond Star,Private owner
a13af8,n179ds,da40,Diamond DA-40 Diamond Star,Private owner
a144b4,n181df,da40,Diamond DA-40 Diamond Star,Private owner
a144bf,n181ds,da40,Diamond DA-40 Diamond Star,Private owner
a1bf3b,n211wp,da40,Diamond DA40 Diamond Star,Private owner
a1c122,n212c,da40,Diamond DA-40 Diamond Star,Private owner
a1c503,n213ds,da40,Diamond DA-40 Diamond Star,Private owner
a1827a,n197dc,da40,Diamond DA-40 Diamond Star,Private owner
a19ee2,n203ts,da40,Diamond DA40 Diamond Star,Private owner
a19efb,n203us,da40,Diamond DA-40 Diamond Star,Private owner
a1a276,n204sg,da40,Diamond DA-40 Diamond Star,Private owner
a1c9a7,n214pd,da40,Diamond DA-40 Diamond Star,Private owner
a1cc71,n215ds,da40,Diamond DA-40 Diamond Star,Private owner
a1d01e,n216dg,da40,Diamond DA-40 Diamond Star,Private owner
a1d074,n216gt,da40,Diamond DA-40 Diamond Star,Private owner
a1d3df,n217ds,da40,Diamond DA-40 Diamond Star,Private owner
a1d777,n218cl,da40,Diamond DA-40 Diamond Star,Private owner
a1d788,n218dc,da40,Diamond DA-40 Diamond Star,Private owner
a1d796,n218ds,da40,Diamond DA40 Diamond Star,Private owner
a1d939,n218wl,da40,Diamond DA-40 Diamond Star,Private owner
a1e015,n22qq,da40,Diamond DA40 Diamond Star,Private owner
a1b017,n208ds,da40,Diamond DA-40 Diamond Star,Private owner
a1b383,n209as,da40,Diamond DA-40 Diamond Star,Private owner
a1b3ce,n209ds,da40,Diamond DA-40 Diamond Star,Private owner
a2380e,n242gl,da40,,
a23993,n242y,da40,Diamond DA-40 Diamond Star,Private owner
a23b80,n243ds,da40,Diamond DA-40 Diamond Star,Private owner
a242ee,n245ds,da40,Diamond DA-40 Diamond Star,Private owner
a1e873,n222ad,da40,Diamond DA-40 Diamond Star,Private owner
a1e90b,n222gf,da40,Diamond DA40 Diamond Star,Private owner
a1ec82,n223ds,da40,Diamond DA-40 Diamond Star,Private owner
a1f007,n224bs,da40,Diamond DA-40 Diamond Star,Private owner
a1f891,n226pa,da40,Diamond DA-40 Diamond Star,Private owner
a200be,n228ws,da40,Diamond DA-40 Diamond Star,Private owner
a208ce,n230dc,da40,Diamond DA-40 Diamond Star,Private owner
a208dc,n230ds,da40,Diamond DA-40 Diamond Star,Private owner
a21009,n232bb,da40,Diamond DA-40 Diamond Star,Private owner
a210c4,n232jp,da40,Diamond DA-40 Diamond Star,Private owner
a213b1,n233am,da40,Diamond DA-40 Diamond Star,Private owner
a24a5c,n247ds,da40,Diamond DA-40 Diamond Star,Private owner
a24e13,n248ds,da40,Diamond DA-40 Diamond Star,Private owner
a257b2,n250cb,da40,Diamond DA-40 Diamond Star,Private owner
a25f02,n252ax,da40,Diamond DA-40 Diamond Star,Private owner
a271db,n257ds,da40,Diamond DA-40 Diamond Star,Private owner
a27e81,n26vb,da40,Diamond DA-40 Diamond Star,Private owner
a28310,n261ds,da40,Diamond DA-40 Diamond Star,Private owner
a292e6,n265ps,da40,,
a295a3,n266ds,da40,Diamond DA-40 Diamond Star,Private owner
a21fde,n236ma,da40,Diamond DA40,Private owner
a2205e,n236sd,da40,Diamond DA-40 Diamond Star,Private owner
a222dd,n237ds,da40,Diamond DA-40 Diamond Star,Private owner
a22686,n238dc,da40,Diamond DA-40 Diamond Star,Private owner
a22a3d,n239dc,da40,Diamond DA-40 Diamond Star,Private owner
a22a4b,n239ds,da40,Diamond DA-40 Diamond Star,Private owner
a22b03,n239ma,da40,Diamond DA-40 Diamond Star,Private owner
a29d11,n268ds,da40,Diamond DA-40 Diamond Star,Private owner
a2a0c8,n269ds,da40,Diamond DA-40 Diamond Star,Private owner
a2a1e5,n269rb,da40,Diamond DA-40 Diamond Star,Private owner
a2a6d8,n270ds,da40,Diamond DA-40 Diamond Star,Private owner
a2ae46,n272ds,da40,Diamond DA-40 Diamond Star,Private owner
a2b5b4,n274ds,da40,Diamond DA-40 Diamond Star,Private owner
a2c1d3,n277ps,da40,Diamond DA-40 Diamond Star,Private owner
a2c472,n278cm,da40,Diamond DA-40 Diamond Star,Private owner
a2c490,n278ds,da40,Diamond DA-40 Diamond Star,Private owner
a2c81e,n279ca,da40,,
a2ce57,n280ds,da40,Diamond DA-40 Diamond Star,Private owner
a2d5c5,n282ds,da40,Diamond DA-40 Diamond Star,Private owner
a2e4a1,n286ds,da40,Diamond DA-40 Diamond Star,Private owner
a2efc6,n289ds,da40,Diamond DA-40 Diamond Star,Private owner
a2f46d,n29pg,da40,Diamond DA-40 Diamond Star,Private owner
a304b2,n294ds,da40,Diamond DA-40 Diamond Star,Private owner
a308e3,n295jp,da40,Diamond DA-40 Diamond Star,Private owner
a335a2,n306af,da40,Diamond DA-40 Diamond Star,Private owner
a33959,n307af,da40,Diamond DA-40 Diamond Star,Private owner
a33d16,n308am,da40,Diamond DA-40 Diamond Star,Private owner
a3411d,n309ds,da40,Diamond DA40 Diamond Star,Private owner
a379ae,n323cg,da40,Diamond DA-40 Diamond Star,Private owner
a37a4f,n323jt,da40,Diamond DA-40 Diamond Star,Private owner
a3138e,n298ds,da40,Diamond DA-40 Diamond Star,Private owner
a317bf,n299jp,da40,Diamond DA-40 Diamond Star,Private owner
a2d97c,n283ds,da40,Diamond DA-40 Diamond Star,Private owner
a3271c,n302ds,da40,Diamond DA-40 Diamond Star,Private owner
a32a7d,n303af,da40,Diamond DA-40 Diamond Star,Private owner
a32ad3,n303ds,da40,Diamond DA-40 Diamond Star,Private owner
a32e34,n304af,da40,Diamond DA-40 Diamond Star,Private owner
a384a0,n326af,da40,Diamond DA-40 Diamond Star,Private owner
a384f6,n326ds,da40,Diamond DA-40 Diamond Star,Private owner
a3901b,n329ds,da40,Diamond DA-40 Diamond Star,Private owner
a355b3,n314af,da40,Diamond DA40 Diamond Star,Private owner
a360d8,n317af,da40,,
a37243,n321ck,da40,Diamond DA40 Diamond Star,Private owner
a37295,n321fs,da40,Diamond DA-40 Diamond Star,Private owner
a3a2ee,n333wf,da40,Diamond DA-40 Diamond Star,Private owner
a3b3e3,n338ds,da40,Diamond DA-40 Diamond Star,Private owner
a3b49b,n338ma,da40,Diamond DA-40 Diamond Star,Private owner
a3bcb3,n34tw,da40,Diamond DA-40 Diamond Star,Private owner
a37352,n321pf,da40,Diamond DA-40 Diamond Star,Private owner
a2e0ea,n285ds,da40,Diamond DA-40 Diamond Star,Private owner
a3c8cf,n343ds,da40,Diamond DA-40 Diamond Star,Private owner
a3cc86,n344ds,da40,Diamond DA-40 Diamond Star,Private owner
a3d3f4,n346ds,da40,Diamond DA-40 Diamond Star,Private owner
a3dec3,n349af,da40,Diamond DA40 Diamond Star,Private owner
a3e4de,n350as,da40,Diamond DA40 Diamond Star,Private owner
a3e64d,n350rj,da40,Diamond DA-40 Diamond Star,Private owner
a43cce,n372se,da40,Diamond DA-40 Diamond Star,Private owner
a4639d,n382kd,da40,Diamond DA-40 Diamond Star,Private owner
a467c5,n383ps,da40,Diamond DA-40 Diamond Star,Private owner
a46a82,n384ds,da40,Diamond DA-40 Diamond Star,Private owner
a46e39,n385ds,da40,Diamond DA-40 Diamond Star,Private owner
a471f0,n386ds,da40,Diamond DA-40 Diamond Star,Private owner
a4726a,n386jp,da40,Diamond DA-40 Diamond Star,Private owner
a472a8,n386ma,da40,Diamond DA-40 Diamond Star,Private owner
a475a7,n387ds,da40,Diamond DA-40 Diamond Star,Private owner
a479d8,n388jp,da40,Diamond DA-40 Diamond Star,Private owner
a49632,n395jp,da40,Diamond DA-40 Diamond Star,Private owner
a4a494,n399ds,da40,Diamond DA-40 Diamond Star,Private owner
a3e8e0,n351ds,da40,Diamond DA-40 Diamond Star,Private owner
a3ec97,n352ds,da40,Diamond DA-40 Diamond Star,Private owner
a3f7bc,n355ds,da40,Diamond DA-40 Diamond Star,Private owner
a3fc2b,n356ma,da40,Diamond DA-40 Diamond Star,Private owner
a41416,n362ds,da40,Diamond DA-40 Diamond Star,Private owner
a4c048,n405ma,da40,Diamond DA-40 Diamond Star,Private owner
a4c6fe,n407ds,da40,Diamond DA-40 Diamond Star,Private owner
a4ce9b,n409fp,da40,,
a4d22d,n41eb,da40,Diamond DA-40 Diamond Star,Private owner
a4d30d,n41pa,da40,Diamond DA-40 Diamond Star,Private owner
a4d4ab,n410fp,da40,Diamond DA-40F Diamond Star,Private owner
a4d751,n4106g,da40,Diamond DA40 Diamond Star,Private owner
a4db2c,n4117h,da40,Diamond DA-40 Diamond Star,Private owner
a4db7b,n4119s,da40,Diamond DA-40 Diamond Star,Private owner
a4db9a,n412am,da40,Diamond DA40 Diamond Star,Private owner
a4dcdc,n412pj,da40,Diamond DA-40 Diamond Star,Private owner
a4e2da,n4139b,da40,Diamond DA-40 Diamond Star,Private owner
a4e6bf,n415am,da40,Diamond DA-40 Diamond Star,Private owner
a4e70f,n415ds,da40,Diamond DA-40 Diamond Star,Private owner
a4e79b,n415kg,da40,Diamond DA-40 Diamond Star,Private owner
a4ea76,n416am,da40,Diamond DA-40 Diamond Star,Private owner
a4f107,n4174b,da40,Diamond DA-40 Diamond Star,Private owner
a4f1e4,n418am,da40,Diamond DA-40 Diamond Star,Private owner
a4f57e,n4189u,da40,,
a4f59b,n419am,da40,Diamond DA-40 Diamond Star,Private owner
a4f668,n419js,da40,Diamond DA-40 Diamond Star,Private owner
a4f816,n4191m,da40,Diamond DA40 Diamond Star,Private owner
a44e28,n377ds,da40,Diamond DA-40 Diamond Star,Private owner
a458fd,n38am,da40,Diamond DA-40 Diamond Star,Private owner
a45929,n38cf,da40,Diamond DA-40 Diamond Star,Private owner
a45ba6,n380ds,da40,Diamond DA-40 Diamond Star,Private owner
a4ac5a,n40xe,da40,Diamond DA-40 Diamond Star,Private owner
a4acd6,n400cc,da40,Diamond DA-40 Diamond Star,Private owner
a4b30c,n4012x,da40,Diamond DA-40 Diamond Star,Private owner
a4b7d8,n403at,da40,Diamond DA-40 Diamond Star,Private owner
a42820,n367us,da40,Diamond DA-40 Diamond Star,Private owner
a42e9e,n369kb,da40,Diamond DA40 Diamond Star,Private owner
a43427,n370ds,da40,Diamond DA-40 Diamond Star,Private owner
a4fbab,n420am,da40,Diamond DA-40 Diamond Star,Private owner
a4fbfb,n420ds,da40,Diamond DA-40 Diamond Star,Private owner
a53e33,n437ma,da40,Diamond DA-40 Diamond Star,Private owner
a544c0,n439ca,da40,Diamond DA-40 Diamond Star,Private owner
a54b73,n440jp,da40,Diamond DA-40 Diamond Star,Private owner
a5561e,n443ds,da40,Diamond DA-40 Diamond Star,Private owner
a56134,n446db,da40,Diamond DA-40 Diamond Star,Private owner
a56135,n446dc,da40,Diamond DA-40,Private owner
a56143,n446ds,da40,Diamond DA-40 Diamond Star,Private owner
a564fa,n447ds,da40,Diamond DA-40 Diamond Star,Private owner
a568b1,n448ds,da40,Diamond DA-40 Diamond Star,Private owner
a56cdf,n449jl,da40,Diamond DA-40 Diamond Star,Private owner
a5762f,n451ds,da40,Diamond DA-40 Diamond Star,Private owner
a57674,n451gl,da40,Diamond DA-40 Diamond Star,Private owner
a57d9d,n453ds,da40,Diamond DA-40 Diamond Star,Private owner
a5850b,n455ds,da40,Diamond DA-40 Diamond Star,Private owner
a58877,n456as,da40,Diamond DA-40 Diamond Star,Private owner
a58dd1,n457tl,da40,Diamond DA-40 Diamond Star,Private owner
a59030,n458ds,da40,Diamond DA-40 Diamond Star,Private owner
a59dae,n461ds,da40,Diamond DA-40 Diamond Star,Private owner
a5a2ba,n462th,da40,Diamond DA-40 Diamond Star,Private owner
a5a671,n463th,da40,Diamond DA-40 Diamond Star,Private owner
a5a8d3,n464ds,da40,Diamond DA-40 Diamond Star,Private owner
a5aa28,n464th,da40,,
a5ac8a,n465ds,da40,Diamond DA40 Diamond Star,Private owner
a5b01f,n466ch,da40,Diamond DA-40 Diamond Star,Private owner
a5b867,n468ma,da40,Diamond DA-40 Diamond Star,Private owner
a5bbe0,n469jp,da40,Diamond DA40 Diamond Star,Private owner
a5c176,n470ds,da40,Diamond DA-40 Diamond Star,Private owner
a5c1f0,n470jp,da40,Diamond DA-40 Diamond Star,Private owner
a5d7c0,n476ds,da40,Diamond DA40 Diamond Star,Private owner
a5d8ba,n476ps,da40,Diamond DA40 Diamond Star,Private owner
a5db77,n477ds,da40,Diamond DA-40 Diamond Star,Private owner
a5df2e,n478ds,da40,Diamond DA-40 Diamond Star,Private owner
a5e2e5,n479ds,da40,Diamond DA-40 Diamond Star,Private owner
a506c6,n423ab,da40,Diamond DA-40 Diamond Star,Private owner
a5074f,n423fp,da40,Diamond DA40 Diamond Star,Private owner
a5ed96,n481pa,da40,Diamond DA-40 Diamond Star,Private owner
a5f11b,n482ma,da40,Diamond DA-40 Diamond Star,Private owner
a60b90,n489rs,da40,Diamond DA40 Diamond Star,Private owner
a60c2e,n489y,da40,Diamond DA-40 Diamond Star,Private owner
a617e2,n492ds,da40,Diamond DA40 Diamond Star,Private owner
a61f50,n494ds,da40,Diamond DA-40 Diamond Star,Private owner
a5c8e4,n472ds,da40,,
a5cc9b,n473ds,da40,Diamond DA-40 Diamond Star,Private owner
a5d503,n475ps,da40,Diamond DA-40 Diamond Star,Private owner
a51af5,n428sp,da40,Diamond DA-40 Diamond Star,Private owner
a51d6a,n429ds,da40,Diamond DA-40 Diamond Star,Private owner
a521cb,n43lm,da40,Diamond DA-40 Diamond Star,Private owner
a5225a,n43se,da40,Diamond DA-40 Diamond Star,Private owner
a523f4,n430jp,da40,Diamond DA-40 Diamond Star,Private owner
a52731,n431ds,da40,Diamond DA-40 Diamond Star,Private owner
a527ab,n431jp,da40,Diamond DA-40 Diamond Star,Private owner
a62776,n496ma,da40,Diamond DA-40 Diamond Star,Private owner
a62f67,n498sg,da40,Diamond DA-40 Diamond Star,Private owner
a63745,n5wu,da40,Diamond DA-40 Diamond Star,Private owner
a63b1d,n500na,da40,Diamond DA40 Diamond Star,Private owner
a64d51,n505jf,da40,Diamond DA40 Diamond Star,Private owner
a64d59,n505jp,da40,Diamond DA-40 Diamond Star,Private owner
a65096,n506ds,da40,Diamond DA-40 Diamond Star,Private owner
a6514e,n506ma,da40,Diamond DA-40 Diamond Star,Private owner
a661cb,n510ds,da40,Diamond DA-40 Diamond Star,Private owner
a6ab60,n529lj,da40,,
a6803b,n518ma,da40,Diamond DA-40 Diamond Star,Private owner
a68493,n519tm,da40,Diamond DA40 Diamond Star,Private owner
a688e0,n52zm,da40,Diamond DA-40 Diamond Star,Private owner
a6894a,n520ds,da40,Diamond DA40,Private owner
a6951f,n523lt,da40,Diamond DA-40 Diamond Star,Private owner
a69826,n524ds,da40,Diamond DA-40 Diamond Star,Private owner
a69920,n524ps,da40,,
a69bdd,n525ds,da40,Diamond DA-40 Diamond Star,Private owner
a69d23,n525st,da40,Diamond DA-40 Diamond Star,Private owner
a70aec,n553ds,da40,Diamond DA-40 Diamond Star,Private owner
a71689,n556jm,da40,Diamond DA-40 Diamond Star,Private owner
a716c2,n556lu,da40,Diamond DA-40 Diamond Star,Private owner
a71972,n557af,da40,,
a719c8,n557ds,da40,Diamond DA-40 Diamond Star,Private owner
a71a42,n557jp,da40,Diamond DA-40 Diamond Star,Private owner
a6afaf,n53sl,da40,Diamond DA-40 Diamond Star,Private owner
a6cb82,n537ma,da40,Diamond DA-40 Diamond Star,Private owner
a6ce81,n538ds,da40,Diamond DA-40 Diamond Star,Private owner
a6d2c0,n539kc,da40,,
a66c94,n513a,da40,Diamond DA-40 Diamond Star,Private owner
a66cf0,n513ds,da40,Diamond DA-40 Diamond Star,Private owner
a71ac2,n557ps,da40,Diamond DA-40 Diamond Star,Private owner
a72746,n560ds,da40,Diamond DA40 Diamond Star,Private owner
a7326b,n563ds,da40,Diamond DA-40 Diamond Star,Private owner
a739d9,n565ds,da40,Diamond DA-40 Diamond Star,Private owner
a73aa2,n565mt,da40,Diamond DA-40 Diamond Star,Private owner
a73d90,n566ds,da40,Diamond DA-40 Diamond Star,Private owner
a74d68,n57pu,da40,Diamond DA-40 Diamond Star,Private owner
a7527c,n571ds,da40,Diamond DA-40 Diamond Star,Private owner
a75345,n571mt,da40,Diamond DA-40 Diamond Star,Private owner
a75633,n572ds,da40,Diamond DA-40 Diamond Star,Private owner
a69faa,n526ep,da40,Diamond DA-40 Diamond Star,Private owner
a73e59,n566mt,da40,Diamond DA-40 Diamond Star,Private owner
a74210,n567mt,da40,Diamond DA-40 Diamond Star,Private owner
a744d5,n568ca,da40,Diamond DA-40 Diamond Star,Private owner
a745c7,n568mt,da40,Diamond DA-40 Diamond Star,Private owner
a748b5,n569ds,da40,Diamond DA40,Private owner
a7497e,n569mt,da40,Diamond DA-40 Diamond Star,Private owner
a6dbff,n541ds,da40,,
a6dffb,n542gl,da40,Diamond DA-40 Diamond Star,Private owner
a6e3ee,n543jw,da40,Diamond DA40 Diamond Star,Private owner
a6eab7,n545cf,da40,Diamond DA-40 Diamond Star,Private owner
a77e7b,n582mt,da40,Diamond DA-40 Diamond Star,Private owner
a78169,n583ds,da40,Diamond DA-40 Diamond Star,Private owner
a78232,n583mt,da40,Diamond DA-40 Diamond Star,Private owner
a785e9,n584mt,da40,Diamond DA-40 Diamond Star,Private owner
a788a9,n585bw,da40,Diamond DA-40 Diamond Star,Private owner
a789a0,n585mt,da40,Diamond DA40 Diamond Star,Private owner
a78d57,n586mt,da40,Diamond DA40 Diamond Star,Private owner
a7910e,n587mt,da40,Diamond DA-40 Diamond Star,Private owner
a794c5,n588mt,da40,Diamond DA-40 Diamond Star,Private owner
a7987c,n589mt,da40,Diamond DA-40 Diamond Star,Private owner
a7b8e0,n597ra,da40,Diamond DA40 Diamond Star,Private owner
a79e8c,n590mt,da40,Diamond DA-40 Diamond Star,Private owner
a7a151,n591ca,da40,Diamond DA-40 Diamond Star,Private owner
a7a508,n592ca,da40,Diamond DA-40 Diamond Star,Private owner
a7a515,n592cp,da40,Diamond DA-40 Diamond Star,Private owner
a7a5fa,n592mt,da40,Diamond DA40 Diamond Star,Private owner
a7a8bf,n593ca,da40,Diamond DA-40 Diamond Star,Private owner
a7d9f2,n605bg,da40,Diamond DA-40 Diamond Star,Private owner
a7da05,n605ca,da40,,
a7e19c,n607ds,da40,Diamond DA-40 Diamond Star,Private owner
a7e553,n608ds,da40,Diamond DA-40 Diamond Star,Private owner
a7e8e1,n609ca,da40,Diamond DA-40 Diamond Star,Private owner
a7ed67,n61lh,da40,Diamond DA-40 Diamond Star,Private owner
a7f390,n611mh,da40,,
a7fdf6,n614ds,da40,Diamond DA-40 Diamond Star,Private owner
a83808,n629ds,da40,Diamond DA-40 Diamond Star,Private owner
a8492f,n633dc,da40,Diamond DA-40 Diamond Star,Private owner
a8493d,n633ds,da40,Diamond DA-40 Diamond Star,Private owner
a80626,n616ml,da40,Diamond DA-40 Diamond Star,Private owner
a8091b,n617ds,da40,,
a81e07,n622ds,da40,,
a821be,n623ds,da40,Diamond DA-40 Diamond Star,Private owner
a82575,n624ds,da40,Diamond DA-40 Diamond Star,Private owner
a8983b,n653ds,da40,Diamond DA-40 Diamond Star,Private owner
a898b8,n653js,da40,Diamond DA-40 Diamond Star,Private owner
a89cba,n654ms,da40,Diamond DA-40 Diamond Star,Private owner
a85bd0,n638ds,da40,Diamond DA-40 Diamond Star,Private owner
a86485,n64su,da40,,
a86597,n640ds,da40,Diamond DA-40 Diamond Star,Private owner
a8a07a,n655na,da40,Diamond DA-40 Diamond Star,Private owner
a8a320,n656bc,da40,Diamond DA40 Diamond Star,Private owner
a8a324,n656bg,da40,Diamond DA-40 Diamond Star,Private owner
a8a717,n657ds,da40,Diamond DA-40 Diamond Star,Private owner
a8ab0e,n658gf,da40,Diamond DA-40 Diamond Star,Private owner
a8b58f,n660ps,da40,,
a8b84c,n661ds,da40,Diamond DA40 Diamond Star,Private owner
a8bc03,n662ds,da40,Diamond DA-40 Diamond Star,Private owner
a8d24d,n668ds,da40,Diamond DA-40 Diamond Star,Private owner
a8d6fe,n669ps,da40,,
a8e382,n672ds,da40,Diamond DA40 Diamond Star,Private owner
a8e6e9,n673am,da40,Diamond DA-40 Diamond Star,Private owner
a8f3d5,n676us,da40,Diamond DA-40 Diamond Star,Private owner
a8f5c5,n677am,da40,Diamond DA-40 Diamond Star,Private owner
a8fd83,n679ds,da40,,
a90110,n68c,da40,Diamond DA-40 Diamond Star,Private owner
a90393,n680ds,da40,Diamond DA40 Diamond Star,Private owner
a90708,n681ba,da40,Diamond DA-40,Private owner
a9074a,n681ds,da40,,
a91b54,n686us,da40,Diamond DA-40 Diamond Star,Private owner
a92fc3,n691ps,da40,Diamond DA-40 Diamond Star,Private owner
a930a8,n691yw,da40,Diamond DA-40 Diamond Star,Private owner
a870bc,n643ds,da40,Diamond DA-40 Diamond Star,Private owner
a87473,n644ds,da40,,
a879d4,n645wt,da40,Diamond DA-40 Diamond Star,Private owner
a87f98,n647ds,da40,Diamond DA-40 Diamond Star,Private owner
a8834f,n648ds,da40,Diamond DA-40 Diamond Star,Private owner
a964b0,n704pa,da40,Diamond DA40 Diamond Star,Private owner
a96b34,n706ds,da40,,
a96fe5,n707ps,da40,Diamond DA-40 Diamond Star,Private owner
a981ee,n711yd,da40,Diamond DA-40 Diamond Star,Private owner
a984c1,n712pa,da40,Diamond DA-40 Diamond Star,Private owner
a98bd3,n714kj,da40,Diamond DA-40 Diamond Star,Private owner
a99a1b,n718dl,da40,Diamond DA-40 Diamond Star,Private owner
a99ec2,n719pa,da40,Diamond DA40 Diamond Star,Private owner
a9a25e,n72mz,da40,Diamond DA-40 Diamond Star,Private owner
a9ecd6,n739ds,da40,Diamond DA-40 Diamond Star,Private owner
a9325f,n692cj,da40,Diamond DA-40 Diamond Star,Private owner
a93280,n692ds,da40,Diamond DA-40 Diamond Star,Private owner
a93637,n693ds,da40,Diamond DA40 Diamond Star,Private owner
a93da5,n695ds,da40,Diamond DA-40 Diamond Star,Private owner
a9a492,n720lm,da40,Diamond DA40 Diamond Star,Private owner
a9ac40,n722pa,da40,Diamond DA40 Diamond Star,Private owner
a9aeb8,n723ag,da40,Diamond DA-40 Diamond Star,Private owner
a9beb8,n727mz,da40,Diamond DA-40 Diamond Star,Private owner
a9f1d6,n74sw,da40,Diamond DA-40 Diamond Star,Private owner
a9f69d,n741ds,da40,Diamond DA-40 Diamond Star,Private owner
a9fa2d,n742cc,da40,Diamond DA-40NG Diamond Star,Private owner
a9fa54,n742ds,da40,Diamond DA-40 Diamond Star,Private owner
aa0339,n744us,da40,Diamond DA40 Diamond Star,Private owner
aa0930,n746ds,da40,Diamond DA-40 Diamond Star,Private owner
aa1556,n749pz,da40,Diamond DA40 Diamond Star,Private owner
a9c194,n728de,da40,Diamond DA-40 Diamond Star,Private owner
a9cb67,n730ds,da40,Diamond DA-40 Diamond Star,Private owner
a9d008,n731pa,da40,Diamond DA-40 Diamond Star,Private owner
a9dafa,n734m,da40,Diamond DA-40 Diamond Star,Private owner
aa3cbe,n759pa,da40,,
aa41e4,n760ds,da40,Diamond DA-40 Diamond Star,Private owner
aa50c0,n764ds,da40,Diamond DA-40 Diamond Star,Private owner
aabd12,n791ps,da40,Diamond DA-40 Diamond Star,Private owner
aa6a8f,n770rs,da40,Diamond DA-40 Diamond Star,Private owner
aa855b,n777zv,da40,Diamond DA40 Diamond Star,Private owner
aa855c,n777zw,da40,Diamond DA-40 Diamond Star,Private owner
aa871b,n778ds,da40,Diamond DA-40 Diamond Star,Private owner
aa8c49,n779us,da40,Diamond DA40 Diamond Star,Private owner
aa9259,n780us,da40,Diamond DA-40 Diamond Star,Private owner
aaa6dc,n786am,da40,Diamond DA40 Diamond Star,Private owner
aaaade,n787dm,da40,Diamond DA40 Diamond Star,Private owner
aaaaee,n787ec,da40,Diamond DA-40 Diamond Star,Private owner
aac4fd,n793us,da40,Diamond DA-40 Diamond Star,Private owner
ab075f,n81ds,da40,Diamond DA40 Diamond Star,Private owner
ab09d0,n810er,da40,,
ab0d89,n811et,da40,Diamond DA40 Diamond Star,Private owner
aad212,n797am,da40,Diamond DA-40 Diamond Star,Private owner
aad38e,n797rs,da40,Diamond DA-40 Diamond Star,Private owner
aad41e,n797xl,da40,Diamond DA-40 Diamond Star,Private owner
aade98,n8qq,da40,Diamond DA-40 Diamond Star,Private owner
ab1c4b,n815ds,da40,Diamond DA-40 Diamond Star,Private owner
ab30e7,n820am,da40,Diamond DA-40 Diamond Star,Private owner
ab3137,n820ds,da40,Diamond DA-40 Diamond Star,Private owner
ab3e38,n823yt,da40,Diamond DA-40 Diamond Star,Private owner
ab4541,n825us,da40,Diamond DA40,Private owner
ab5027,n828sd,da40,Diamond DA40 Diamond Star,Private owner
ab52a6,n829ds,da40,Diamond DA-40 Diamond Star,Private owner
ab5ce4,n831jl,da40,Diamond DA-40 Diamond Star,Private owner
ab681a,n834kc,da40,Diamond DA40 Diamond Star,Private owner
ab72b7,n837ds,da40,Diamond DA-40 Diamond Star,Private owner
aae5a0,n801am,da40,Diamond DA-40 Diamond Star,Private owner
aaed13,n803as,da40,Diamond DA-40 Diamond Star,Private owner
aaed76,n803er,da40,Diamond DA-40 Diamond Star,Private owner
aaf12d,n804er,da40,Diamond DA40 Diamond Star,Private owner
aaf89b,n806er,da40,Diamond DA-40 Diamond Star,Private owner
aafc3a,n807ds,da40,Diamond DA-40 Diamond Star,Private owner
aafc52,n807er,da40,Diamond DA-40 Diamond Star,Private owner
aaabe0,n787pv,da40,Diamond DA-40 Diamond Star,Private owner
aab40d,n789xl,da40,Diamond DA-40 Diamond Star,Private owner
ab418a,n824us,da40,Diamond DA40 Diamond Star,Private owner
aba7b4,n850ds,da40,Diamond DA-40 Diamond Star,Private owner
abb299,n853bc,da40,Diamond DA-40 Diamond Star,Private owner
abb63e,n854ak,da40,Diamond DA40,Private owner
abbdfe,n856ds,da40,Diamond DA-40 Diamond Star,Private owner
ab83ec,n841ds,da40,Diamond DA-40 Diamond Star,Private owner
ab9380,n845ma,da40,Diamond DA-40 Diamond Star,Private owner
ac0cc9,n876br,da40,Diamond DA-40 Diamond Star,Private owner
ac1080,n877br,da40,Diamond DA-40 Diamond Star,Private owner
ac122a,n877us,da40,Diamond DA40,Private owner
ac1dfa,n880bm,da40,Diamond DA-40 Diamond Star,Private owner
ac1e31,n880ds,da40,Diamond DA40 Diamond Star,Private owner
ac259f,n882ds,da40,,
ac2e84,n884us,da40,Diamond DA40 Diamond Star,Private owner
ac3503,n886kc,da40,Diamond DA40 Diamond Star,Private owner
ac3823,n887db,da40,Diamond DA-40 Diamond Star,Private owner
abc56d,n858dt,da40,Diamond DA-40 Diamond Star,Private owner
abe57d,n866ds,da40,,
abe934,n867ds,da40,Diamond DA-40 Diamond Star,Private owner
abee62,n868us,da40,Diamond DA-40 Diamond Star,Private owner
abf67f,n870br,da40,Diamond DA-40 Diamond Star,Private owner
abfa36,n871br,da40,Diamond DA-40 Diamond Star,Eva Flight Training Academy
abfa69,n871ds,da40,Diamond DA-40 Diamond Star,Private owner
abfded,n872br,da40,Diamond DA-40 Diamond Star,Private owner
ac028f,n873ma,da40,Diamond DA-40 Diamond Star,Private owner
ac76f6,n902ds,da40,Diamond DA40 Diamond Star,Private owner
ac77bd,n902mr,da40,Diamond DA40 Diamond Star,Private owner
ac81cb,n905am,da40,Diamond DA-40 Diamond Star,Private owner
ac81f2,n905ca,da40,,
ac86bc,n906pa,da40,Diamond DA-40 Diamond Star,Private owner
ac8989,n907ds,da40,Diamond DA-40 Diamond Star,Private owner
ac96c6,n910bb,da40,Diamond DA40 Diamond Star,Private owner
acbf70,n920pa,da40,Diamond DA-40 Diamond Star,Private owner
acc9ab,n923ds,da40,Diamond DA40 Diamond Star,Private owner
ac3dc8,n888yw,da40,,
ac3fa0,n889ds,da40,Diamond DA40 Diamond Star,Private owner
ac4727,n890us,da40,Diamond DA-40 Diamond Star,Private owner
ac4ade,n891us,da40,Diamond DA-40 Diamond Star,Private owner
ac50d5,n893ds,da40,Diamond DA-40 Diamond Star,Private owner
ac543c,n894am,da40,Diamond DA40 Diamond Star,Private owner
ac548c,n894ds,da40,,
ac55c1,n894sa,da40,,
ac57f3,n895am,da40,Diamond DA-40 Diamond Star,Private owner
accd62,n924ds,da40,,
acd119,n925ds,da40,Diamond DA40 Diamond Star,Private owner
acd23c,n925rh,da40,Diamond DA-40 Diamond Star,Private owner
acd2eb,n925yh,da40,Diamond DA-40 Diamond Star,Private owner
ac5cd4,n896nk,da40,Diamond DA-40 Diamond Star,Private owner
ac6039,n897kc,da40,Diamond DA-40 Diamond Star,Private owner
ac6f78,n900da,da40,Diamond DA-40 Diamond Star,Private owner
ac9b55,n911kt,da40,Diamond DA-40,Private owner
aca75a,n914us,da40,Diamond DA40,Private owner
ad0006,n937ds,da40,Diamond DA 40,"Diamond Aircraft Sales USA, Lo"
ad9694,n975ds,da40,Diamond DA-40 Diamond Star,Private owner
ad4796,n955ds,da40,Diamond DA-40 Diamond Star,Private owner
ad4bbb,n956jb,da40,Diamond DA40 Diamond Star,Private owner
adf5f0,n999vc,da40,Diamond DA40 Diamond Star,Private owner
ad1993,n943pa,da40,Diamond DA40,Private owner
ada270,vh-ere,da40,Diamond DA-40 Diamond Star,Flight Training Adelaide
ad2103,n945pc,da40,Diamond DA-40 Diamond Star,Private owner
ad216f,n945tl,da40,Diamond DA-40 Diamond Star,Private owner
ad23ce,n946ds,da40,,
c008dc,c-fdjf,da40,,
ad6f15,n965ds,da40,Diamond DA40 Diamond Star,Private owner
adb0da,n981wl,da40,Diamond DA40 Diamond Star,Private owner
adba75,n984es,da40,Diamond DA40 Diamond Star,Private owner
c015b1,c-fifo,da40,Diamond DA40 Diamond Star,Private owner
ad72cc,n966ds,da40,Diamond DA40 Diamond Star,Private owner
ad2c26,n948pa,da40,Diamond DA40 Diamond Star,Private owner
ad2f7b,n949kc,da40,Diamond DA-40 Diamond Star,Private owner
ad7683,n967ds,da40,Diamond DA40 Diamond Star,Private owner
ad7e36,n969gl,da40,Diamond DA40 Diamond Star,Private owner
ad8184,n97cf,da40,Diamond DA40 Diamond Star,Private owner
ad8401,n970ds,da40,Diamond DA40 Diamond Star,Private owner
c01873,c-fjgs,da40,Diamond DA40 Diamond Star,Private owner
c01e5b,c-flmw,da40,Diamond DA40 Diamond Star,Private owner
c02e20,c-frmd,da40,,
ad88d7,n971rd,da40,Diamond DA40 Diamond Star,Private owner
add7a0,n991pa,da40,Diamond DA-40 Diamond Star,Private owner
adecd7,n997ca,da40,Diamond DA40 Diamond Star,Private owner
c05de2,c-gjoj,da40,,
c040ff,c-fypy,da40,Diamond DA40 Diamond Star,Private owner
c06ca2,c-gpdp,da40,Diamond DA40 Diamond Star,Private owner
c07b07,c-gupi,da40,Diamond DA40 Diamond Star,Private owner
c07cb6,c-gvfx,da40,Diamond DA40 Diamond Star,Private owner
c0844f,c-gygs,da40,Diamond DA-40 Star,Private owner
404a45,g-lwlw,da40,Diamond DA-40D Diamond Star,Private owner
c81ce5,zk-mtg,da40,Diamond DA-40 Diamond Star,Massey University School of Aviation
a01cd4,n106uv,da40,Diamond DA-40 Diamond Star,Private owner
a7dba5,n605us,da40,Diamond DA-40 Diamond Star,Private owner
c81ce7,zk-mtj,da40,Diamond DA-40 Diamond Star,Massey University School of Aviation
76e4c7,9v-yfg,da40,Diamond DA-40 Diamond Star,Singapore Youth Flying Club
c81ce4,zk-mtf,da40,Diamond DA-40 Diamond Star,Massey University School of Av
c81ce6,zk-mti,da40,Diamond DA-40 Diamond Star,Massey University School of Av
c81ce8,zk-mtk,da40,Diamond DA-40 Diamond Star,Massey University School of Av
c81ced,zk-mta,da40,Diamond DA-40 Diamond Star,Massey University School of Av
c81cf0,zk-mtd,da40,Diamond DA-40 Diamond Star,Massey University School of Av
c81e8b,zk-mtz,da40,Diamond DA-40 Diamond Star,Private owner
c820ea,zk-dae,da40,Diamond DA-40 Diamond Star,Private owner
a9bdc2,n727cc,da40,Diamond DA-40 Diamond Star,Private owner
aa5427,n765am,da40,Diamond DA-40 Diamond Star,Private owner
400ff7,g-occn,da40,Diamond DA-40 Star D,Flying Time Ltd
a45596,n379ds,da40,Diamond DA-40 Diamond Star,Private owner
c81cee,zk-mte,da40,Diamond DA-40 Diamond Star,Massey University School of Aviation
48501b,ph-ubb,da40,Diamond DA40D Star,Private owner
448c83,oo-cdc,da40,Diamond DA-40D,Ostend Air College
a82e29,n626st,da40,Diamond DA-40 Diamond Star,Private owner
c81cef,zk-mtc,da40,Diamond DA-40 Diamond Star,Massey University School of Aviation
505c56,om-dbv,da40,Diamond DA-40D Star,Private owner
c81ce9,zk-mtl,da40,Diamond DA-40 Diamond Star,Massey University School of Aviation
ab3593,n821lg,da40,Diamond DA40 Diamond Star,Private owner
a70ea3,n554ds,da40,Diamond DA-40 Diamond Star,Private owner
a286c7,n262ds,da40,Diamond DA-40 Diamond Star,Private owner
4b2fe1,hb-sdl,da40,Diamond DA-40 Star,Motorfluggruppe ZÃ¼rich
a564db,n447cl,da40,Diamond DA-40 Diamond Star,Private owner
a32365,n301ds,da40,Diamond DA-40 Diamond Star,Private owner
a97aaf,n71la,da40,Diamond DA-40 Diamond Star,Private owner
a0068a,n100uv,da40,Diamond DA-40 Diamond Star,Utah Valley University
3d2834,d-enma,da40,Diamond DA40 Diamond Star,Private owner
a43419,n370dc,da40,Diamond DA-40 Diamond Star,Private owner
398d04,f-hdie,da40,Diamond DA-40 Diamond Star,Private owner
8990fa,b-88001,da40,Diamond DA-40NG Diamond Star,APEX Flight Academy
ac671f,n899ds,da40,Diamond DA-40 Diamond Star,Private owner
400dd8,g-cdsf,da40,Diamond DA-40 Diamond Star,Private owner
44036f,hs-tpt,da40,Diamond DA-40D,Private owner
a89ca9,n654m,da40,Diamond DA-40 Diamond Star,Private owner
ab000b,n808et,da40,Diamond DA-40 Diamond Star,Private owner
a351fc,n313af,da40,Diamond DA-40 Diamond Star,Private owner
398c66,f-hddg,da40,Diamond DA-40D,Private owner
7c7ba9,vh-ypn,da40,Diamond DA-40NG Twin Star,Private owner
4bd045,tc-tbe,da40,Diamond DA-40 Diamond Star,Private owner
4405b7,oe-kay,da40,Diamond DA-40NG,Private owner
ab0009,n808er,da40,Diamond DA-40 Diamond Star,Private owner
ab368c,n821wf,da40,Diamond DA-40 Diamond Star,Private owner
a850ab,n635ds,da40,Diamond DA-40 Diamond Star,Private owner
ac4d1e,n892ds,da40,Diamond DA-40 Diamond Star,Private owner
44088d,oe-kgw,da40,Diamond DA 40,Private owner
a06bcf,n126us,da40,Diamond DA-40 Diamond Star,Private owner
c81cea,zk-mth,da40,Diamond DA-40 Diamond Star,Massey University School of Aviation
a56a28,n448us,da40,Diamond DA-40 Diamond Star,Private owner
aa1455,n749ds,da40,Diamond DA-40 Diamond Star,Private owner
a3f00d,n353bb,da40,Diamond DA-40 Diamond Star,Private owner
c81cf1,zk-mtb,da40,Diamond DA-40 Diamond Star,Massey University School of Aviation
4bd044,tc-tbd,da40,Diamond DA-40 Diamond Star,Private owner
47ab16,ln-fts,da40,Diamond DA-40 Diamond Star,Pilot Flight Academy
a79ba5,n59ga,da40,Diamond DA-40 Diamond Star,Private owner
a108ce,n166jp,da40,Diamond DA-40 Diamond Star,Private owner
3d29d9,d-eocf,da40,Diamond DA-40 Star,Private owner
a35d48,n316bv,da40,Diamond DA-40 Diamond Star,Private owner
7c7bac,vh-ypq,da40,Diamond DA-40NG Diamond Star,Australian International Aviation College
a58cdc,n457hr,da40,Diamond DA-40 Diamond Star,Private owner
7c7bad,vh-ypr,da40,Diamond DA-40NG Diamond Star,Australian International Aviation
abe6f4,n866us,da40,Diamond DA-40 Diamond Star,Private owner
47abf4,ln-ftr,da40,Diamond DA-40 Diamond Star,Pilot Flight Academy
a51a2d,n428jp,da40,Diamond DA-40 Diamond Star,Private owner
a266b6,n254ds,da40,Diamond DA-40 Diamond Star,Private owner
c02f9b,c-fsas,da40,Diamond DA40 Diamond Star,Private owner
acb27f,n917us,da40,Diamond DA-40 Diamond Star,Private owner
aa21d3,n752ds,da40,Diamond DA-40 Diamond Star,Private owner
aad9d0,n799ds,da40,Diamond DA-40 Diamond Star,Private owner
a2f69f,n290mt,da40,Diamond DA-40 Diamond Star,Private owner
4cc4e2,tf-kfh,da40,Diamond DA 40 NG,Keilir Aviation Academy
396411,f-gzar,da40,Diamond DA-40D Diamond Star,Private owner
ac8305,n905pa,da40,Diamond DA-40 Diamond Star,Private owner
a89fa9,n655ds,da40,Diamond DA-40 Diamond Star,Private owner
4bd043,tc-tbc,da40,Diamond DA-40 Diamond Star,Private owner
4404d7,oe-dng,da40,Diamond DA-40NG Diamond Star,Egnatia Aviation
a3ac75,n336ds,da40,Diamond DA-40 Diamond Star,Private owner
a57278,n450ds,da40,Diamond DA-40 Diamond Star,Private owner
a63a43,n500dh,da40,Diamond DA-40 Diamond Star,Private owner
a83d65,n63wp,da40,Diamond DA-40 Diamond Star,Private owner
44067a,oe-kds,da40,Diamond DA 40,Luftsportverband Salzburg
a77ac4,n581mt,da40,Diamond DA-40 Diamond Star,Private owner
3d2dbf,d-epop,da40,Diamond DA40 Star,Private owner
a8a31f,n656bb,da40,Diamond DA-40 Diamond Star,Private owner
3d1010,d-eeii,da40,Diamond DA40D Star,Private owner
ac5baa,n896am,da40,Diamond DA-40 Diamond Star,Private owner
3955f8,f-gvpy,da40,Diamond DA-40D Diamond Star,Private owner
c020ff,c-fmmw,da40,Diamond DA40,Private owner
a1f1dd,n224wm,da40,Diamond DA-40 Diamond Star,Private owner
a68847,n52tj,da40,Diamond DA-40 Diamond Star,Private owner
a28e35,n264ds,da40,Diamond DA-40 Diamond Star,Private owner
393532,f-gnjs,da40,Diamond DA-40 Diamond Star,Private owner
a99e8f,n719m,da40,Diamond DA-40 Diamond Star,Private owner
a20c93,n231ds,da40,Diamond DA-40 Diamond Star,Private owner
ad28fc,n947us,da40,Diamond DA-40 Diamond Star,Private owner
a426a9,n367ds,da40,Diamond DA-40 Diamond Star,Private owner
c0084d,c-fdds,da40,Diamond DA40,Private owner
3d1050,d-eeku,da40,Diamond DA-40 Diamond Star,Private owner
a5b13b,n466ps,da40,Diamond DA-40 Diamond Star,Private owner
a96ea0,n707as,da40,Diamond DA-40 Diamond Star,Private owner
a00df8,n102uv,da40,Diamond DA40 Diamond Star,Private owner
7c7b6a,vh-ynw,da40,Diamond DA40 Star,Flight Training Adelaide
3d10f9,d-eerh,da40,Diamond DA-40D Star TDI,Private owner
a64928,n504ds,da40,Diamond DA-40 Diamond Star,Private owner
3d32fc,d-eroe,da40,Diamond DA-40,Private owner
4b3025,hb-sgb,da40,Diamond DA40 D,Private owner
c00c30,c-fepz,da40,Diamond DA-40 Diamond Star,Private owner
c08295,c-gxls,da40,Diamond DA-40D Star,PTC Aviation
a4329f,n37na,da40,Diamond DA-40 Diamond Star,Private owner
c071ef,c-grdu,da40,Diamond DA-40 Diamond Star,Private owner
4c804b,5b-clh,da40,Diamond DA-40D Diamond Star,Private owner
a2c57a,n278pa,da40,Diamond DA-40 Diamond Star,Private owner
ad2545,n946us,da40,Diamond DA-40 Diamond Star,Private owner
ab63db,n833ds,da40,Diamond DA40 Diamond Star,Private owner
acf12a,n933ds,da40,Diamond DA-40 Diamond Star,Private owner
395601,f-gvqb,da40,Diamond DA-40D Diamond Star,Quiberon Air Club
a82e30,n626t,da40,Diamond DA-40 Diamond Star,Private owner
c033f3,c-ftrm,da40,Diamond DA-40 Diamond Star,Private owner
a300fb,n293ds,da40,Diamond DA-40 Diamond Star,Private owner
3d31b4,d-erbo,da40,Diamond DA40 Star,Private owner
c08291,c-gxlo,da40,Diamond DA40,Private owner
a9d2d5,n732ds,da40,Diamond DA-40 Diamond Star,Private owner
8568bc,ja40da,da40,Diamond DA-40 Diamond Star,Private owner
3d2214,d-elds,da40,Diamond DA40D Star,Private owner
c03378,c-ftmt,da40,Diamond DA40 Diamond Star,Private owner
c055b2,c-gglt,da40,Diamond DA-40 Diamond Star,Private owner
a2bd22,n276ds,da40,Diamond DA-40 Diamond Star,Private owner
39352c,f-gnjm,da40,Diamond DA-40 Star,Aero Club Herault Languedoc Roussillon
ac8d40,n908ds,da40,Diamond DA-40 Diamond Star,Private owner
a19d84,n203ds,da40,Diamond DA-40 Diamond Star,Private owner
3d34b9,d-esfh,da40,Diamond DA40 Diamond Star,Private owner
c0578d,c-ghea,da40,Diamond DA-40 Diamond Star,Private owner
3985d7,f-hbox,da40,Diamond DA-40D Diamond Star,Private owner
a3f405,n354ds,da40,Diamond DA-40 Diamond Star,Private owner
3d3f2f,d-eweh,da40,Diamond DA40D Star,Private owner
440370,oe-vdr,da40,Diamond DA-40D Diamond Star,Private owner
a3a24c,n333pu,da40,Diamond DA-40 Diamond Star,Private owner
c00b29,c-fefw,da40,Diamond DA40 Diamond Star,Private owner
a5b3f8,n467ds,da40,Diamond DA-40 Diamond Star,Private owner
c016c0,c-fipz,da40,Diamond DA-40 Diamond Star,Private owner
a52725,n431de,da40,Diamond DA-40 Diamond Star,Private owner
3d491e,d-ezyc,da40,Diamond DA40 Star,Private owner
aa30af,n756ds,da40,Diamond DA-40 Diamond Star,Private owner
a1a4f2,n205ds,da40,Diamond DA-40 Diamond Star,Private owner
a3c87f,n343am,da40,Diamond DA-40 Diamond Star,Private owner
a68cf4,n521dd,da40,Diamond DA-40 Diamond Star,Private owner
a214b9,n233ma,da40,Diamond DA-40 Diamond Star,Private owner
c03e9d,c-fxsm,da40,Diamond DA-40 Diamond Star,Private owner
a01864,n105mk,da40,Diamond DA-40 Diamond Star,Private owner
a37a8b,n323mc,da40,Diamond DA-40 Diamond Star,Private owner
a8aace,n658ds,da40,Diamond DA-40 Diamond Star,Private owner
c0829a,c-gxlx,da40,Diamond DA-40 Diamond Star,Private owner
a48b4b,n392ma,da40,Diamond DA-40 Diamond Star,Private owner
7c582c,vh-rpa,da40,Diamond DA-40D Star,Flight Training Adelaide
aa0579,n745ds,da40,Diamond DA-40 Diamond Star,Private owner
a18288,n197ds,da40,Diamond DA-40 Diamond Star,Private owner
a46a59,n384ca,da40,Diamond DA-40 Diamond Star,Private owner
7c2a00,vh-iky,da40,Diamond DA-40 Star,GDB Aviation
a06094,n123tv,da40,Diamond DA-40 Diamond Star,Private owner
a6bd71,n533vd,da40,Diamond DA-40 Diamond Star,Private owner
3951eb,f-gupl,da40,Diamond DA-40D Diamond Star,Diam-Air
398525,f-hbjf,da40,Diamond DA-40D Star,Aeroclub Les Ailes Chatelleraudaises
a45c90,n380pa,da40,Diamond DA-40 Diamond Star,Private owner
a28a7e,n263ds,da40,Diamond DA-40 Diamond Star,Private owner
c04f37,c-gdzy,da40,Diamond DA40 Diamond Star,Private owner
a67bcc,n517ds,da40,Diamond DA-40 Diamond Star,Private owner
394a49,f-gssj,da40,Diamond DA-40D Star,Private owner
c07630,c-gstr,da40,Diamond DA-40 Diamond Star,Private owner
a5f84b,n484jp,da40,Diamond DA-40 Diamond Star,Private owner
a6bd68,n533uv,da40,Diamond DA-40 Diamond Star,Private owner
501de6,9a-ing,da40,Diamond DA40 Diamond Star,Private owner
a27592,n258ds,da40,Diamond DA-40 Diamond Star,Private owner
a11989,n170ds,da40,Diamond DA-40 Diamond Star,Private owner
a64e89,n505wt,da40,Diamond DA-40 Diamond Star,Private owner
a31cf7,n3zz,da40,Diamond DA-40 Diamond Star,Private owner
a5e96f,n480jp,da40,Diamond DA-40 Diamond Star,Private owner
7c7c35,vh-ytj,da40,Diamond DA-40,Flight Training Adelaide
aadf18,n8vt,da40,Diamond DA-40 Diamond Star,Private owner
7c7c45,vh-ytz,da40,Diamond DA40,Private owner
a50369,n422ds,da40,Diamond DA-40 Diamond Star,Private owner
a1db4d,n219ds,da40,Diamond DA-40 Diamond Star,Private owner
398d01,f-hdib,da40,Diamond DA40 D,Private owner
3d491c,d-ezya,da40,Diamond DA-40 Diamond Star,Pilot Training Network
4cc4f4,tf-kfi,da40,Diamond DA40 Tundra Star,Keilir Aviation Academy
a178c1,n194ts,da40,Diamond DA-40 Diamond Star,Private owner
ab5c2b,n831ba,da40,Diamond DA-40 Diamond Star,Private owner
39dc05,f-hxaf,da40,Diamond DA40,Private owner
398d25,f-hdjf,da40,Diamond DA40 NG,Private owner
7c3ee8,vh-mpm,da40,Diamond DA-40 Diamond Star,Private owner
7c7c40,vh-ytu,da40,Diamond DA-40 Diamond Star,Flight Training Adelaide
a17426,n193jp,da40,Diamond DA-40 Diamond Star,Private owner
a50319,n422am,da40,Diamond DA-40 Diamond Star,Private owner
39ae6f,f-hltp,da40,Diamond DA40,Private owner
4b2fe5,hb-sdp,da40,Diamond DA40D,Private owner
a1d3bb,n217cf,da40,Diamond DA-40 Diamond Star,Private owner
ac01a4,n873br,da40,,
ac0912,n875br,da40,,
a06778,n125ng,da40,,
39b821,f-hobb,da40,Diamond DA-40NG Diamond Star,Private owner
a3cd3e,n344ma,da40,Diamond DA-40 Diamond Star,Private owner
7c37fd,vh-lcf,da40,,
50ff0b,ur-lsk,da40,,
aab3e4,n789vv,da40,,
440621,oe-drz,da40,,
506dff,s5-dsm,da40,,
4ab52f,se-mio,da40,,
a372d4,n321je,da40,,
ac323b,n885us,da40,,
7c14fc,vh-efi,da40,,
7c7c33,vh-yth,da40,,
44086b,oe-dhm,da40,,
a251ca,n249ds,da40,,
3d11e8,d-efam,da40,,
300683,i-dadb,da40,,
300684,i-dade,da40,,
3d201f,d-ekkl,da40,,
a4f263,n418fp,da40,,
a4eeac,n417fp,da40,,
4400e7,oe-dkk,da40,,
510075,ew-358ll,da40,,
a471a2,n386ap,da40,,
a69f94,n526ds,da40,,
39ca71,f-hstr,da40,,
a3c4c2,n342af,da40,,
a50b06,n424fp,da40,,
a02788,n109qg,da40,,
a11c8b,n1707s,da40,,
a4fc2a,n420fp,da40,,
ac05b1,n874fb,da40,,
3d375b,d-etff,da40,,
a944fb,n697ct,da40,,
a85937,n637rc,da40,,
a48851,n391uq,da40,,
463b9a,oh-wow,da40,,
a74f8e,n570mt,da40,,
a0af08,n143ng,da40,,
407355,g-ckei,da40,,
a5b998,n468zf,da40,,
ad5d14,n960kn,da40,,
3d3d35,d-evkv,da40,,
4400b6,oe-krm,da40,,
a2b219,n273ev,da40,,
a21f26,n236ds,da40,,
39c5ec,f-hrpm,da40,,
aae9bf,n802er,da40,,
a6d396,n539ts,da40,,
a2b1fd,n273ds,da40,,
448e0f,oo-cpo,da40,,
a1e018,n22qt,da40,,
4b3028,hb-sge,da40,,
40722e,g-sbsb,da40,,
39e502,f-hzic,da40,,
4b2fe4,hb-sdo,da40,,
a42e91,n369jp,da40,,
39b9ce,f-hooo,da40,,
393537,f-gnjx,da40,,
4b3049,hb-shl,da40,,
a7db6b,n605sj,da40,,
46b438,sx-max,da40,,
ab97cf,n846tc,da40,,
398c17,f-hdax,da40,,
474002,ha-suv,da40,,
a5544a,n442z,da40,,
407338,g-fbar,da40,,
398ea0,f-hdva,da40,,
3d320e,d-erfa,da40,,
4785bb,ln-nez,da40,,
ab363b,n821t,da40,,
3d32f0,d-erns,da40,,
474008,ha-dan,da40,,
505ecb,om-evk,da40,,
4403c3,i-ctae,da40,,
a451df,n378ds,da40,,
474010,ha-daw,da40,,
028645,ts-bsf,da40,,
440715,oe-kas,da40,,
4b2fdb,hb-sdf,da40,,
3d2e65,d-epuz,da40,,
c07351,c-grrk,da40,,
49d284,ok-dai,da40,,
a736eb,n564mt,da40,,
44090c,oe-krf,da40,,
3d07ac,d-ebds,da40,,
ab7fdb,n840ab,da40,,
3d4920,d-ezye,da40,,
aa6402,n769ls,da40,,
510074,ew-357ll,da40,,
a6b480,n531ds,da40,,
7c300d,vh-jrz,da40,,
a5c9ce,n472pa,da40,,
a3df19,n349ds,da40,,
47aa8d,ln-ftu,da40,,
a6a7c1,n528mh,da40,,
506e05,s5-djd,da40,,
8990fb,b-88002,da40,,
39c658,f-hrsy,da40,,
7c7af7,vh-ykp,da40,,
a987f7,n713hx,da40,,
7c7af0,vh-yki,da40,,
407473,g-tula,da40,,
405db1,g-cfjn,da40,,
46d025,sx-tae,da40,,
a091d7,n136ds,da40,,
856c50,ja41da,da40,,
398d24,f-hdje,da40,,
a35742,n314se,da40,,
7c7aef,vh-ykh,da40,,
3952b4,f-guvu,da40,,
a801b0,n615dv,da40,,
451c70,lz-asi,da40,,
407366,g-rkaf,da40,,
a50ebd,n425fp,da40,,
46a4d2,sx-ifr,da40,,
a6157b,n491tc,da40,,
abca0d,n859pa,da40,,
73956e,4x-cxb,da40,,
800723,vt-sdr,da40,,
7c15e1,vh-elv,da40,,
4404c8,oe-dxe,da40,,
4ab1f9,se-loy,da40,,
440894,oe-dws,da40,,
7809c6,b-9707,da40,,
c07547,c-gsks,da40,,
780907,b-9559,da40,,
407474,g-tami,da40,,
47a9b2,ln-ftw,da40,,
47a9f2,ln-ftv,da40,,
440371,oe-vds,da40,,
398029,f-habj,da40,,
440967,oe-ktt,da40,,
3981b2,f-hans,da40,,
adc571,n987da,da40,,
a698f6,n524n,da40,,
4609db,oh-dtb,da40,,
800724,vt-gmr,da40,,
780cd1,b-9879,da40,,
780758,b-9383,da40,,
780848,b-9516,da40,,
781183,b-10ny,da40,,
7c7c36,vh-ytk,da40,,
780cd5,b-9883,da40,,
a211ad,n232tx,da40,,
781083,b-10ht,da40,,
780845,b-9512,da40,,
780797,b-9477,da40,,
780844,b-9511,da40,,
780908,b-9498,da40,,
7809c7,b-9708,da40,,
780796,b-9472,da40,,
7809c9,b-9710,da40,,
78090a,b-9562,da40,,
3952ac,f-guvm,da40,,
7c43f1,vh-npf,da40,,
