icao,regid,mdl,type,operator
400e7a,g-cmbs,expl,MD-900 Explorer,Police and Crime Commissioner
3de7dc,d-hibc,expl,MD-900 Explorer,Polizei Baden-WÃ¼rttemberg
4012a7,g-ehaa,expl,MD-900 Explorer,Police Aviation
4012a9,g-cems,expl,MD-900 Explorer,Yorkshire Air Ambulance
404059,g-bxzk,expl,MD-900 Explorer,Police Aviation
40408a,g-kaat,expl,MD-900 Explorer,Police Aviation
404256,g-kssh,expl,MD-900 Explorer,Police Aviation
4043ad,g-ehms,expl,MD-900 Explorer,London's Air Ambulance
4043f8,g-lnaa,expl,MD-900 Explorer,Police Aviation
404443,g-ypol,expl,MD-900 Explorer,Police Aviation
40448b,g-haat,expl,MD-900 Explorer,Police Aviation
4044aa,g-hpol,expl,MD-900 Explorer,Police Aviation
406419,g-lnct,expl,MD-900 Explorer,Police Aviation
4064d9,g-coth,expl,MD-900 Explorer,Police Aviation
4068da,g-hmdx,expl,MD-900 Explorer,Police Aviation
4068db,g-kssa,expl,MD-900 Explorer,Police Aviation
44b906,oo-nhf,expl,MD-900 Explorer,Noordzee Helikopters Vlaandere
44b909,oo-nhi,expl,MD-900 Explorer,Noordzee Helikopters Vlaandere
44b90c,oo-nhl,expl,MD-900 Explorer,NHV Noordzee Helikopters Vlaan
44c1e5,ot-gia,expl,McDonnell Douglas MD-900 Explo,Belgian Federal Police
44c1e8,ot-gic,expl,McDonnell Douglas MD-900 Explo,Belgian Federal Police
4b424e,hb-zcw,expl,MD-900 Explorer,Private owner
840889,ja02ap,expl,MD-900/902 Explorer,Private owner
8634ee,ja6790,expl,MD-900 Explorer,Aero Asahi
863aea,ja6906,expl,MD-900 Explorer,Aero Asahi
863aec,ja6908,expl,MD-900 Explorer,Aero Asahi
863aed,ja6909,expl,MD-900 Explorer,Aero Asahi
863b0a,ja6914,expl,MD-900 Explorer,Doctor Heli
4b4257,hb-zdf,expl,MD-900 Explorer,Private owner
acc72e,n922sf,expl,MD-900 Explorer,County of Chautauqua
406ef2,g-lndn,expl,MD-900 Explorer,London Air Ambulance
4d028a,lx-hrc,expl,MD902 Explorer,Ducair
aceaf6,n931sf,expl,MD-900 Explorer,County of Chautauqua
ac71c1,n90011,expl,MD Helicopters MD-900,Private owner
8404f5,ja01ap,expl,McD-D Helicopters MD-902,Private owner
406c1b,g-cnwl,expl,McDonnell Douglas MD900,Air Ambulance
406b1e,g-cios,expl,MD Helicopter MD-900,Specialist Aviation Services
4d03fb,lx-pga,expl,,
a50fff,ti-bdj,expl,,
a52a23,pr-nyi,expl,,
440716,oe-xll,expl,,
ac76d4,n902ch,expl,,
