icao,regid,mdl,type,operator
43e8ac,m-bets,ac95,Gulfstream American 695A,Private owner
7c25a4,vh-hpy,ac95,Rockwell Commander 695,Private owner
a05335,n12va,ac95,Rockwell Commander 695,Private owner
a06b0f,n126m,ac95,,
a1d85e,n218ms,ac95,Rockwell Commander 695,Private owner
a1f059,n224ez,ac95,Gulfstream 695B,Private owner
a3a2c4,n333up,ac95,,
a57140,n45rf,ac95,GULFSTREAM AM CORP COMM DIV 69,US Department of Commerce
a5e3e0,n479pt,ac95,Gulfstream 695A,Private owner
a65f6d,n51dm,ac95,Rockwell Commander 695,Private owner
a9738e,n708pc,ac95,Rockwell 695,Private owner
a93de6,n695gg,ac95,Gulfstream Commander 695A,Private owner
a93de7,n695gh,ac95,Gulfstream Commander 695B,Private owner
a93e0a,n695ht,ac95,Rockwell Commander 695,Private owner
a93e31,n695kg,ac95,,
a93e63,n695mg,ac95,Gulfstream 695B,Private owner
a93e68,n695mm,ac95,Gulfstream 695A,Private owner
a93e78,yv2764,ac95,Rockwell Commander 695,Private owner
a93f7d,n695yp,ac95,,
ab57f6,n83wa,ac95,Rockwell Commander 695,Private owner
ac0095,pr-dbr,ac95,Rockwell Commander 695,Private owner
adab45,n980bh,ac95,Rockwell 695,Private owner
adabd5,n980hb,ac95,Rockwell 695,Private owner
a93d8c,n695cs,ac95,Rockwell Commander 695,Private owner
aab6f9,n79ph,ac95,Rockwell Commander 695,Private owner
ad6ed5,n965bc,ac95,Rockwell Commander 695,Private owner
a55b71,n444wd,ac95,Rockwell Commander 695,Private owner
a93d4b,n695ab,ac95,Rockwell Commander 695,Private owner
3e2ba0,d-ihsi,ac95,Rockwell Commander 695,Private owner
adb18a,n9812s,ac95,Rockwell 695,Private owner
ad0b34,n94ea,ac95,Rockwell Commander 695,Private owner
a2a603,v5-dam,ac95,Gulfstream 695 Jetprop Commander,Private owner
a93e19,n695jh,ac95,Gulfstream 695A,Private owner
adabca,n980gr,ac95,,
7c3962,vh-lmc,ac95,,
a256db,n25tn,ac95,,
a93dc7,n695fa,ac95,,
a97ad7,n71mr,ac95,,
a6740e,n515am,ac95,,
0d0991,xc-bcs,ac95,,
