icao,regid,mdl,type,operator
3fa985,83+05,lynx,,
43c2d2,xz731,lynx,Westland Lynx HMA.8,Royal Navy
43c2db,zd257,lynx,Westland Lynx HMA8SRU,Royal Navy
43c2ed,zf563,lynx,Westland Lynx HMA8,Royal Navy
43c538,ze376,lynx,Westland Lynx AH.7,Army Air Corp
43c53a,zf537,lynx,Westland Lynx AH9,Army Air Corps
43c541,zg887,lynx,Westland Lynx AH9,Army Air Corps
43c2cd,xz725,lynx,Westland Lynx HMA8DSP,Royal Navy
