icao,regid,mdl,type,operator
400f8d,g-veze,veze,Brown Evans Roper Hend. Rutan,Private owner
4b3f8c,hb-ybs,veze,VARI EZE,Private Owner
a1df48,n22gk,veze,Amateur Vari-Eze,Private owner
4b3fb9,hb-ydl,veze,RUTAN VariEze,Private owner
400c04,g-kenz,veze,,
