icao,regid,mdl,type,operator
3e7968,d-klee,rf5,Sportavia RF-5,Fluggruppe DLR Braunschweig e.
3ec23f,d-konf,rf5,Sportavia-Putzer	RF-5,Private owner
40197d,g-azrk,rf5,Sportavia-Putzer Fournier RF-5,Private Owner
401c9f,g-bevo,rf5,Fournier RF-5,Private owner
484866,ph-912,rf5,"Sportavia RF 5 B ""Sperber""",Private owner
3e5de3,d-katf,rf5,Sportavia Putzer RF-5,Private owner
4018cd,g-ayme,rf5,Fournier RF5,Mike Echo Group
3e6858,d-kese,rf5,Sportavia-Putzer RF-5,Private owner
40197f,g-azrm,rf5,Fournier RF5,Private Owner
3e71a1,d-kifp,rf5,,
