icao,regid,mdl,type,operator
004044,pt-zno,rv10,Amateur Vans RV-10,Private owner
00c66f,zu-sax,rv10,Amateur Vans RV-10,Private owner
00cb2b,zu-wrv,rv10,Amateur Vans RV-10,Private owner
00cdc5,zu-lrv,rv10,Van's Aircraft RV-10,Private owner
00d932,zu-pjl,rv10,Amateur Vans RV-10,Private Owner
00ddeb,zu-joc,rv10,Amateur Vans RV-10,Private owner
00e0aa,zu-jvr,rv10,Amateur Vans RV-10,Private owner
00e52f,zu-fni,rv10,Amateur Vans RV-10,Private owner
00f67d,zu-iab,rv10,Amateur Vans RV-10,Private owner
0f7e66,zu-tjx,rv10,Amateur Vans RV-10,Private owner
4050e7,g-xrvx,rv10,Van's RV-10,Private Owner
4062e4,g-cgjp,rv10,Vans RV10,Private owner
406533,g-rvgo,rv10,Van's RV-10,Private owner
4068be,g-omrc,rv10,Amateur Vans RV-10,Private owner
484a8b,ph-usn,rv10,Amateur Vans RV-10,Private owner
484a8f,ph-rvx,rv10,Amateur Vans RV-10,Private owner
4b40bf,hb-ynn,rv10,VAN'S RV-10,Private owner
7c07f8,vh-buy,rv10,Amateur Vans RV-10,Private owner
7c29d9,vh-ijv,rv10,Amateur Vans RV-10,Private owner
7c2a49,vh-imz,rv10,Amateur Vans RV-10,Private owner
7c2bc2,vh-ixg,rv10,Amateur Vans RV-10,Private owner
7c33fd,vh-kjz,rv10,Amateur Vans RV-10,Private owner
7c3439,vh-kln,rv10,Amateur Vans RV-10,Private owner
7c398f,vh-lnl,rv10,Amateur Vans RV-10,Private owner
7c471c,vh-oby,rv10,Amateur Vans RV-10,Private owner
7c4cdf,vh-pgx,rv10,Amateur Vans RV-10,Private owner
7c6d47,vh-vvd,rv10,Amateur Vans RV-10,Private owner
7c75ff,vh-xld,rv10,Amateur Vans RV-10,Private owner
7c7720,vh-xte,rv10,Amateur Vans RV-10,Private owner
7c7c1e,vh-ysw,rv10,Amateur Vans RV-10,Private owner
7c7f26,vh-zeg,rv10,Amateur Vans RV-10,Private owner
a00220,n1xs,rv10,Amateur Vans RV-10,Private owner
a00303,n10gt,rv10,,
a00439,n10vc,rv10,Amateur Vans RV-10,Private owner
a00680,n100uk,rv10,Amateur Vans RV-10,Private owner
a00cab,n102fm,rv10,Amateur Vans RV-10,Private owner
a00d15,n102kt,rv10,Amateur Vans RV-10,Private owner
a013a8,n104az,rv10,Amateur Vans RV-10,Private owner
a013c6,n104cd,rv10,Amateur Vans RV-10,Private owner
a0145f,n104jg,rv10,Amateur Vans RV-10,Private owner
a0148e,n104ld,rv10,Amateur Vans RV-10,Private owner
a01491,n104lg,rv10,,
a014bc,n104n,rv10,Amateur Vans RV-10,Private owner
a0153d,n104td,rv10,Amateur Vans RV-10,Private owner
a02c9c,n110ee,rv10,Amateur Vans RV-10,Private owner
a02cea,n110hh,rv10,Amateur Vans RV-10,Private owner
a0353d,n112sm,rv10,Amateur Vans RV-10,Private owner
a0c92d,n15pt,rv10,Amateur Vans RV-10,Private owner
a0e4c8,n157gb,rv10,Amateur Vans RV-10,Private owner
a0431b,n116gh,rv10,Amateur Vans RV-10,Private owner
a06651,n125am,rv10,Amateur Vans RV-10,Private owner
a1c174,n212fg,rv10,,
a1cc75,n215dw,rv10,Amateur Vans RV-10,Private owner
a1cdc5,n215tg,rv10,Amateur Vans RV-10,Private owner
a1cdc9,n215tl,rv10,Amateur Vans RV-10,Private owner
a22e1e,n24ev,rv10,Amateur Vans RV-10,Private owner
a203b7,n229pb,rv10,Amateur Vans RV-10,Private owner
a2552c,n25ag,rv10,Amateur Vans RV-10,Private owner
a263f8,n253pr,rv10,Amateur Vans RV-10,Private owner
a26e77,n256h,rv10,Amateur Vans RV-10A,Private owner
a287a0,n262nj,rv10,Amateur Vans RV-10,Private owner
a2a634,n27xd,rv10,,
a2d6b2,n282pd,rv10,Amateur Vans RV-10,Private owner
a2fac5,n291sd,rv10,Amateur Vans RV-10,Private owner
a34c13,n311rv,rv10,Amateur Vans RV-10,Private owner
a37eaa,n324rg,rv10,Amateur Vans RV-10,Private owner
a32e7c,n304dc,rv10,Amateur Vans RV-10,Private owner
a381a0,n325hp,rv10,Amateur Vans RV-10,Private owner
a38fdb,n329bc,rv10,Amateur Vans RV-10A,Private owner
a3901a,n329dr,rv10,,
a332d8,n305kt,rv10,Amateur Vans RV-10,Private owner
a399da,n331dj,rv10,Amateur Vans RV-10,Private owner
a3a19a,n333gr,rv10,Amateur Vans RV-10,Private owner
a3a79c,n3344n,rv10,Amateur Vans RV-10,Private owner
a3a79d,n3344p,rv10,Amateur Vans RV-10,Private owner
a3ac79,n336dw,rv10,Amateur Vans RV-10,Private owner
a43cc4,n372rv,rv10,Amateur Vans RV-10,Private owner
a3f17d,n353rv,rv10,Amateur Vans RV-10,Private owner
a406ce,n359fw,rv10,Amateur Vans RV-10,Private owner
a4d4e8,n410j,rv10,,
a4d4e9,n410ja,rv10,Amateur Vans RV-10,Private owner
a4dbaa,n412bc,rv10,Boeing 737-3K2,Somon Air
a4e71a,n415ec,rv10,Amateur Vans RV-10,Private owner
a45ba1,n380dm,rv10,Amateur Vans RV-10,Private owner
a4b58e,n402rh,rv10,Amateur Vans RV-10,Private owner
a431b2,n37cp,rv10,Amateur Vans RV-10,Private owner
a4f972,n42bu,rv10,Amateur Vans RV-10,Private owner
a561fa,n446m,rv10,Amateur Vans RV-10,Private owner
a58bd4,n45678,rv10,Amateur Vans RV-10,Private owner
a59c13,n46007,rv10,Amateur DC10 Vans RV-10,Private owner
a6264f,n4959s,rv10,Amateur Vans RV-10,Private Owner
a64e15,n505sb,rv10,,
a6ac51,n529w,rv10,Amateur Vans RV-10,Private owner
a68469,n519rv,rv10,Amateur Vans RV-10,Private owner
a68e63,n521tw,rv10,,
a691e7,n522rv,rv10,Amateur Vans RV-10,Private owner
a6dd2e,n541rv,rv10,Amateur Vans RV-10,Private owner
a7f430,n611tt,rv10,Amateur Vans RV-10,Private owner
a8c762,n665g,rv10,,
a8d287,n668g,rv10,Amateur Vans RV-10,Private owner
a95c39,n702cl,rv10,,
a97d0c,n710le,rv10,Amateur Vans RV-10,Private owner
a99f0e,n719sb,rv10,Amateur Vans RV-10,Private owner
a95225,n7zk,rv10,Amateur Vans RV-10,Private owner
a9f802,n741tz,rv10,,
aa2499,n75252,rv10,,
aa87ac,n778km,rv10,,
aaa02d,n784jc,rv10,Amateur Vans RV-10,Private owner
aaa7f1,n786mp,rv10,Amateur Vans RV-10,Private owner
aadf3f,n8xg,rv10,Amateur Vans RV-10,Private owner
ab19c3,n814rv,rv10,,
ab1c41,n815dg,rv10,Amateur Vans RV-10,Private owner
ab2123,n816rf,rv10,Amateur Vans RV-10,Private owner
ab2b1f,n819dj,rv10,Amateur Vans RV-10,Private owner
ab52f5,n829gw,rv10,Amateur Vans RV-10,Private owner
aae77f,n801vr,rv10,Amateur Vans RV-10,Private owner
ab012c,n808sg,rv10,Amateur Vans RV-10,Private owner
aab1f7,n789ab,rv10,Amateur Vans RV-10,Private owner
ab401b,n824e,rv10,Amateur Vans RV-10,Private owner
ac3c10,n888ff,rv10,Amateur Vans RV-10,Private owner
ace6bc,n930m,rv10,,
ac6b26,n9gx,rv10,Amateur Vans RV-10,Private owner
ad57a1,n959rv,rv10,Amateur Vans RV-10,Private owner
ad6900,n963tm,rv10,Amateur Vans RV-10,Private owner
adce4d,n989ts,rv10,Amateur Vans RV-10,Private owner
ade9b8,n996jc,rv10,Amateur Vans RV-10,Private owner
adea7d,n996s,rv10,Amateur Vans RV-10,Private owner
c050d2,c-gept,rv10,Amateur Vans RV-10,Private owner
c06b14,c-gooh,rv10,Amateur Vans RV-10,Private owner
e480ff,pr-zne,rv10,Amateur Vans RV-10,Private owner
e48901,pt-zap,rv10,Amateur Vans RV-10,Private owner
e4891d,lv-x452,rv10,Amateur Vans RV-10,Private owner
e4899e,pt-zau,rv10,Amateur Vans RV-10,Private owner
e489c0,pr-zcm,rv10,Amateur Vans RV-10,Private owner
e490e5,pr-zdo,rv10,Amateur Vans RV-10,Private owner
e49116,pp-znm,rv10,Amateur Vans RV-10,Private owner
e4911a,pp-xvp,rv10,Amateur Vans RV-10,Private owner
e4912b,pt-zkt,rv10,Amateur Vans RV-10,Private owner
e4915e,pr-zfi,rv10,Amateur Vans RV-10,Private owner
e49160,pr-zpz,rv10,Amateur Vans RV-10,Private owner
e4918b,pr-ztf,rv10,Amateur Vans RV-10,Private owner
e49190,pr-zoc,rv10,Amateur Vans RV-10,Private owner
e491a7,pr-zdn,rv10,Amateur Vans RV-10,Private owner
e9948e,pp-zrp,rv10,Amateur Vans RV-10,Private owner
e48b5f,pr-zve,rv10,Amateur Vans RV-10,Private owner
e48bd7,pt-zvl,rv10,Amateur Vans RV-10,Private owner
e48c32,pr-zba,rv10,Amateur Vans RV-10,Private owner
e490a0,pr-zhl,rv10,Amateur Vans RV-10,Private owner
e49228,pr-zod,rv10,Amateur Vans RV-10,Private owner
405108,g-rrvx,rv10,Vans RV-10,Private owner
e490e4,pr-zkt,rv10,Amateur Vans RV-10,Private owner
e486d9,pt-zrn,rv10,Amateur Vans RV-10,Private owner
042990,pr-zsf,rv10,Amateur Vans RV-10,Private owner
c81ac9,zk-rvt,rv10,Amateur Vans RV-10,Private owner
e48b67,pt-zys,rv10,Amateur Vans RV-10,Private owner
00e878,zu-igh,rv10,Van's Aircraft RV-10,Private owner
7c471d,vh-obz,rv10,Van's RV-10,Private owner
7c7fe0,vh-zjm,rv10,Van's RV-10,Private owner
c00ae8,c-fedj,rv10,Amateur Van RV-10,Hunter Air
a0139b,n104al,rv10,Amateur Vans RV-10,Private owner
00f699,zu-iee,rv10,Van’s RV-10,Private owner
00f1a3,zu-mar,rv10,Van’s RV-10,Private owner
00c555,zu-tcd,rv10,Van's RV-10,Private owner
c064bc,c-gmdv,rv10,Amateur Vans RV-10,Private owner
e49274,pp-zfi,rv10,Amateur Vans RV-10,Private owner
00cb44,zu-oak,rv10,Van's RV-10,Private owner
00e744,zu-icj,rv10,Van's RV-10,Private owner
00e92e,zu-swa,rv10,Van's RV-10,Private owner
48de18,sp-yrv,rv10,Vans RV-10,Private owner
a02d41,n110lv,rv10,Amateur Vans RV-10,Private owner
a4d458,n410cf,rv10,Amateur Vans RV-10,Private owner
7c3fde,vh-mwg,rv10,Van's RV-10,Private owner
aa17b9,n75aj,rv10,Amateur Vans RV-10,Private owner
a015e2,n104zu,rv10,Amateur Vans RV-10,Private owner
a3a2df,n333vr,rv10,Amateur Vans RV-10,Private owner
a4d567,n410pb,rv10,Amateur Vans RV-10,Private owner
a2fd26,n292cm,rv10,Amateur Vans RV-10,Private owner
00ff7d,zu-pko,rv10,Van’s RV-10,Private owner
a013b7,n104bp,rv10,Amateur Vans RV-10,Private owner
e4926e,pr-zmf,rv10,Amateur Vans RV-10,Private owner
e49229,pp-zrt,rv10,,
aa40b2,n76rm,rv10,,
7c0093,vh-aed,rv10,,
7c4e35,vh-pqf,rv10,,
7c16dd,vh-esv,rv10,,
a4eabf,n416dk,rv10,,
7c4951,vh-orn,rv10,,
7c6cc8,vh-vru,rv10,,
e492d1,pr-zbn,rv10,,
e491f5,pp-xso,rv10,,
e490a1,pr-zsn,rv10,,
e491d7,pr-zhq,rv10,,
e492d7,pr-znm,rv10,,
e4937b,pr-zlz,rv10,,
40568e,g-ovrx,rv10,,
a01532,n104st,rv10,,
7c061c,vh-bhq,rv10,,
e492a8,pp-zoj,rv10,,
30065f,i-ceco,rv10,,
ac1963,n879sp,rv10,,
7c1214,vh-duu,rv10,,
c06748,c-gncx,rv10,,
a118b5,n17vf,rv10,,
e493a5,pr-znf,rv10,,
e493a6,pp-zgq,rv10,,
ad5ab3,n96ke,rv10,,
e488a8,pt-znz,rv10,,
ac376b,n88669,rv10,,
e4937a,pr-zih,rv10,,
e492a9,pr-zkz,rv10,,
a1fbf1,n227kp,rv10,,
00fce8,zu-ihf,rv10,,
a0b6ce,n145rv,rv10,,
7c6ccb,vh-vrx,rv10,,
7c1a7e,vh-fio,rv10,,
a00492,n10ys,rv10,,
a7c841,n600lh,rv10,,
a689fd,n520lw,rv10,,
e493a4,pr-znb,rv10,,
a98093,n711jg,rv10,,
a53f9a,n4371,rv10,,
aaaafc,n787es,rv10,,
a5535c,n442pm,rv10,,
a4df6f,n413bs,rv10,,
e48ddb,pr-zdz,rv10,,
ac8830,n90623,rv10,,
a6842e,n519pl,rv10,,
e80872,cc-aud,rv10,,
e493ed,pr-zdy,rv10,,
406974,g-mclk,rv10,,
e493d2,pt-zkw,rv10,,
a4e78c,n415js,rv10,,
a50e63,n425bz,rv10,,
a1f044,n224ec,rv10,,
ad97c3,n975rv,rv10,,
a7dded,n606e,rv10,,
00ede5,zu-iba,rv10,,
a8b886,n661g,rv10,,
a7253f,n56gz,rv10,,
a51ae2,n428rv,rv10,,
ad4794,n955dq,rv10,,
a9ba6c,n726g,rv10,,
a001fd,n1wg,rv10,,
a97d98,n710rv,rv10,,
ab2f05,n82ff,rv10,,
acc1e4,n921ac,rv10,,
a581f2,n454l,rv10,,
a7899e,n585mr,rv10,,
a7123d,n555cn,rv10,,
a5992f,n46vt,rv10,,
a41921,n363tg,rv10,,
ab2bac,n819k,rv10,,
a5e701,n48ht,rv10,,
a661be,n510dd,rv10,,
a1e28c,n220rv,rv10,,
a29388,n265wd,rv10,,
a7dde2,n606dp,rv10,,
ac74ce,n901vr,rv10,,
a1218e,n172kt,rv10,,
a7662e,n576rd,rv10,,
a015ab,n104xp,rv10,,
a556d7,n443mb,rv10,,
a886ca,n649bg,rv10,,
a5d55a,n475td,rv10,,
a0e4f0,n157hs,rv10,,
a24366,n245jm,rv10,,
acce88,n924rl,rv10,,
a2b46c,n2733k,rv10,,
a3625d,n317rv,rv10,,
a36874,n319cb,rv10,,
a6fdff,n55km,rv10,,
a3d821,n347jk,rv10,,
a4599b,n38gv,rv10,,
acc2e2,n921lg,rv10,,
aaf241,n804rs,rv10,,
a0c8a0,n15jb,rv10,,
ad076f,n939dm,rv10,,
a014a9,n104mf,rv10,,
a57f99,n4530,rv10,,
a96eb1,n707bj,rv10,,
a506fc,n423cf,rv10,,
a5c4f1,n471bg,rv10,,
acd50a,n926g,rv10,,
abf48c,n87ft,rv10,,
a73274,n563ea,rv10,,
aa718d,n772me,rv10,,
a0ec9a,n159lb,rv10,,
a1f409,n225es,rv10,,
a0ab24,n142lm,rv10,,
ab23b4,n817dm,rv10,,
a0034b,n10kq,rv10,,
add7e5,n991rv,rv10,,
a2642e,n253rv,rv10,,
a2441d,n245rv,rv10,,
a6ebcb,n545pg,rv10,,
a0aaee,n142jh,rv10,,
a3826e,n325rv,rv10,,
a1b446,n209jm,rv10,,
a7f37b,n611lm,rv10,,
a5d506,n475pv,rv10,,
ac975a,n910h,rv10,,
a35263,n313ej,rv10,,
a67494,n515fw,rv10,,
ab9aaa,n847jh,rv10,,
ac2662,n882mm,rv10,,
a342ca,n309ww,rv10,,
ab2120,n816rc,rv10,,
a15978,n1861g,rv10,,
ab5da1,n831s,rv10,,
ad343b,n95vt,rv10,,
a02c8c,n110dp,rv10,,
a2378a,n242bd,rv10,,
a4d578,n410pu,rv10,,
ad9825,n975vt,rv10,,
ab245f,n817lh,rv10,,
a29ba0,n2672d,rv10,,
a0031f,n10hw,rv10,,
a3685c,n319bc,rv10,,
ab52b1,n829ec,rv10,,
a6a6f2,n528da,rv10,,
ac4347,n89da,rv10,,
a4d444,n410bl,rv10,,
aa99f4,n782wm,rv10,,
a00590,n100jv,rv10,,
e4911b,pr-zri,rv10,,
a680de,n518tp,rv10,,
c04d83,c-gdje,rv10,,
a013b6,n104bn,rv10,,
a1e4bd,n221ae,rv10,,
a67b82,n517at,rv10,,
a4d48b,n410eg,rv10,,
a0649b,n124x,rv10,,
a8bd24,n662rf,rv10,,
a54a72,n44yh,rv10,,
e490e2,pr-zpn,rv10,,
a4d5ab,n410rv,rv10,,
a37ee1,n324tm,rv10,,
a97e09,n710wh,rv10,,
a89cef,n654pv,rv10,,
e493c1,pr-zjz,rv10,,
a358e8,n3146s,rv10,,
c04c46,c-gcwz,rv10,,
