icao,regid,mdl,type,operator
a9b330,n724j,svnh,Skykits Savannah VGW,Private owner
c82251,zk-cvk,svnh,ICP Savannah XL,Private owner
48fea3,sp-skzd,svnh,Savannah S,Private owner
31d8f0,i-a139,svnh,ICP Savannah VG,Private owner
00ef13,zu-iiy,svnh,,
31dc8b,i-c360,svnh,,
31dcad,i-c453,svnh,,
39571c,f-jrqg,svnh,,
31dc1a,i-c019,svnh,,
31dc88,i-c353,svnh,,
394f7c,f-jsmd,svnh,,
3944dc,f-jvni,svnh,,
405440,g-cevu,svnh,,
31d89e,i-8709,svnh,,
31dcc2,i-9280,svnh,,
39591c,f-jauh,svnh,,
