icao,regid,mdl,type,operator
39146e,f-gfdo,b06,,
401013,g-lvdc,b06,Bell 206L-3 LongRanger III,Private owner
401158,g-bxns,b06,Bell 206B Jet Ranger III,Sterling Helicopters
401159,g-bxnt,b06,Bell 206B Jet Ranger III,Sterling Helicopters
3dd324,d-hafc,b06,AB-206B JetRanger II,Private owner
3dd33a,d-hafy,b06,Agusta-Bell 206B Jet Ranger II,Private owner
4012bd,g-lbdc,b06,Bell 206B,Private owner
401b03,g-bbor,b06,Bell 206B,Private owner
401e91,g-oagl,b06,Bell 206B Jet Ranger III,Private owner
4020c7,g-blgv,b06,Bell 206B,Private owner
402210,g-jlee,b06,Agusta Bell 206B,Private owner
40259c,g-hany,b06,Agusta Bell 206B,Private owner
4025d6,g-oami,b06,Bell 206B,Private owner
40290c,g-tree,b06,Bell 206B,Private owner
402b1d,g-jrcr,b06,Bell 206L-1,Private owner
402ca4,g-xbox,b06,Bell 206B Jet Ranger III,Private owner
402e6d,g-xxiv,b06,Bell 206B JetRanger III,Private owner
403c93,g-sely,b06,Agusta Bell 206B,Private owner
403e5c,g-bxkl,b06,Bell 206B Jet Ranger III,Private owner
40406a,g-mota,b06,Bell 206B,Private owner
404075,g-bybi,b06,Bell 206B Jet Ranger III,Private owner
404c7b,g-lone,b06,Bell 206L-1,Private owner
405d1e,g-remh,b06,Bell 206B Jet Ranger II,Private owner
406469,g-ruck,b06,Bell 206B Jet Ranger III,Private owner
40659b,g-jaci,b06,Bell 206L-4 LongRanger 4,Morgan Airborne LLP
40684d,g-choa,b06,Bell 206B JetRanger III,Private owner
484597,ph-hhk,b06,Bell 206L-1 LongRanger II,Private owner
4aa9ed,se-jom,b06,Bell 206L-3 LongRanger III,Roslagens Helikopterflyg
4aa9ee,se-jon,b06,Bell 206B Jet Ranger III,Roslagens Helikopterflyg
49d08a,ok-hec,b06,Boeing 737-55S,Czech Airlines
4b3eda,hb-xuw,b06,AB206B,Private owner
4b3f20,hb-xxo,b06,Bell 206B-3 JetRanger 3,Airport Helicopter AHB AG
4e787a,vh-nxz,b06,Bell 206B JetRanger III,Private owner
49d341,ok-mnp,b06,Cirrus SR22T,Private owner
7c06a5,vh-blj,b06,Bell 206B JetRanger III,Private owner
7c144d,vh-ean,b06,Bell 206B JetRanger II,Private owner
7c28f4,vh-idi,b06,Bell 206L-3 LongRanger III,Private owner
7c352b,vh-ksd,b06,Bell 206B JetRanger III,Private owner
7c4254,vh-ndy,b06,Bell 206B JetRanger III,Australian Helicopters
7c4525,vh-nxz,b06,Bell 206B JetRanger III,Private owner
7c6fad,vh-wcf,b06,Bell 206B JetRanger III,Private owner
7c75be,vh-xjk,b06,Bell 206B JetRanger III,Private owner
7c75c4,vh-xjq,b06,Bell 206B,Private owner
7cf8e1,a17-049,b06,Bell OH-58A kiowa,Royal Australian Army
7cf8e4,a17-051,b06,Bell OH-58A Kiowa,Australian Army
7cf906,a17-026,b06,Bell 206B-1 Kiowa,Australian Army
841b45,ja07kp,b06,Bell 206L-4 LongRanger IV,Kanagawa Prefectural Police
a02271,n108ae,b06,Bell 206L-1 LongRanger II,Private owner
a0047c,n10xv,b06,Bell 206-L4,Private owner
a00870,n101ae,b06,Bell 206L-1 LongRanger II,Private owner
a01519,n104rt,b06,Bell 206L-3 LongRanger III,Private owner
a0174c,n105ae,b06,Bell 206L-1 LongRanger II,Private owner
a04f40,n119sp,b06,Bell 206L-4 LongRanger IV,Minnesota Department of Public
a0515e,n12ae,b06,Bell 206L-1 LongRanger II,Air Evac EMS
a05181,n12bq,b06,Bell 206L-4 LongRanger IV,Private owner
a0576e,n121ae,b06,Bell 206L-1 LongRanger II,Private owner
a07b36,n130ae,b06,Bell 206L-1 LongRanger II,Air Evac EMS
a0d049,n1510l,b06,Bell 206B,City of Dallas
a0d06c,n1511l,b06,Bell 206B,City of Dallas
a046ed,n117hk,b06,Bell 206B,Private owner
a049f0,n118ae,b06,Bell 206L-1 LongRanger II,Air Evac EMS
a04a05,n118ba,b06,Bell 206A,Private owner
a0865b,n133ae,b06,Bell 206L-1 LongRanger II,Private owner
a08a12,n134ae,b06,Bell 206L-1 LongRanger II,Private owner
a09ca5,n139ae,b06,Bell 206L-1 LongRanger II,Private owner
a0a19a,n14ny,b06,Bell 206L-4 LongRanger IV,Private owner
a0a5a9,n1404w,b06,Bell 206B,Private owner
a05f94,n123hp,b06,Bell 206L-1 LongRanger II,Private owner
a067ef,n125ta,b06,Bell 206B,Private owner
a165d7,n19ae,b06,Bell 206L-1 LongRanger II,Air Evac EMS
a10f15,n16770,b06,Bell 206B,Private owner
a07526,n129ae,b06,Bell 206L-1 LongRanger II,Private owner
a16f9e,n192ae,b06,Bell 206L-1 LongRanger II,Private owner
a193e0,n200vb,b06,Bell 206B,City of Virginia Beach Police
a12f7c,n176ae,b06,Bell 206L-1 LongRanger II,Private owner
a1c5f0,n213pd,b06,Bell 206B JetRanger II,Private owner
a18d60,n2aq,b06,Bell 206-L4,Private owner
a18d79,n2bq,b06,Bell 206B-Iii,Private owner
a1a8b9,n206eh,b06,Bell 206L-3 LongRanger III,Private owner
a1a925,n206jr,b06,Bell 206B,Private owner
a1d15c,n216s,b06,Bell 206L-1 LongRanger II,Air Evac EMS
a1b502,n209s,b06,Bell 206B,Private owner
a23772,n242ae,b06,Bell 206L-1 LongRanger II,Air Evac EMS
a1f0c0,n224kb,b06,Bell OH-58,Pasadena Police Depatment
a1f422,ae-365,b06,Bell 206B JetRanger III,Argentine Army
a20173,n22823,b06,Bell 206B,Private owner
a24dbc,n248ae,b06,Bell 206L-3 LongRanger III,Air Evac EMS
a25173,n249ae,b06,Bell 206L-1 LongRanger II,Air Evac EMS
a26ab9,n255gt,b06,Bell 206L-3 LongRanger III,Private owner
a2753b,n258ae,b06,Bell 206L-1 LongRanger II,Air Evac EMS
a29903,n267ae,b06,Bell 206L-1 LongRanger II,Air Evac EMS
a2a071,n269ae,b06,Bell 206L-3 LongRanger III,Private owner
a2c019,n2767f,b06,Bell 206B,Private owner
a2c082,n277ae,b06,Bell 206L-3 LongRanger III,Air Evac EMS
a2cba7,n28ae,b06,Bell 206L-3 LongRanger III,Air Evac EMS Inc.
a2ebb8,n288ae,b06,Bell 206L-3 LongRanger III,Air Evac EMS
a2f326,n29ae,b06,Bell 206L-3 LongRanger III,Air Evac EMS
a2f57f,n290ae,b06,Bell 206L-3 LongRanger III,Air Evac EMS
a30812,n295ae,b06,Bell 206L-3 LongRanger III,Air Evac EMS
a30bc9,n296ae,b06,Bell 206L-1 LongRanger II,Air Evac EMS
a3361d,n306fd,b06,Bell 206B,City of Los Angeles
a3362e,n306fw,b06,Bell 206B,Private owner
a33659,n306hp,b06,Bell OH-58A,Private owner
a336e5,n306pd,b06,Bell 206B,City of Tucson
a33dc7,n308hp,b06,Bell OH-58A,Private owner
a3417e,n309hp,b06,Bell OH-58A,North Carolina Highway Patrol
a3448a,n31at,b06,Bell 206B,Private owner
a30fae,n297ca,b06,Bell 206B,Private owner
a2dd0a,n284ca,b06,Bell 206B,Private owner
a2de67,n284s,b06,Bell 206B,Private owner
a2e093,n285ae,b06,Bell 206L-3 LongRanger III,Air Evac EMS
a32a7c,n303ae,b06,Bell 206L-1 LongRanger II,Air Evac EMS
a3849c,n326ab,b06,Bell 206L-3 LongRanger III,Private owner
a3332e,n305pd,b06,Bell 206B,City of Tucson
a35969,n315ae,b06,Bell 206L-1 LongRanger II,Air Evac EMS
a3648e,n318ae,b06,Bell 206L-3 LongRanger III,Private owner
a36845,n319ae,b06,Bell 206L-4 LongRanger IV,Air Evac EMS
a36cef,n32ky,b06,Bell 206B,Private owner
a3a4b0,n334ae,b06,Bell 206L-3 LongRanger III,Air Evac EMS
a49561,n395ae,b06,Bell 206L-1 LongRanger II,Air Evac EMS
a4c057,n405mr,b06,Bell 206L-4,Private owner
a4c338,n406db,b06,Bell 206B,University of North Dakota
a4c40e,n406mr,b06,Bell 206L-4,Private owner
a4ca5e,n408ae,b06,Bell 206L-4 LongRanger IV,Private owner
a4f436,n4180f,b06,Bell 206L-3 LongRanger III,PHI Inc
a4b354,n4014z,b06,Bell 206-L4,California Highway Patrol
a43367,n37wa,b06,Bell 206B JetRanger III,Private owner
a5396d,n436ae,b06,Bell 206L-4 LongRanger IV,Private owner
a53d24,n437ae,b06,Bell 206L-4 LongRanger IV,Private owner
a55d35,n445ae,b06,,
a564a3,n447ae,b06,Bell 206L-4 JetRanger IV,Private owner
a56649,ae-364,b06,Bell 206B JetRanger III,Argentine Army
a5a87c,n464ae,b06,Bell 206L-4 LongRanger IV,Private owner
a5e6a5,n48ea,b06,Bell 206L-3 LongRanger III,Private owner
a504a3,n422sf,b06,Beech B60 Duke,Private owner
a6101d,n490ae,b06,Bell 206L-4 LongRanger IV,Air Evac EMS
a61218,n490wm,b06,Bell 206B,South Florida Water Management
a636ea,n5tc,b06,Bell 206B,City of Atlanta
a636fb,n5tv,b06,Bell 206B,Private owner
a68423,n519p,b06,Bell OH-58A,St.Johns County Sheriffs Offic
a713af,n555th,b06,Beech V35B Bonanza,Private owner
a6ae19,n53ae,b06,Bell 206L-1 LongRanger II,Air Evac EMS
a74fae,n570p,b06,Bell 206B JetRanger III,Private owner
a6f1f2,n547ae,b06,American Eurocopter AS350B3,PHI Inc
a6fead,n55sl,b06,Bell 206L-4,Private owner
a7716c,n579sd,b06,Bell 206B,Private owner
a7c6ca,n60vj,b06,Bell 206L-3 LongRanger III,Sacramento Helicopters Executi
a7fd99,n614,b06,Bell 206B,Seminole Tribe of Florida
a83c5d,n63l,b06,Bell 206-L4,Private owner
a81387,n6197n,b06,Bell 206-L4,California Highway Patrol
a815a1,n62tv,b06,Bell 206L-4 LongRanger IV,Private owner
a88baf,n65pj,b06,Bell 206L-3 LongRanger III,Private owner
a863ac,n64jb,b06,Bell 206B JetRanger III,Private owner
a900e3,n68ae,b06,Bell 206L-1,Private owner
a97cca,n710hp,b06,Bell 206B,State of Tennessee
aa196d,n75tv,b06,Bell 206L-4 LongRanger IV,Private owner
a9c90b,n73dp,b06,Bell 206B,Private owner
aab6fa,n79pj,b06,Bell 206L-3 LongRanger III,Private owner
aade5d,n8nf,b06,Bell 206B,City of Pasadena
aadf19,n8vu,b06,Bell 206B,Private owner
ab5194,n82844,b06,Bell OH-58C,Orange County Sheriffs office
ab5803,n86wp,b06,Bell 206L-3 LongRanger III,City of Los Angeles
ac6aa2,n9bq,b06,Bell 206-L4 LongRanger IV,Private owner
ac6c45,n9uj,b06,Bell 206-L4,Private owner
ad9049,n973rh,b06,Bell 206B-III,Republic Helicopters
ada908,n98cl,b06,Bell 206-L4,Private owner
ad340b,n95tv,b06,Bell 206L-4 LongRanger IV,Private owner
add28a,n99za,b06,Bell 206B,Private owner
ad829a,n97pj,b06,Bell 206L-3 LongRanger III,Private owner
c80963,zk-hqr,b06,Bell 206B JetRanger II,Private owner
c81a17,zk-hiq,b06,Bell 206B JetRanger II,Private owner
a950b4,n7jr,b06,Bell 206B,Citrus County Mosquito Control District
7c5c26,vh-shk,b06,Bell 206L-1 LongRanger III,Private owner
4b3f2a,hb-xxy,b06,Bell	Jet Ranger III 206B,CHS Central Helicopter Services AG
402634,g-osmd,b06,Bell 206B Jet Ranger II,Private owner
a55dfa,n445jb,b06,Bell 206B,Private owner
a008bd,n101dg,b06,Bell 206B,Private owner
a2d1b7,n281ae,b06,Bell 206L-3 LongRanger III,Air Evac EMS
a1a9d9,n206rw,b06,Bell 206B-III,US Dept of Interior
ad59d2,n96ae,b06,Bell 206L-1 LongRanger II,Private owner
a2b55d,n274ae,b06,Bell 206L-1 LongRanger II,Air Evac EMS
a4d360,n41sj,b06,Bell 206B,Private owner
a893a5,n6516k,b06,Bell 206L-3 LongRanger III,Private owner
a1f399,n225ae,b06,Bell 206L-1 LongRanger II,Private owner
3e228e,vh-nxc,b06,Bell 206B,Private owner
a32424,n301mh,b06,Bell 206B,Maritime Helicopters
403248,g-ewaw,b06,Bell 206B,Private owner
a3afd5,n337ae,b06,Bell 206L-1 LongRanger II,Air Evac EMS
404a7a,g-suey,b06,Bell 206L Long Ranger,Aerospeed Ltd
7c5c1c,vh-sha,b06,Bell 206L-4 LongRanger IV,Private owner
a143f9,n1807,b06,Bell 206L-4 LongRanger IV,Private owner
7c450e,vh-nxc,b06,Bell 206B,Private owner
7c58c0,vh-rte,b06,Bell 206B JetRanger III,Private owner
7c8045,vh-zmf,b06,Bell 206L-1 LongRanger II,Blue Sky Helicopters
406306,g-vvbo,b06,Bell 206L-3,Private owner
40384f,g-bvga,b06,Bell 206B Jet Ranger III,Private owner
40516e,g-tegs,b06,Bell 206B,Private owner
4b4330,hb-zlo,b06,Bell 206B,Heliswiss
a1a516,n205fc,b06,Bell 206L-3 LongRanger III,PHI Inc
7c0d89,vh-cyj,b06,Bell 206L-3 LongRanger III,Rotorwest
7c063d,vh-bin,b06,Bell 206B JetRanger II,Rotorwest
40298c,g-dofy,b06,Bell 206B Jet Ranger II,Private owner
7c81bd,vh-zvw,b06,Bell 206,Private owner
a864be,n64va,b06,Bell 206L-3 LongRanger III,Private owner
49d351,ok-gtm,b06,Bell	206B JetRanger 3,Erwin Junker Grinding Technology as
40105b,g-mfmf,b06,Bell 206B Jet Ranger III,Private owner
a19167,n20tv,b06,Bell 206L Long Ranger,Private owner
7c05ab,vh-bel,b06,Bell 206B JetRanger II,Private owner
4030ee,zt-rgg,b06,Bell 206B Jet Ranger III,Private owner
403fd9,g-fezz,b06,Bell 206B Jet Ranger II,Private owner
a7c45a,n6ul,b06,Bell 206L Long Ranger,Private owner
a7f714,n612kg,b06,Bell 206B,Private owner
4031c6,g-lily,b06,Bell 206B,Private owner
a1a86d,n206bg,b06,Bell 206B JetRanger II,Stanislaus County Sheriffs Department
49d308,ok-hce,b06,Bell 206B JetRanger III,Private owner
a1a8cd,n206fc,b06,Bell 206L-4 LongRanger IV,Private owner
a3b035,ae-366,b06,Bell 206B JetRanger III,Argentine Army
404a49,g-keth,b06,Agusta Bell 206B,Private owner
a098ee,n138ae,b06,Bell 206L-1 LongRanger II,Private owner
a2fd09,n292bh,b06,Bell 206B,Private owner
a1a9e4,n206sg,b06,Bell 206L-4 LongRanger IV,Private owner
c04ab3,c-gchm,b06,Bell 206L LongRanger,Canada-Department of Transport
7c06ad,vh-blr,b06,Bell 206B JetRanger II,Private owner
405092,g-enes,b06,Bell 206B,Private owner
c07a3b,c-guhm,b06,Bell 206B,Private owner
7c00c9,vh-afv,b06,Bell 206B JetRanger III,Private owner
461371,oh-hjl,b06,Bell 206B JetRanger,Copterway
3deadf,d-hjet,b06,Bell 206B JetRanger III,Private owner
a00fde,n103ae,b06,Bell 206L-1 LongRanger II,Private owner
7c75c1,vh-xjn,b06,Bell 206 B3,Becker Helicopter Services
a300a4,n293ae,b06,Bell 206L-3 LongRanger III,Air Evac EMS
c05bc7,c-gitq,b06,Bell 206B,Private owner
a229f4,n239ae,b06,Bell 206L-1 LongRanger II,Air Evac EMS
3e0de1,d-hwll,b06,Bell 206B JetRanger III,Private owner
7c6fb1,vh-wcj,b06,Agusta Bell 206B3,Becker Helicopter Service
a2d56e,n282ae,b06,Bell 206L-3 LongRanger III,Air Evac EMS
c0571b,c-ggzq,b06,Bell 206,Private owner
aae5d1,n801cl,b06,Bell 206L-1 LongRanger II,Private owner
a0f277,n160ja,b06,Bell 206B JetRanger II,Marks Aviation
403d51,g-ontv,b06,Bell 206B Jet Ranger II,Private owner
4065d3,g-nork,b06,Bell 206B,Private owner
aaedcc,n803jb,b06,Bell 206B,Private owner
aab5b1,n79ae,b06,Bell 206L-1 LongRanger II,Private owner
7cf90e,a17-038,b06,Agusta Bell 206B1,Australian Army
a9017b,n68gg,b06,Bell 206B,Private owner
a1a995,n206pc,b06,Bell 206B,Private owner
a1fe18,n2275q,b06,Bell 206B,Private owner
acad9c,n916gs,b06,Bell 206B,Private owner
a34a2b,n3107n,b06,Bell 206L-3 LongRanger III,PHI Inc
7cf8e7,a17-017,b06,Bell OH-58A Kiowa,Australian Army
863b94,ja6956,b06,Bell 206L-4 LongRanger IV,Osaka Prefectural Police
a3d168,n345rr,b06,Bell 206B,Private owner
a4a8d1,n4ka,b06,Bell 206B-III,Private owner
a7e2b8,n607ra,b06,Bell 206B,Private owner
a6ec10,n545sa,b06,Bell 206L-3 LongRanger III,Private owner
a7ec6a,n61ae,b06,Bell 206L-1 LongRanger II,Private owner
a0b349,n144tv,b06,Bell 206L-1 LongRanger II,Private owner
a20825,n23wk,b06,Bell 206B,Private owner
ac1d26,n88ta,b06,Bell 206B,Private owner
c0771e,c-gtcv,b06,Bell 206B JetRanger III,TransCanada PipeLines
403eba,g-newz,b06,Agusta Bell 206B,Readypower Engineering
a64e40,n505tv,b06,Bell 206B,Private owner
a078ea,n13at,b06,Bell 206B,Private owner
a7b626,n59604,b06,Bell 206B,Private owner
ac6c5b,n9vf,b06,Bell 206B,Private owner
a77c9c,n58140,b06,Bell 206B,Private owner
a63d04,n5005n,b06,Bell 206B,Private owner
aade8d,n8qd,b06,Bell 206B,Private owner
a63e6a,n501hv,b06,Bell 206B,Private owner
c0566c,c-ggsx,b06,Bell 206B,Private owner
a2919b,n265al,b06,Bell 206L-4 LongRanger IV,Bristow US
402d20,g-oeti,b06,Bell 206B Jet Ranger III,Private owner
a27e61,n26tv,b06,Bell 206B,Private owner
a31aeb,n3d,b06,Bell 206B,Private owner
a4818d,n39mk,b06,Bell 206B,Private owner
adc9d8,n988lb,b06,Bell 206B,Private owner
7cf8dd,a17-011,b06,Bell OH-58A Kiowa,Royal Australian Air Force
a293e8,n2650,b06,Bell 206B,Private owner
a0f568,n161ac,b06,Bell 206B,Private owner
aae65e,n801jb,b06,Bell 206B,Private owner
7c4521,vh-nxv,b06,Agusta Bell 206B,Becker Helicopters
a96adb,n706ac,b06,Bell 206B,Private owner
a1a990,n206ny,b06,Bell 206B,Private owner
a60f7c,n49tv,b06,Bell 206B,Private owner
a0c92c,n15ps,b06,Bell 206B,Private owner
a85f05,n63888,b06,Bell 206B-III,Private owner
3df8ce,d-holy,b06,Bell 206 Jet Ranger,MHS Helicopter Flugservice
a64115,n50178,b06,Bell 206B,Private owner
a6fee2,n55up,b06,Bell 206B,Private owner
a4d240,n41ew,b06,Bell 206B,Private owner
ac6fe3,n900hh,b06,Bell 206B,Private owner
a1678f,n19tv,b06,Bell 206B,Private owner
3e081a,d-hugo,b06,Bell	206B JetRanger 3,Jetline Aero
a6bd0a,n533ra,b06,Bell 206B,Private owner
a22b45,n239ps,b06,Bell OH-58A Kiowa,Pasadena Police Department
a3006d,n2928w,b06,Bell 206B,Private owner
404fd3,g-dstn,b06,Bell 206L,Private owner
a8146d,n62fm,b06,Bell 206B,Private owner
a6cc17,n537t,b06,Bell 206B,Private owner
403d20,g-bxay,b06,Bell 206B,Private owner
a0110e,n103nj,b06,Bell 206A,Private owner
a04a7d,n118fw,b06,Bell 206B,Florida Fish & Wildlife Conservation Commission
a3ea03,n351rh,b06,Bell 206B JetRanger III,Private owner
40124e,g-spey,b06,Bell 206B Jet Ranger II,Private owner
a4f1dd,n418ae,b06,Bell 206L-4 LongRanger IV,Private owner
a1a502,n205eh,b06,Bell 206L-3,Sacramento Executive Helicopters
a97a6f,n71hm,b06,Bell 206L-4 LongRanger IV,Private owner
a31894,n299tb,b06,Bell 206B,Private owner
ac6d10,n90cl,b06,Bell 206B,Private owner
7cf908,a17-016,b06,Bell OH-58A Kiowa,Australian Army
a213aa,n233ae,b06,Bell 206L-3 LongRanger III,Air Evac EMS
a1a926,n206js,b06,Bell 206B,Private owner
a8da5e,n67le,b06,Bell OH-58C,City of Wilmington Police Department
a34f15,n312jp,b06,Bell 206B,City of Jacksonville
a2057d,n2295f,b06,Bell 206B,Private owner
a9c8be,n73am,b06,Bell 206B,Private owner
c08224,c-gxhj,b06,Bell 206L-1 LongRanger II,Helijet International
a01b03,n106ae,b06,Bell 206L-1 LongRanger II,Private owner
a1cbc4,n21470,b06,Bell 206B,Private owner
4b43a3,hb-zpz,b06,Agusta Bell AB206-B-3,Airport Helicopter AHB
a7afb2,n59479,b06,Bell 206B,Private owner
404990,g-limo,b06,Bell 206L-1 LongRanger II,Private owner
ab4f43,n828ha,b06,Bell 206B,Private owner
7c48b8,vh-one,b06,Bell 206B JetRanger II,Private owner
a29a26,n267mw,b06,Bell 206B,Private owner
400c7a,g-jetx,b06,Bell 206B,Private owner
ac54e0,n894ha,b06,Bell 206B,Private owner
a28452,n261sp,b06,Bell 206B,Private owner
a83c78,n63mb,b06,Bell 206B,Private owner
ad97f1,n975tr,b06,Bell 206B,Private owner
7c2a1e,vh-ils,b06,Bell 206B JetRanger III,Private owner
a1a901,n206he,b06,Bell 206B,Private owner
a63734,n5wb,b06,Bell 206B,Private owner
401ca7,g-bewy,b06,Bell 206B Jet Ranger II,Private owner
a0516b,n12at,b06,Bell 206B,Private owner
abed59,n868jb,b06,Bell 206B,Private owner
a1a98c,n206nu,b06,Bell 206B,Private owner
403972,g-toyz,b06,Bell 206B Jet Ranger III,Private owner
a4d826,n411dd,b06,Bell 206B,Private owner
7c1794,vh-exy,b06,Bell 206B JetRanger III,Private owner
7c4522,vh-nxw,b06,Agusta Bell 206B3,Becker Helicopter Service
402424,g-hele,b06,Bell 206B,Private owner
a08bef,n134vg,b06,Bell 206B,Private owner
a80ef2,n6181a,b06,Bell 206B,Private owner
a3ac1e,n336ae,b06,Bell 206L-4 LongRanger IV,Private owner
404bf9,g-stvz,b06,Bell 206B Jet Ranger III,Mediatech Consulting
abe5d0,n866h,b06,Bell 206B,Private owner
406d5c,g-clij,b06,Bell 206B Jet Ranger III,Apple International
a1be34,n211la,b06,Bell 206B,County of Los Angeles
a2bf86,n27629,b06,Bell 206B,Private owner
a04da7,n119ae,b06,Bell 206L-3 LongRanger III,Private owner
aa69c4,n770hp,b06,Bell 206B,Private owner
a1a89e,n206df,b06,Bell 206B,Private owner
401ea8,g-xxbh,b06,Bell 206B JetRanger III,Private owner
a8f54a,n67665,b06,Bell 206B,Private owner
7cf8e5,a17-037,b06,Bell 206B-1 Kiowa,Australian Army
a024d1,n1080n,b06,Bell 206B-III,Private owner
a40b10,n36mk,b06,Bell 206B,Executive Helicopters
aa8e39,n78am,b06,Bell 206B,Private owner
a76595,n576ka,b06,Bell 206B,Private owner
478755,ln-oye,b06,Bell 206B JetRanger III,Private owner
403f89,g-bxuf,b06,Agusta Bell 206B,Private owner
a63c4a,n5000b,b06,Bell 206L-3 LongRanger III,Private owner
a1016b,n164k,b06,Bell 206B,Private owner
402dc6,g-igis,b06,Bell 206B,Private owner
a20db9,n231rl,b06,Bell 206B,Private owner
a1a89f,n206dg,b06,Bell 206B,Private owner
ac7d0e,n90326,b06,Bell 206B,Private owner
a18692,n198h,b06,Bell 206B,Private owner
a3eec8,n3521t,b06,Bell 206B,Private owner
a6d5e3,n54de,b06,Bell 206B,Private owner
402542,g-suet,b06,Agusta Bell 206B,Aerospeed
49d31c,ok-jlt,b06,Bell 206B JetRanger III,Private owner
7cf8df,a17-036,b06,Bell 206B-1 Kiowa,Australian Army
a64709,n503w,b06,Bell 206B,Private owner
a1abd3,n2068x,b06,Bell 206B,Private owner
a38856,n327ae,b06,Bell 206L-3 LongRanger III,Air Evac EMS
a6b42b,n531ag,b06,Bell 206B,Private owner
a7f62b,n612,b06,Bell 206B-III,Private owner
a7c634,n60pj,b06,Bell 206B,Private owner
a8f926,n67777,b06,Bell 206B,Private owner
adf6dd,n9993k,b06,Bell 206B,Private owner
7c3844,vh-lee,b06,Bell 206L-3 JetRanger III,Private owner
a1a9db,n206ry,b06,Bell 206B,Private owner
4408ba,oe-xhf,b06,Bell 206B JetRanger III,Hubi-Fly
aba678,n85rb,b06,Bell 206B,Private owner
c07cfd,c-gviq,b06,Bell 206L-1 LongRanger II,Helijet International
a37d6a,n324cm,b06,Bell 206B,Private owner
a192c2,n200hr,b06,Bell 206B,Private owner
a531b7,n4338d,b06,Bell 206L-3 LongRanger III,Private owner
ac1c2e,n88hc,b06,Bell 206B,Private owner
a80dbe,n618pc,b06,Bell 206B,Private owner
a81596,n62tj,b06,Bell 206B,Private owner
a71351,n555pp,b06,Bell 206B,Private owner
a760a7,n5747w,b06,Bell 206B,Private owner
a1a9e3,n206sf,b06,Bell 206B,Private owner
a242a2,n245ar,b06,Bell 206B,Private owner
a4d906,n411nc,b06,Bell 206B,Private owner
a9ab1b,n722bh,b06,Bell 206B-III,Private owner
a336e9,n306ph,b06,Bell 206L-1 LongRanger II,PHI Inc
a01512,n104rl,b06,Bell 206B,Private owner
a6e4a2,n543sa,b06,Bell 206B,Private owner
40202b,g-bekw,b06,Bell 206B,Private owner
a01813,n105jd,b06,Bell 206B,Private owner
a1a890,n206cs,b06,Bell 206B,Private owner
aca352,n913rl,b06,Bell 206B,Private owner
a06b94,n126sh,b06,Bell 206B,Private owner
a0ba98,n146sp,b06,Bell 206L-3B06 LongRanger III,Private owner
a6efc7,n546sa,b06,Bell 206B,Private owner
a1481b,n182aa,b06,Bell 206B,Private owner
a55888,pt-ynb,b06,Bell B206L-4,Private owner
a32452,n301pd,b06,Bell 206B,Private owner
a59eca,n461ra,b06,Bell 206L-1 LongRanger II,Private owner
a7c54b,n60ea,b06,Bell 206B,Private owner
a19bd9,n2020r,b06,Bell 206B,Private owner
49d2f3,ok-pvi,b06,Bell 206B JetRanger III,Private owner
a0236d,n108lg,b06,Bell 206B,Private owner
a1a883,n206cd,b06,Bell 206B,Private owner
ac1c7e,n88lh,b06,Bell 206B,Private owner
a1aa6b,n206xs,b06,Bell 206B,Private owner
a02234,n1078q,b06,Bell 206B,Private owner
a1efce,n2239w,b06,Bell 206A,Private owner
3e0e56,d-hwpy,b06,,
a57eb9,n453ra,b06,,
a8d99c,n67cl,b06,Beech C90 King Air,Private owner
a1adc1,n207tv,b06,Bell 206B,Private owner
a33300,n305mh,b06,Bell 206L-4 LongRanger IV,Maritime Helicopters
a082a4,n132ae,b06,Bell 206L-1 LongRanger II,Private owner
a7c58c,n60gr,b06,Bell 206B,Private owner
a639bf,n50yb,b06,Bell 206B,Private owner
ac9c1f,n911tv,b06,Bell 206B,Private owner
a2a428,n27ae,b06,Bell 206L-1 LongRanger II,Air Evac EMS
a489d4,n3917g,b06,Bell 206B,Private owner
ab57c3,n83u,b06,,
ab638b,n833am,b06,,
a07a11,n13nn,b06,,
a1a86b,n206be,b06,,
a6af28,n53ma,b06,Bell 206B,Private owner
a9848e,n712m,b06,,
4048e6,g-topm,b06,,
a355b2,n314ae,b06,,
a17fba,n196p,b06,,
7c6a8b,vh-vbx,b06,,
a2bc47,n2756p,b06,Bell 206B,Private owner
add925,n9913k,b06,Bell 206B,Private owner
7c2e6c,vh-jge,b06,,
a81450,n62eh,b06,Bell 206B,Private owner
a02a5f,n11fh,b06,Bell 206B,Private owner
a9022b,n68ph,b06,Bell 206B,Private owner
a00352,n10kx,b06,Bell 206B,Private owner
a1a9f7,n206ta,b06,Bell 206B,Private owner
a1a87b,n206bw,b06,,
a4fa5c,n42mc,b06,,
7c450d,vh-nxb,b06,,
c00225,c-favc,b06,,
45a209,oy-hpi,b06,,
c0213f,c-fmpi,b06,,
ac95fc,n91ta,b06,,
a4fae1,n42sl,b06,,
a1febe,n228ae,b06,,
7c115e,vh-dps,b06,,
a9520b,n7yj,b06,,
7c1c30,vh-fuq,b06,,
abcd10,n86fw,b06,,
a27dcb,n26mv,b06,,
7c2f9e,vh-jow,b06,,
a1d43c,n217hk,b06,,
c820db,zk-ind,b06,,
aa49f3,n762lc,b06,,
a63d6d,n5008n,b06,,
a862e4,n64ab,b06,,
a15bdd,n187nd,b06,,
a74e4f,n57z,b06,,
a97bb6,n71wp,b06,,
4033ef,g-bthy,b06,,
ad4535,n954tj,b06,,
a96147,n703sd,b06,,
a32b34,n303hp,b06,,
a1a0d9,n20395,b06,,
7c75b4,vh-xja,b06,,
ac6bdc,n9qd,b06,,
a8daad,n67pj,b06,,
a97028,n707sj,b06,,
a00196,n1sd,b06,,
a45922,n38bz,b06,,
ade86a,n9956k,b06,,
aae2a7,n800jb,b06,,
7c2f88,vh-joa,b06,,
ac4448,n89ph,b06,,
a35204,n313ap,b06,,
a4cb7c,n408mr,b06,,
7c4e6a,vh-prw,b06,,
a32e68,n304ch,b06,,
7c0bc4,vh-cly,b06,,
a1a9de,n206sa,b06,,
ac9b0c,n911gv,b06,,
7c67f7,vh-utl,b06,,
a83cfb,n63sh,b06,,
a8de74,n67025,b06,,
aaf715,n8052g,b06,,
a1b851,n21mw,b06,,
7c0b90,vh-cki,b06,,
a8f570,n67678,b06,,
403c51,g-clay,b06,,
a1a872,n206bm,b06,,
a5e645,n48ae,b06,,
a4b0ea,n401fw,b06,,
a499ec,n396js,b06,,
a6fe4b,ae-368,b06,,
aab57b,n7898x,b06,,
7c2b38,vh-itm,b06,,
a5977f,n46cl,b06,,
4aa90f,se-jho,b06,,
a10bb2,n167ac,b06,,
a1a8c2,n206es,b06,,
a2796c,n259fb,b06,,
a63b2c,n500nr,b06,,
a636b0,n5qv,b06,,
a51299,n426ha,b06,,
49d38e,ok-bwr,b06,,
ac9c09,n911sy,b06,,
a602b6,n487bc,b06,,
a44ba9,n376sd,b06,,
402d8b,g-ocfd,b06,,
a6b054,n53za,b06,,
a7172c,n556r,b06,,
c045e0,c-galz,b06,,
ac955e,n91lt,b06,,
c04ab8,c-gchr,b06,,
acaad2,n915sd,b06,,
a4bc9e,n404mp,b06,,
a25546,n25bh,b06,,
aadd3e,n8au,b06,,
a67422,n515bg,b06,,
a63746,n5wv,b06,,
ac9a7c,n911ba,b06,,
a2dcda,n284ac,b06,,
ad8203,n97hh,b06,,
a4d984,n411td,b06,,
ab5709,n83lp,b06,,
a57028,n45ea,b06,,
a629a5,n49660,b06,,
a3f8fe,n355sp,b06,,
a3fcb5,n356sp,b06,,
a3ef0e,n3523t,b06,,
a8c45e,n664pd,b06,,
a18dd5,n2fg,b06,,
00df90,zt-rgg,b06,,
39446d,f-grdn,b06,,
a047d2,n117sp,b06,,
7c6b9a,vh-vjg,b06,,
300322,i-freb,b06,,
a2a520,n27lc,b06,,
440540,oe-xrb,b06,,
adedf5,n997pm,b06,,
49d2bf,ok-bel,b06,,
a11fc8,n1714,b06,,
a1aa0b,n206tw,b06,,
4b3d11,hb-xdh,b06,,
a31ccf,n3yj,b06,,
a8b6d0,n66013,b06,,
ac9a6a,n911ah,b06,,
a760fa,n57499,b06,,
ab1608,n813rr,b06,,
3df2d7,d-hmff,b06,,
3df2d6,d-hmfe,b06,,
3df911,d-hoon,b06,,
4045ea,g-jgbi,b06,,
7cf904,a17-028,b06,,
a1aa06,n206tr,b06,,
a16d79,n191sg,b06,,
a4b115,n401hp,b06,,
3df68f,d-hnpv,b06,,
3df2d3,d-hmfb,b06,,
ace390,n93cp,b06,,
a706de,n552ae,b06,,
a1df0d,n22ea,b06,,
a7c5e8,n60lh,b06,,
3df2d5,d-hmfd,b06,,
a0c160,n148ky,b06,,
3de95e,d-hipy,b06,,
aba64d,n85pj,b06,,
a34c20,n311sh,b06,,
a1f7ed,n226gm,b06,,
a355c9,n314bc,b06,,
a35adf,n315rd,b06,,
a8a76b,n657ha,b06,,
3df2d2,d-hmfa,b06,,
ad3356,n95lp,b06,,
4d02d1,lx-hrg,b06,,
406fd1,g-ciwh,b06,,
aa4a0f,n762mf,b06,,
3df2d4,d-hmfc,b06,,
a307fe,n2949w,b06,,
a35e18,n316lc,b06,,
adc86e,n98766,b06,,
a11939,n170am,b06,,
a36254,n317rl,b06,,
ac9c28,n911ud,b06,,
a00d57,n102nj,b06,,
a1aa19,n206uk,b06,,
a1a5dc,n205pa,b06,,
a7c3c2,n6nj,b06,,
a862f7,n64aw,b06,,
a6d2d8,n539lb,b06,,
ac9b6a,n911lp,b06,,
ab7dbc,n84ck,b06,,
a4fd21,n420rl,b06,,
acbd1f,n92pj,b06,,
ab0ea9,n811sf,b06,,
aaa34d,n785cb,b06,,
a3b38c,n338ae,b06,,
a003f9,n10sp,b06,,
a01bc9,n106jc,b06,,
a86430,n64pj,b06,,
7c01d6,vh-anc,b06,,
e80956,cc-aep,b06,,
a8f0c5,n67509,b06,,
a8deb6,n67041,b06,,
a34a8d,n311ae,b06,,
ac755b,n90107,b06,,
7c2e7b,vh-jgt,b06,,
ab1f8b,n8159j,b06,,
a3d792,n347cs,b06,,
a3452f,n31hh,b06,,
a9a52c,n720sr,b06,,
a06293,n124ae,b06,,
a6cbb3,n537p,b06,,
0b1234,v3-aha,b06,,
44d863,oo-vcc,b06,,
e80867,cc-aaa,b06,,
a6afa0,n53rw,b06,,
a17143,n192ta,b06,,
add65f,n991ae,b06,,
abe912,n867ch,b06,,
a1da12,n2183y,b06,,
c0060f,c-fchq,b06,,
a1aa2b,n206vc,b06,,
a4e496,n414sk,b06,,
a206ec,n23hx,b06,,
a4e47e,n414rl,b06,,
c04ab9,c-gchs,b06,,
a7777c,n580sd,b06,,
a2d707,n282sp,b06,,
a4e301,n414ae,b06,,
aa97f9,n782ae,b06,,
a6d1e1,n539ae,b06,,
ab5f9b,n83181,b06,,
a18e86,n2nj,b06,,
a83e5b,n630gj,b06,,
a1a95c,n206lw,b06,,
a4c6a6,n407ad,b06,,
a1ce8d,n21507,b06,,
7c43f4,vh-npi,b06,,
a4d314,n41ph,b06,,
a0375d,n113ae,b06,,
a01c47,n106pd,b06,,
a7b02f,n595cc,b06,,
ace07d,n929kc,b06,,
a3a8b9,n335dm,b06,,
a35e36,n316mh,b06,,
a165f3,n19bh,b06,,
aa4051,n76mq,b06,,
398531,f-hbjr,b06,,
a36ae5,n3192g,b06,,
a71d28,n558ae,b06,,
30072f,i-soul,b06,,
aa4079,n76pe,b06,,
a81461,n62f,b06,,
a4b4a1,n402fw,b06,,
a1ab42,n2064s,b06,,
3e000f,d-hrfj,b06,,
a7c633,n60ph,b06,,
ac9bee,n911rw,b06,,
a5e28e,n479ae,b06,,
7c48c5,vh-onr,b06,,
ada693,n979rh,b06,,
7c6651,vh-uhv,b06,,
a21ba5,n235fw,b06,,
7c3121,vh-jzn,b06,,
a3530b,n313mb,b06,,
a1dd8f,n2192,b06,,
7c6356,vh-two,b06,,
a488f2,n39101,b06,,
a1e29f,n220sp,b06,,
a7ac18,n59383,b06,,
7c061a,vh-bho,b06,,
a0b1ad,n144bh,b06,,
a68a01,n520m,b06,,
a540db,n438ae,b06,,
a6e7e6,n544ml,b06,,
a5edca,n481rc,b06,,
a50a80,n424ae,b06,,
ada909,n98cm,b06,,
a370f2,n3202d,b06,,
ac37db,n887ae,b06,,
ad0cb6,n94vm,b06,,
a1ac70,n207eh,b06,,
a7e66f,n608ra,b06,,
a32fcc,n304sp,b06,,
a5b3a1,n467ae,b06,,
a526da,n431ae,b06,,
a130bc,n176p,b06,,
a50a1d,n4237m,b06,,
ad33e8,n95sk,b06,,
a5a638,n463ra,b06,,
a99714,n717lm,b06,,
ac9ae5,n911ff,b06,,
ac9b19,n911hh,b06,,
a793a5,n588ae,b06,,
aa8f45,n78me,b06,,
a5c99b,n472m,b06,,
a02a1b,n11cq,b06,,
a5c4d6,n471ae,b06,,
a7eca2,n61cl,b06,,
