icao,regid,mdl,type,operator
383b2c,f-bozm,d253,Jodel DR-253 Regent,Private owner
38556d,f-bvln,d253,Jodel DR-253B,Private owner
3d075a,d-ebao,d253,Centre Est	DR-253 Regen,
4017ef,g-awyl,d253,CEA DR-253B Regent,Private owner
40186c,g-axwv,d253,Robin DR.253 Regent,Private Owner
3d04f0,d-eacu,d253,Centre Est CEA DR-253B Regent,Private owner
38482c,f-bsbm,d253,Jodel DR-253 B,Private owner
383dc9,f-bpoj,d253,Robin Jodel DR253,Private owner
3d2292,d-elio,d253,,
3844b2,f-brfs,d253,,
