icao,regid,mdl,type,operator
300393,i-adjk,e195,Embraer ERJ-195,Air Dolomiti
300394,i-adjl,e195,Embraer ERJ-195,Air Dolomiti
3003ad,i-adjm,e195,Embraer ERJ-195,Air Dolomiti
3003ae,i-adjn,e195,Embraer ERJ-195,Air Dolomiti
3003af,i-adjo,e195,Embraer ERJ-195,Air Dolomiti
300554,i-adjp,e195,Embraer ERJ-195,Air Dolomiti
300557,i-adjq,e195,Embraer ERJ-195,Air Dolomiti
300558,i-adjr,e195,Embraer ERJ-195,Air Dolomiti
30055b,i-adjs,e195,Embraer ERJ-195,Air Dolomiti
300564,i-adjt,e195,Embraer ERJ-195,Air Dolomiti
34320d,ec-krj,e195,Embraer ERJ-195,Air Europa
3432d6,ec-kxd,e195,Embraer ERJ-195,Air Europa
343347,ec-kyo,e195,Embraer ERJ-195,Air Europa
343348,ec-kyp,e195,Embraer ERJ-195,Air Europa
343495,ec-lcq,e195,Embraer ERJ-195,Air Europa
343542,ec-lek,e195,Embraer ERJ-195,Air Europa
343543,ec-lfz,e195,Embraer ERJ-195,Air Europa
343559,ec-lin,e195,Embraer ERJ-195,Air Europa
343697,ec-lkm,e195,Embraer ERJ-195,Air Europa
3440cd,ec-lkx,e195,Embraer ERJ-195,Air Europa
344146,ec-llr,e195,Embraer ERJ-195,Air Europa
3c5442,d-aebb,e195,Embraer ERJ-195,Lufthansa CityLine
3c5443,d-aebc,e195,Embraer ERJ-195,Lufthansa CityLine
3c55a2,d-aemb,e195,Embraer ERJ-195,Lufthansa CityLine
3c55a3,d-aemc,e195,Embraer ERJ-195,Lufthansa CityLine
3c55a4,d-aemd,e195,Embraer ERJ-195,Lufthansa CityLine
3c55a5,d-aeme,e195,Embraer ERJ-195,Lufthansa CityLine
401229,g-fbef,e195,Embraer ERJ-195,Flybe
40128d,g-fbeg,e195,Embraer ERJ-195,Flybe
401344,g-fbeh,e195,Embraer ERJ-195,Flybe
40543f,g-fbei,e195,Embraer ERJ-195,Flybe
4057f2,g-fbej,e195,Embraer ERJ-195,Flybe
405d66,g-fbem,e195,Embraer ERJ-195,Flybe
405e65,g-fben,e195,Embraer ERJ-195,Flybe
406bb4,g-nsey,e195,Embraer ERJ-195,Aurigny Air Services
424577,vq-bry,e195,Embraer ERJ-195AR,Saratov Airlines
424578,vq-brx,e195,Embraer ERJ-195AR,Saratov Airlines
440820,oe-lwd,e195,Embraer ERJ-195LR,Austrian Airlines
48ada0,sp-lna,e195,Embraer ERJ-195,LOT
48ada1,sp-lnb,e195,Embraer ERJ-195,LOT
48ada2,sp-lnc,e195,Embraer ERJ-195,LOT
48ada3,sp-lnd,e195,Embraer ERJ-195,LOT
48ada4,sp-lne,e195,Embraer ERJ-195,LOT
48ada5,sp-lnf,e195,Embraer ERJ-195,LOT
51007f,ew-399po,e195,Embraer ERJ-195,Belavia
510080,ew-400po,e195,Embraer ERJ-195,Belavia
516091,4o-aoa,e195,Embraer ERJ-195,Montenegro Airlines
516097,4o-aob,e195,Embraer ERJ-195,Montenegro Airlines
516098,4o-aoc,e195,Embraer ERJ-195,Montenegro Airlines
7802d9,b-3247,e195,Boeing 737-71B,China Southern Airlines
780ef4,b-3100,e195,Embraer ERJ-195LR,Tianjin Airlines
780ef5,b-3108,e195,Embraer ERJ-195LR,Tianjin Airlines
738483,4x-ema,e195,Embraer ERJ-195,Arkia Israeli Airlines
7415a1,jy-ema,e195,Embraer ERJ-195,Royal Jordanian
7415a2,jy-emb,e195,Embraer ERJ-195,Royal Jordanian
8a04ee,pk-kda,e195,Embraer ERJ-195LR,KalStar Aviation
e482b9,pr-aya,e195,Embraer ERJ-195,Azul Linhas Aereas
e482ba,pr-ayb,e195,Embraer ERJ-195,Azul Linhas Aereas
e482bb,pr-ayc,e195,Embraer ERJ-195,Azul Linhas Aereas
e4831e,pr-ayd,e195,Embraer ERJ-195,Azul Linhas Aereas
e48387,pr-aye,e195,Embraer ERJ-195,Azul Linhas Aereas
e48616,pr-ayf,e195,Embraer ERJ-195,Azul Linhas Aereas
e48617,pr-ayg,e195,Embraer ERJ-195,Azul Linhas Aereas
e48675,pr-ayh,e195,Embraer ERJ-195,Azul Linhas Aereas
e486bf,pr-ayi,e195,Embraer ERJ-195,Azul Linhas Aereas
e486d1,pr-ayk,e195,Embraer ERJ-195,Azul Linhas Aereas
e486ed,pr-ayl,e195,Embraer ERJ-195,Azul Linhas Aereas
e486ee,pr-aym,e195,Embraer ERJ-195,Azul Linhas Aereas
e48762,pr-ayn,e195,Embraer ERJ-195,Azul Linhas Aereas
e48763,pr-ayo,e195,Embraer ERJ-195,Azul Linhas Aereas
e48826,pr-ayr,e195,Embraer ERJ-195,Azul Linhas Aereas
e48909,pr-ayu,e195,Embraer ERJ-195,Azul Linhas Aereas
e48963,pr-ayv,e195,Embraer ERJ-195,Azul Linhas Aereas
e48994,pr-ayw,e195,Embraer ERJ-195,Azul Linhas Aereas
e489dd,pr-ayx,e195,Embraer ERJ-195,Azul Linhas Aereas
e48a09,pr-ayy,e195,Embraer ERJ-195,Azul Linhas Aereas
e48a55,pr-ayz,e195,Embraer ERJ-195,Azul Linhas Aereas
e48a90,pr-axa,e195,Embraer ERJ-195,Azul Linhas Aereas
e490d3,pr-auh,e195,Embraer ERJ-195AR,Azul Linhas Aereas
e4910c,pr-aui,e195,Embraer ERJ-195AR,Azul Linhas Aereas
e4917e,pr-auj,e195,Embraer ERJ-195AR,Azul Linhas Aereas
e491a8,pr-auk,e195,Embraer ERJ-195AR,Azul Linhas Aereas
e491d6,pr-aum,e195,Embraer ERJ-195AR,Azul Linhas Aereas
e491df,pr-aun,e195,Embraer ERJ-195AR,Azul Linhas Aereas
e49232,pr-auo,e195,Embraer ERJ-195AR,Azul Linhas Aereas
e4925c,pr-aup,e195,Embraer ERJ-195AR,Azul Linhas Aereas
e4926a,pr-auq,e195,Embraer ERJ-195AR,Azul Linhas Aereas
e48afc,pr-axb,e195,Embraer ERJ-195,Azul Linhas Aereas
e48b1e,pr-axc,e195,Embraer ERJ-195,Azul Linhas Aereas
e48b2d,pr-axd,e195,Embraer ERJ-195,Azul Linhas Aereas
e48b80,pr-axe,e195,Embraer ERJ-195,Azul Linhas Aereas
e48b9e,pr-axf,e195,Embraer ERJ-195,Azul Linhas Aereas
e48bf7,pr-axg,e195,Embraer ERJ-195,Azul Linhas Aereas
e48cea,pr-axh,e195,Embraer ERJ-195,Azul Linhas Aereas
e48d42,pr-axi,e195,Embraer ERJ-195,Azul Linhas Aereas
e48d59,pr-axj,e195,Embraer ERJ-195,Azul Linhas Aereas
e48d7e,pr-axk,e195,Embraer ERJ-195,Azul Linhas Aereas
e48dad,pr-axl,e195,Embraer ERJ-195,Azul Linhas Aereas
e48dae,pr-axn,e195,Embraer ERJ-195,Azul Linhas Aereas
e48daf,pr-axo,e195,Embraer ERJ-195,Azul Linhas Aereas
e48e05,pr-axp,e195,Embraer ERJ-195,Azul Linhas Aereas
e48e49,pr-axr,e195,Embraer ERJ-195,Azul Linhas Aereas
e48e7d,pr-axs,e195,Embraer ERJ-195,Azul Linhas Aereas
e48e88,pr-axt,e195,Embraer ERJ-195,Azul Linhas Aereas
e48e99,pr-axu,e195,Embraer ERJ-195,Azul Linhas Aereas
e48eb9,pr-axw,e195,Embraer ERJ-195,Azul Linhas Aereas
e48ede,pr-axx,e195,Embraer ERJ-195,Azul Linhas Aereas
e48efc,pr-axy,e195,Embraer ERJ-195,Azul Linhas Aereas
e48f39,pr-axz,e195,Embraer ERJ-195,Azul Linhas Aereas
e48f6c,pr-aua,e195,Embraer ERJ-195,Azul Linhas Aereas
e48f90,pr-aub,e195,Embraer ERJ-195,Azul Linhas Aereas
e48fd0,pr-auc,e195,Embraer ERJ-195,Azul Linhas Aereas
e49023,pr-aud,e195,Embraer ERJ-195,Azul Linhas Aereas
e49050,pr-aue,e195,Embraer ERJ-195AR,Azul Linhas Aereas
e490b1,pr-auf,e195,Embraer ERJ-195AR,Azul Linhas Aereas
44081d,oe-lwa,e195,Embraer ERJ-195LR,Austrian Airlines
440823,oe-lwg,e195,Embraer ERJ-195LR,Austrian Airlines
780f23,b-3117,e195,Embraer ERJ-195LR,Tianjin Airlines
4059fa,g-fbek,e195,Embraer EMB-195LR,Flybe
405b8c,g-fbel,e195,Embraer ERJ-195LR,Flybe
440829,oe-lwm,e195,Embraer ERJ-195LR,Austrian Airlines
780f24,b-3119,e195,Embraer ERJ-195LR,Tianjin Airlines
440825,oe-lwi,e195,Embraer ERJ-195LR,Austrian Airlines
440827,oe-lwk,e195,Embraer ERJ-195LR,Austrian Airlines
738485,4x-emc,e195,Embraer ERJ-195AR,Arkia Israeli Airlines
0e86d0,pr-ayj,e195,Embraer ERJ-195AR,Azul Linhas Aereas
440828,oe-lwl,e195,Embraer ERJ-195LR,Austrian Airlines
44081e,oe-lwb,e195,Embraer ERJ-195LR,Austrian Airlines
440826,oe-lwj,e195,Embraer ERJ-195LR,Austrian Airlines
781046,b-3143,e195,Embraer ERJ-195LR,Tianjin Airlines
440824,oe-lwh,e195,Embraer ERJ-195LR,Austrian Airlines
7810c9,b-3235,e195,Embraer ERJ-195LR,Tianjin Airlines
78107c,b-3232,e195,Embraer ERJ-195LR,Tianjin Airlines
7810b1,b-3243,e195,,
7810b2,b-3245,e195,,
44081f,oe-lwc,e195,,
44082d,oe-lwq,e195,,
49529a,cs-ttz,e195,,
3006b5,i-adju,e195,,
495297,cs-ttw,e195,,
440821,oe-lwe,e195,,
44082b,oe-lwo,e195,,
44082c,oe-lwp,e195,,
440822,oe-lwf,e195,,
781200,b-3259,e195,,
7810fa,b-3236,e195,,
44082a,oe-lwn,e195,,
495299,cs-tty,e195,,
495298,cs-ttx,e195,,
781145,b-3238,e195,,
7811ff,b-3257,e195,,
781201,b-3263,e195,,
781202,b-3265,e195,,
781203,b-3267,e195,,
738488,4x-emf,e195,,
