icao,regid,mdl,type,operator
0d00de,xa-ran,lj75,Learjet 75,Private owner
0d08d4,xa-mbt,lj75,Learjet 75,Private owner
0d08d5,xa-mbd,lj75,Learjet 75,Private owner
0d08d6,xa-mbu,lj75,Learjet 75,Private owner
0d08d9,xa-ska,lj75,Learjet 75,Private owner
0d0978,xa-mbc,lj75,Learjet 75,Private owner
0d0979,xa-mbs,lj75,Learjet 75,Private owner
0d097a,xa-mbo,lj75,Learjet 75,Private owner
0d097d,xa-uxc,lj75,Learjet 75,Private owner
201019,v5-ron,lj75,Learjet 75,Private owner
39a1a2,f-hinc,lj75,Learjet 75,Private owner
440794,oe-gec,lj75,Learjet 75,Speedwings Executive
488014,sp-aaw,lj75,Learjet 75,Private owner
4d20e4,9h-ddj,lj75,Learjet 75,Global Flight Solutions
a0e558,n157mw,lj75,Learjet 75,Private owner
a15e20,n1878c,lj75,,
a12ce9,n175mx,lj75,Learjet 75,Private owner
a13127,n176tg,lj75,Learjet 75,Private owner
a18e0e,n2hp,lj75,Learjet 75,Private owner
a2b95f,n275de,lj75,Learjet 75,Private owner
a3201d,n300jc,lj75,Learjet 75,Private owner
a3d3d6,n346cm,lj75,Learjet 75,Private owner
a57075,n45hc,lj75,,
a58642,n455sc,lj75,Learjet 75,Private owner
a5c1ad,n470fx,lj75,Learjet 75,Private owner
a5d7f7,n476fx,lj75,Learjet 75,Flexjet
a5dbae,n477fx,lj75,Learjet 75,Flexjet
a5c564,n471fx,lj75,,
a5c91b,n472fx,lj75,Learjet 75,Private owner
a5ccd2,n473fx,lj75,,
a5d089,n474fx,lj75,,
a5d440,n475fx,lj75,,
a5d487,n475jt,lj75,Learjet 75,Private owner
a6242b,n495rj,lj75,Learjet 75,Private owner
a7610c,n575ar,lj75,Learjet 75,Private owner
aa18c1,n75ly,lj75,Learjet 75,Private owner
aa1ec3,n751lj,lj75,Learjet 75,Private owner
aa22ee,n752r,lj75,Learjet 75,Private owner
ab10f3,n812br,lj75,Learjet 75,Private owner
acb4b2,n918dd,lj75,,
ac9e36,n912bd,lj75,,
ad9f26,n977rj,lj75,Learjet 75,Private owner
c002e4,c-fbcl,lj75,Learjet 75,Private owner
c02058,c-fmgl,lj75,Learjet 75,London Air Services
c02fe2,c-fsdl,lj75,Learjet 75,Private owner
c06437,c-glys,lj75,Learjet 75,London Air Services
c03954,c-fvsl,lj75,Learjet 75,London Air Services
0d097e,xa-uxd,lj75,Learjet 75,Private owner
7583de,rp-c629,lj75,Learjet 75,Private owner
