icao,regid,mdl,type,operator
38623b,f-pdoe,mcr4,Dyn'Aero MCR-4S 2002,Private owner
38691b,f-pims,mcr4,Dyn'Aero MCR-4S,Private owner
38739b,f-puss,mcr4,Dyn'Aero MCR-4S,Private owner
38b0fb,f-pgmr,mcr4,Dyn'Aero MCR-4S 2002,Aero Club Pavullo
38b55b,f-padu,mcr4,Dyn'Aero MCR-4S 2002,Private owner
38c75b,f-pcla,mcr4,Dyn'Aero MCR-4S 2002,Private owner
4843f4,ph-pal,mcr4,Dyn'Aero S MCR 4S-2002,Private owner
48459e,ph-sky,mcr4,Dyn'Aero MCR-4S,Private owner
c81e14,zk-psa,mcr4,Dyn Aero MCR 4S,Private owner
484c4a,ph-mtn,mcr4,Dyn'Aero S MCR 4S-2002,Private owner
38c41b,f-pamv,mcr4,Dyn'Aéro MCRS4S-2002,Private owner
3842bb,f-pdap,mcr4,Dyn'Aero MCR-4S,Private Owner
3868fb,f-psol,mcr4,,
386d9b,f-pfdt,mcr4,,
38853b,f-pudi,mcr4,,
4ae303,se-xxc,mcr4,,
38db5b,f-pulf,mcr4,,
