icao,regid,mdl,type,operator
47a599,ln-omw,lama,AÃ©rospatiale SA 315B Lama,Private owner
4b3d94,hb-xii,lama,Aerospatiale Sa315B Lama,Air Zermatt
4b3e7a,hb-xre,lama,Aerospatiale Sa315B Lama,Air-Glaciers
4b3f5a,hb-xzu,lama,Aerospatiale Sa315B Lama,Air-Glaciers
4b3d32,hb-xeo,lama,Aerospatiale Sa315B Lama,Air-Glaciers
4b42d3,hb-zhz,lama,,
