icao,regid,mdl,type,operator
a24f4c,n248se,c25m,Cessna 525 CitationJet M2,Private owner
aa679c,n77kn,c25m,Cessna 525 CitationJet M2,Private owner
a597bb,n46ew,c25m,Cessna 525 CitationJet M2,Private owner
a2c147,n277jb,c25m,Cessna 525 CitationJet M2,Private owner
abc569,n858dp,c25m,Cessna 525 CitationJet M2,Private owner
a82a2d,n625pz,c25m,Cessna 525 CitationJet M2,Mild Air
a0017d,n1rd,c25m,Cessna 525 CitationJet M2,Private owner
4d02f7,lx-fdj,c25m,Cessna 525 CitationJet M2,Private owner
e490d1,pp-prb,c25m,Cessna 525 CitationJet M2,Private owner
e490ab,pr-fhi,c25m,Cessna 525 CitationJet M2,Private owner
406d18,g-cmto,c25m,Cessna 525 CitationJet M2,Private owner
ab150a,n813fm,c25m,Cessna 525 CitationJet M2,Private owner
ab2c42,n819r,c25m,Cessna 525 CitationJet M2,Private owner
a9b658,n725cg,c25m,Cessna 525 CitationJet M2,Private owner
43e999,m-cara,c25m,Cessna 525 Citation M2,Private owner
a27d03,n26dv,c25m,Cessna 525 CitationJet M2,Private owner
a97b5b,n71sy,c25m,Cessna 525 CitationJet M2,Private owner
a08f4e,n135ru,c25m,Cessna 525 CitationJet M2,Private owner
a0c308,n1482b,c25m,Cessna 525 CitationJet M2,Private owner
acc400,n921xt,c25m,Cessna 525 CitationJet M2,Private owner
abe6c3,n866st,c25m,Cessna 525 CitationJet M2,Private owner
e490c4,pr-riy,c25m,Cessna 525 CitationJet M2,Private owner
a69bba,n525cg,c25m,Cessna 525 CitationJet M2,Private owner
adc2c3,n986pr,c25m,Cessna 525 CitationJet M2,Private owner
abe28f,n865mt,c25m,Cessna 525 CitationJet M2,Private owner
ac40f3,n889tf,c25m,Cessna 525 CitationJet M2,Private owner
e490a3,pr-frc,c25m,Cessna 525 CitationJet M2,Private owner
a31d20,n30bp,c25m,Cessna 525 CitationJet M2,Private owner
aca991,n915dh,c25m,Cessna 525 Citation M2,Private owner
abd2c7,n861cg,c25m,Cessna 525 CitationJet M2,Private owner
abba53,n855ed,c25m,Cessna 525 CitationJet M2,Private owner
ab8fd4,n844mm,c25m,Cessna 525 CitationJet M2,Private owner
a69c8c,n525ls,c25m,Cessna 525 CitationJet M2,Private owner
a35d62,n316cw,c25m,Cessna 525 CitationJet M2,Private owner
45c837,oy-raw,c25m,Cessna 525 CitationJet M2,FlexFlight
a8b817,n661bp,c25m,Cessna 525 CitationJet M2,Private owner
a6877e,n52kh,c25m,Cessna 525 CitationJet M2,Private owner
008d8f,zs-fcw,c25m,Cessna 525 CitationJet M2,Private owner
a69c3b,n525hl,c25m,Cessna 525 CitationJet M2,Private owner
ab875c,n842aw,c25m,Cessna 525 CitationJet M2,Private owner
a31e36,n30ns,c25m,Cessna 525 CitationJet M2,Private owner
a5168f,n427kp,c25m,Cessna 525 CitationJet M2,Private owner
ac3968,n887sb,c25m,Cessna 525 CitationJet M2,Private owner
3e43f5,d-iqxx,c25m,Cessna	525 CitationJet M2,Private Owner
ad333a,n95kl,c25m,Cessna 525 CitationJet M2,Private owner
a15ff6,n188sb,c25m,Cessna 525 CitationJet M2,Private owner
a97a33,n71fb,c25m,Cessna 525 CitationJet M2,Private owner
a9d38c,n732m,c25m,Cessna 525 CitationJet M2,Private owner
ac1fcc,n880wc,c25m,Cessna 525 CitationJet M2,Private owner
a06086,n123tf,c25m,Cessna 525 CitationJet M2,Private owner
a634d4,n4997,c25m,Cessna 525 CitationJet M2,Private owner
a4cbda,n408rk,c25m,Cessna 525 CitationJet M2,Private owner
a69c3f,n525hq,c25m,Cessna 525 CitationJet M2,Private owner
a4f951,n42al,c25m,Cessna 525 CitationJet M2,Private owner
7c7128,vh-wmy,c25m,Cessna 525 CitationJet M2,Private owner
ab4493,n825mt,c25m,Cessna 525 CitationJet M2,Private owner
a7c3e3,n6ps,c25m,Cessna 525 CitationJet M2,Private owner
a81abd,n621ja,c25m,Cessna 525 CitationJet M2,Private owner
e4911e,pp-oeg,c25m,Cessna 525 CitationJet M2,Private owner
4b3901,hb-vph,c25m,Cessna 525 Citation M2,Private owner
a2cc23,n28fd,c25m,Cessna 525 CitationJet M2,Private owner
ac2a1f,n883mt,c25m,Cessna 525 CitationJet M2,Private owner
ac0dc4,n876ms,c25m,Cessna 525 CitationJet M2,Private owner
ac4679,n890mt,c25m,Cessna 525 CitationJet M2,Private owner
50006b,t7-foz,c25m,Cessna 525 CitationJet M2,Private owner
a688db,n52zg,c25m,Cessna 525 CitationJet M2,Private owner
add334,n990fv,c25m,Cessna 525 CitationJet M2,Private owner
a9f84c,n741wy,c25m,Cessna 525 CitationJet M2,Private owner
ac8a3c,n907lw,c25m,Cessna 525 CitationJet M2,Private owner
a92558,n689hc,c25m,Cessna 525 CitationJet M2,Private owner
a63628,n5kj,c25m,Cessna 525 CitationJet M2,Private owner
ad84c4,n970mm,c25m,Cessna 525 CitationJet M2,Private owner
a83d8a,n63ya,c25m,Cessna 525 CitationJet M2,Private owner
a286b7,n262da,c25m,Cessna 525 CitationJet M2,Private owner
71c219,hl8219,c25m,,
