icao,regid,mdl,type,operator
3912f5,f-gexv,be10,Beech A100 King Air,Phenix Aviation
3e20c5,d-idpl,be10,Beech B100 King Air,Private owner
4783c5,ln-awa,be10,Beech A100 King Air,Airwing
500055,t7-kyr,be10,Beech B100 King Air,Private owner
a022d2,n108eb,be10,Beech B100 King Air,Private owner
a00672,n100tw,be10,Beech B100 King Air,Private owner
a00a08,n101sn,be10,Beech B100 King Air,Private owner
a02c6a,n110ce,be10,,
a03216,n111yf,be10,Beech B100 King Air,Private owner
a15f69,n188ll,be10,Beech B100 King Air,Private owner
a22f44,n24sp,be10,Beech A100 King Air,Private owner
a233fd,n241cw,be10,Beech B100 King Air,Private owner
a239e1,n24203,be10,,
a28f1f,n264pa,be10,Beech B100 King Air,Private owner
a21f0a,n236cp,be10,,
a324c3,n301ts,be10,Beech B100 King Air,Private owner
a4d887,n411ha,be10,Beech A100 King Air,Private owner
a570d0,n45lu,be10,Beech B100 King Air,Private owner
a63ad5,n500kd,be10,Beech B100 King Air,Private owner
a7c698,n60tj,be10,Beech B100 King Air,Private owner
a8312b,n627km,be10,,
a90204,n68mu,be10,,
a9f10d,n74jv,be10,Beech 100 King Air,Private owner
aa0cfb,n747em,be10,,
aa6909,n770ab,be10,Beech B100 King Air,Private owner
aa83af,n777gs,be10,Beech A100 King Air,Private owner
ab14a5,n813bl,be10,,
abf53e,n87nw,be10,,
acc97d,n923bw,be10,Beech B100 King Air,Private owner
ace39b,n93d,be10,Beech B100 King Air,Private owner
ac5d30,n896sb,be10,Beech A100 King Air,Private owner
adaa75,n98ta,be10,Beech B100 King Air,Private owner
c000df,c-faio,be10,Beech A100 King Air,Air Inuit
c000e0,c-faip,be10,Beech A100 King Air,Air Inuit
c0131f,c-fhgg,be10,Beech A100 King Air,Air Creebec
adc9b4,n988jr,be10,Beech B100 King Air,Private owner
ad8344,n97wd,be10,Beech 100 King Air,Private owner
c01823,c-fjdq,be10,Beech 100 King Air,Max Aviation
adee1e,n997rc,be10,Beech A100 King Air,Private owner
c065b6,c-gmnl,be10,Beech 100 King Air,Max Aviation
c03c96,c-fwyn,be10,Beech 100 King Air,Private owner
c04583,c-gaik,be10,Beech A100 King Air,Air Inuit
c07190,c-grad,be10,Beech B100 King Air,Chartright Air
c0858f,c-gypa,be10,Beech 100 King Air,Max Aviation
c05c6a,c-gizx,be10,Beech A100 King Air,Air Creebec
ab34c6,n821cb,be10,Beech B100 King Air,Private owner
c03cc6,c-fxaj,be10,Beech A100 King Air,Private owner
a91984,n686ac,be10,Beech B100 King Air,Private owner
a77778,n580s,be10,Beech B100 King Air,Private owner
a42559,n3663b,be10,Beech B100 King Air,Private owner
a0cbe1,n150tj,be10,Beech B100 King Air,Private owner
a1e977,n222lp,be10,Beech B100 King Air,Private owner
ab9a25,n847d,be10,Beech B100 King Air,Private owner
adedbc,n997me,be10,Beech B100 King Air,Private owner
a8d466,n66804,be10,Beech B100 King Air,Private owner
ac70a7,n900rd,be10,Beech B100 King Air,Private owner
a06f72,n127tx,be10,Beech B100 King Air,Private owner
a6b458,n531cb,be10,Beech B100 King Air,Private owner
a6036a,n487jh,be10,Beech B100 King Air,Private owner
aa8e79,n78da,be10,Beech B100 King Air,Private owner
abce37,n86tr,be10,Beech B100 King Air,Private owner
a22e16,n24em,be10,Beech B100 King Air,Private owner
ac1bfa,n88fa,be10,Beech B100 King Air,Private owner
a35e30,n316mb,be10,Beech B100 King Air,Private owner
a00262,n10ag,be10,Beech B100 King Air,Private owner
c00d10,c-feyp,be10,Beech A100 King Air,Air Creebec
c06746,c-gncv,be10,Beech 100 King Air,Private owner
ace556,n93wt,be10,Beech B100 King Air,Private owner
c05d39,c-gjhw,be10,Beech A100 King Air,Transwest Air
a7d933,n6045s,be10,Beech B100 King Air,Private owner
c02663,c-fony,be10,Beech A100 King Air,Private owner
aaa704,n786cb,be10,Beech B100 King Air,Private owner
a04b22,n118nl,be10,Beech B100 King Air,Private owner
c03c97,c-fwyo,be10,Beech 100 King Air,Private owner
a24e87,n248jh,be10,Beech B100 King Air,Private owner
a09d6a,n139jb,be10,Beech B100 King Air,Private owner
c01e23,yv3335,be10,Beech 100 King Air,Pascan Aviation
c0096e,c-fdov,be10,Beech A100 King Air,Private owner
a05efb,n123bl,be10,Beech B100 King Air,Private owner
a05ce2,n122u,be10,Beech B100 King Air,Private owner
a042cf,n116dg,be10,Beech B100 King Air,Private owner
c06e13,c-gpru,be10,,
0d8260,yv3211,be10,,
c07d5d,c-gvmi,be10,,
c046d3,c-gavi,be10,,
7c1599,vh-ejv,be10,,
ac95d3,n91rk,be10,,
a28f93,n264ts,be10,,
a432ba,n37pc,be10,,
c07672,c-gswf,be10,,
a34f54,n312mb,be10,,
0d8308,yv3335,be10,,
a9a3be,n720c,be10,,
a227f1,n238tr,be10,,
a98140,n711re,be10,,
a06f75,n127u,be10,,
a5c26f,n470pr,be10,,
a8107c,n619dd,be10,,
a3c95e,n343kk,be10,,
ad21c0,n945ws,be10,,
