icao,regid,mdl,type,operator
401fb4,g-bjml,c120,Cessna 120,Private Owner
403363,g-btbw,c120,Cessna 120,Private owner
a9c091,n72747,c120,Cessna 120,Private owner
402b83,g-akts,c120,Cessna 120,Private owner
4039a1,g-bvuz,c120,Cessna 120,Private owner
403601,g-buhz,c120,Cessna 120,Private owner
aa6f58,n77116,c120,,
a1bc57,n2103v,c120,,
402a6f,g-ajjt,c120,,
a6f263,n547et,c120,,
a34d79,n3114n,c120,,
a2d4a3,n2814n,c120,,
a2ca96,n2792n,c120,,
402852,g-ajjs,c120,,
aa730b,n77212,c120,,
a9cdcb,n73029,c120,,
a2ef30,n2888n,c120,,
aa4b93,n76219,c120,,
a1c054,n2115v,c120,,
a429d1,n3678v,c120,,
aa7a7c,n77415,c120,,
a156bc,n1858n,c120,,
a18967,n1988v,c120,,
ac5e81,n89639,c120,,
a1c84e,n2139v,c120,,
a9b524,n72425,c120,,
a14bc1,n1829v,c120,,
a2f1cf,n2890n,c120,,
a297ac,n2660n,c120,,
a9aa89,n72163,c120,,
aa7358,n77239,c120,,
ad0c2d,n94q,c120,,
aa4b6e,n76207,c120,,
aa7422,n77291,c120,,
a14b74,n1827n,c120,,
a9ae20,n72256,c120,,
aa488b,n76169,c120,,
