icao,regid,mdl,type,operator
c002eb,c-fbcs,bcs1,Bombardier CS100,Bombardier
c00d77,c-ffco,bcs1,Bombardier CS100,Bombardier
c08120,c-gwxj,bcs1,Bombardier CS100,Bombardier
c08121,c-gwxk,bcs1,Bombardier CS100,Bombardier
c08130,c-gwxz,bcs1,Bombardier CS100,Bombardier
c08134,c-gwyd,bcs1,Bombardier CS100,Bombardier
c027ba,c-fpbd,bcs1,Bombardier CS100,Bombardier
c027a5,c-fpai,bcs1,Bombardier CS100,Bombardier
4b17de,hb-jba,bcs1,Bombardier CS100,Swiss
4b17df,hb-jbb,bcs1,Bombardier CS100,Swiss
4b17e0,hb-jbc,bcs1,Bombardier CS100,Swiss
c027d0,c-fpbz,bcs1,,
4b17e1,hb-jbd,bcs1,,
c02769,c-foya,bcs1,,
4b17e2,hb-jbe,bcs1,,
c0276a,c-foyb,bcs1,,
4b17e4,hb-jbg,bcs1,,
4b17e5,hb-jbh,bcs1,,
4b17e3,hb-jbf,bcs1,,
