icao,regid,mdl,type,operator
3848da,f-wwqa,fa8x,Dassault Falcon 8X,Dassault Aviation
3848fa,f-wwqb,fa8x,Dassult Falcon 8X,Dassault Testflight
38491a,f-wwqc,fa8x,Dassault Falcon 8X,Dassault Aviation
38499a,f-wwqg,fa8x,Dassault Falcon 8X,Dassault Aviation Test
38497a,f-wwqf,fa8x,Dassault Falcon 8X,Dassault Aviation Test
38493a,f-wwqd,fa8x,Dassault Falcon 8X,Dassault Aviation Test
468cf2,sx-cgr,fa8x,Dassault Falcon 8X,Private owner
3849da,f-wwqi,fa8x,,
384a3a,f-wwql,fa8x,,
3849fa,f-wwqj,fa8x,,
384a1a,f-wwqk,fa8x,,
4243f6,vq-bfd,fa8x,,
399643,f-hfsd,fa8x,,
142586,ra-09606,fa8x,,
384bda,f-wwna,fa8x,,
e4930d,pr-jqf,fa8x,,
4d0296,lx-shs,fa8x,,
45cd6b,oy-skk,fa8x,,
39d117,f-huix,fa8x,,
4071bf,g-xion,fa8x,,
3c5c41,d-agba,fa8x,,
43eae9,m-atex,fa8x,,
800c0d,vt-fcn,fa8x,,
384aba,f-wwqp,fa8x,,
384b9a,f-wwqw,fa8x,,
384b5a,f-wwqu,fa8x,,
384bba,f-wwqx,fa8x,,
4b199b,hb-jsd,fa8x,,
8962d4,a6-sms,fa8x,,
44a10f,oo-hho,fa8x,,
384bfa,f-wwnb,fa8x,,
384c5a,f-wwne,fa8x,,
384c1a,f-wwnc,fa8x,,
384c7a,f-wwnf,fa8x,,
491266,cs-dsf,fa8x,,
384c3a,f-wwnd,fa8x,,
45bd84,oy-old,fa8x,,
459053,oy-dbs,fa8x,,
3c5c42,d-agbb,fa8x,,
4bc9ab,tc-rmk,fa8x,,
39d50f,f-hvip,fa8x,,
4b18d2,hb-jkk,fa8x,,
384afa,f-wwqr,fa8x,,
e4937f,pr-jry,fa8x,,
4b199a,hb-jsc,fa8x,,
4d403f,3a-mga,fa8x,,
424756,vp-chy,fa8x,,
