icao,regid,mdl,type,operator
00b116,zs-sor,b463,BAe 146-300,African Airline Investments
044040,9g-sbc,b463,BAe 146-300,Starbow Airlines
34414c,ec-lmr,b463,BAe 146-300QT,Pan Air Lineas Aereas
34415a,ec-lof,b463,BAe 146-300QT,TNT Airways
3445c6,ec-mck,b463,BAe 146-300QT,Panair Lineas Aereas
3445c7,ec-mcl,b463,BAe 146-300QT,Panair Lineas Aereas
34468d,ec-mhr,b463,BAe 146-300QT,TNT Airways
34468e,ec-mft,b463,BAe 146-300QT,TNT Airways
34468f,ec-meo,b463,BAe 146-300QT,TNT Airways
3450d2,ec-mid,b463,BAe 146-300QT,Pan Air Lineas Aereas
3c1297,d-awba,b463,BAe 146-300,WDL Aviation
40081a,g-luxe,b463,BAe 146-300,BAe Systems
44d024,oo-tad,b463,BAe 146-300QT,TNT Airways
44d028,oo-tah,b463,BAe 146-300QT,TNT Airways
46913a,sx-diz,b463,BAe 146-300,Astra Airlines
7335e3,ep-moc,b463,British Aerospace 146-300,Mahan Air
7335e5,ep-moe,b463,BAe 146-300,Mahan Air
7335ed,ep-mom,b463,BAe 146-300,Mahan Air
7c4319,vh-njf,b463,BAe 146-300,Cobham
7c431f,vh-njl,b463,BAe 146-300,Cobham
7c4320,vh-njm,b463,BAe 146-300,Cobham
7c4321,vh-njn,b463,BAe 146-300,Cobham
7c432d,vh-njz,b463,BAe 146-300,Cobham
7335e2,ep-mob,b463,BAe 146-300,Mahan Air
7335e6,ep-mof,b463,BAe 146-300,Mahan Air
4a06d2,yr-avr,b463,BAe 146-300,Aviro Air
7335eb,ep-mok,b463,,
7325ed,ep-mom,b463,,
