icao,regid,mdl,type,operator
7c1b50,vh-foi,a119,Agusta A119 Koala,Private owner
7c70bc,vh-wjy,a119,AgustaWestland AW119 Mk II,Private owner
a0094b,pr-res,a119,AgustaWestland AW119 Mk II,Private owner
a04e0e,n119eh,a119,Agusta A119 Koala,Private owner
a199a9,n202cf,a119,Agusta A119 Koala,Private owner
a19d60,n203cf,a119,Agusta A119 Koala,Private owner
a1ac3c,n207cf,a119,Agusta A119 Koala,Private owner
a2c5d0,n278sm,a119,AgustaWestland AW119 Mk II,Summit Air Ambulance
a32aaf,n303cf,a119,Agusta A119 Koala,Private owner
a365d2,n318pd,a119,Agusta A119 Koala,Private owner
a3e989,n351ll,a119,Agusta Westland AW119,Private owner
a3ed40,n352ll,a119,AgustaWestland AW119 Mk II,Private owner
a3f0f7,n353ll,a119,AgustaWestland AW119 Mk II,Private owner
a3f4ae,n354ll,a119,AgustaWestland AW119 Mk II,Private owner
a3fc1c,n356ll,a119,AgustaWestland AW119 Mk II,Private owner
a63323,n499sm,a119,AgustaWestland AW119MKII,Private owner
a7d29c,n603cf,a119,Agusta A119 Koala,Private owner
a7da0a,n605cf,a119,Agusta A119 Koala,Private owner
c01050,c-fgep,a119,Agusta A109SP,Chartright Air
c023a1,c-fnmu,a119,AgustaWestland AW119 Mk II,Chartright Air
e8094c,cc-akw,a119,AgustaWestland AW119 Mk II,Private owner
a7f431,zs-rra,a119,AgustaWestland AW.119 MK II,The SA Red Cross Air Mercy Service
a7e8e6,n609cf,a119,Agusta A119 Koala,Private owner
009391,zs-hka,a119,AgustaWestland AW-119 Mk II,Private owner
a01011,n103cf,a119,Agusta A119 Koala,Private owner
4614aa,oh-hvm,a119,AugustaWestland AW119,Finnish Frontier Guard
a7d653,n604cf,a119,Agusta A119 Koala,Private owner
a68e2b,n521rq,a119,Agusta A119 Koala,Private owner
4b4316,hb-zko,a119,Agusta A119 Koala,Private owner
a04f48,n119sx,a119,Agusta A-119 Koala,Petrel
a51f05,n429wc,a119,Agusta A119 Koala,Private owner
a17b3d,n195fb,a119,Agusta A119 Koala,City of Phoenix
ac6c4b,xc-era,a119,Agusta A119 Koala,Estado De Mexico Rescate
a7e52f,n608cf,a119,Agusta A119 Koala,Private owner
a00d02,pr-pos,a119,AgustaWestland AW139,Private owner
847049,ja167t,a119,AgustaWestland AW119,Private owner
0071b4,zt-rax,a119,AgustaWestland AW119,SA Red Cross Air Mercy Service
78106c,b-70kh,a119,AgustaWestland AW119,Shanghai Kingwing General Aviation
78106b,b-70kg,a119,AgustaWestland AW119,Shanghai Kingwing General Aviation
a18662,n198fb,a119,Agusta A119 Koala,City of Phoenix
a0bdd0,n147mm,a119,AgustaWestland AW119Mkii,AgustaWestland Philadelphia
a36989,n319pd,a119,Agusta A119 Koala,Private owner
7c6d0c,vh-vtq,a119,,
a671c7,n514re,a119,,
78106e,b-70kk,a119,,
7810d9,b-70my,a119,,
ad0347,n9379k,a119,,
aa8051,n776lf,a119,,
781137,b-70pj,a119,,
ad034e,n9379s,a119,,
3006da,i-awcv,a119,,
781179,b-70qn,a119,,
78106d,b-70kj,a119,,
78113f,b-70pr,a119,,
a1a4ce,n205cf,a119,,
7c4f5e,vh-pyo,a119,,
7810da,b-70mz,a119,,
a3ffd3,n357ll,a119,,
a3f865,n355ll,a119,,
a3369d,n306lg,a119,,
a4038a,n358ll,a119,,
ad683a,n963kp,a119,,
7810dc,b-70nc,a119,,
a8e110,n671ss,a119,,
a10586,n165p,a119,,
a97636,n709cg,a119,,
a17845,n194nt,a119,,
781178,b-70qm,a119,,
800b87,vt-rnk,a119,,
c81c72,zk-isr,a119,,
a8d749,n669ss,a119,,
aaeae7,n802sm,a119,,
a83577,n628rl,a119,,
a40741,n359ll,a119,,
a2040c,n229sm,a119,,
a666c1,n511sl,a119,,
