icao,regid,mdl,type,operator
a009fd,n101sb,acam,Amateur Aircam,Private owner
a05b6a,n122cz,acam,Chaz Aircam,Private owner
ac9f14,n912la,acam,Rasch Tony Aircam,Lockwood Aircraft Corp.
a9a8fd,n721ts,acam,,
a72584,n56kt,acam,,
a8b289,n66gu,acam,,
