icao,regid,mdl,type,operator
4aad64,se-kkd,dhc2,De Havilland DHC-2 MK.III,Private owner
a01b8c,n106fs,dhc2,DHC-2MK,US Dept of Agriculture
a01ece,n107b,dhc2,De Havilland DHC-2,Private owner
a12f74,n17598,dhc2,De Havilland DHC-2 Mk.1,Kenmore air Harbor
a5c622,n471pm,dhc2,De Havilland DHC2 Beaver U6,Private owner
a6ac06,n529t,dhc2,De Havilland DHC-2 Mk.1,Private owner
a70e62,n554bb,dhc2,De Havilland DHC-2 Mk. I,Chevron USA
a6c29d,n5347g,dhc2,De Havilland DHC-2 Mk1,Civil Air Patrol
a672f0,n5142g,dhc2,De Havilland DHC-2,Civil Air Patrol
a8f58f,n67684,dhc2,De Havilland DHC-2 Mk.1,Private owner
a9b1d6,n72355,dhc2,De Havilland DHC-2 Mk.1,Kenmore Air Harbor
aa67d5,n77mv,dhc2,De Havilland DHC-2 Mk.1,Kenmore air Harbor
ac1c12,n88g,dhc2,De Havilland DHC-2 Mk.1,Private owner
ac6efc,n90yc,dhc2,De Havilland DHC-2 Mk.1,Private owner
aca5ce,n914cw,dhc2,De Havilland DHC-2,Private owner
ad9577,n9744t,dhc2,De Havilland DHC-2 Mk III Beav,Kenmore Air Harbor
adbefc,n985p,dhc2,De Havilland DHC-2 Mk.1,Private owner
ad77d2,n967tb,dhc2,De Havilland DHC-2 Mk III Beav,Private owner
c02568,c-foeh,dhc2,De Havilland DHC-2 MK.III,Province of Ontario-Ministry o
c03c53,c-fwvy,dhc2,De Havilland DHC-2 Mk.1,Private owner
c88026,dq-tal,dhc2,De Havilland DHC-2 Beaver,Turtle Airways
c8806e,dq-tam,dhc2,De Havilland DHC-2,Private owner
a5e570,n4794c,dhc2,De Haviland Canada DHC-2 Beaver,Alaska Seaplane Service
aa835b,n777dh,dhc2,De Haviland Canada DHC-2 Beaver,Alaska Seaplane Service
a8f54c,n67667,dhc2,De Haviland Canada DHC-2 Beaver,Taquan Air
a723ed,n5595m,dhc2,De Haviland Canada DHC-2 Beaver,Pacific Airways
a81769,n620n,dhc2,DeHaviland Canada DHC-2 Beaver Turbo,Private owner
a8f56b,n67673,dhc2,De Haviland Canada DHC-2 Beaver,Taquan Air
c069bd,c-gobc,dhc2,DHC2 Beaver MK. I,Seair Seaplanes
ad52ac,n958db,dhc2,DeHaviland Canada DHC-2 Mk 1,Private owner
a05faa,n123jl,dhc2,De Havilland DHC-2 Mk.I,Bramley Aviation
a31e42,n30pd,dhc2,De Havilland DHC-2,Powell Aviation
c027d7,c-fpcg,dhc2,De Havilland DHC-2 Mk.I,Seair Seaplanes
c00c8c,c-fetn,dhc2,De Havilland DHC-2,Private owner
a0303c,n111dg,dhc2,De Havilland DHC-2 Mk.I,Private owner
c008a5,c-fdhc,dhc2,DHC2 Beaver MK. III,Seair Seaplanes
a8f590,n67685,dhc2,De Havilland DHC-2 Beaver,Northwest Seaplanes
a9a2ee,n72tt,dhc2,De Havilland DHC-2 Mk.II,Private owner
acb2a7,n917wg,dhc2,De Havilland DHC-2 Mk.III,Amphib Air
adc8a5,n9878r,dhc2,De Havilland DHC-2 Mk.I,Regal Air
c04e84,c-gdtb,dhc2,De Havilland DHC-2 Mk.III,Pacific Sky Aviation
ac8a23,n907kw,dhc2,De Havilland DHC-2 Mk.III,Private owner
adc882,n9877r,dhc2,De Havilland DHC-2 Mk.I,Regal Air
c0431b,c-fzks,dhc2,De Havilland DHC-2,Six Flying Fish
a8f58c,n67681,dhc2,De Havilland DHC-2 Mk.I,Northwest Seaplanes
a8d9b7,n67dn,dhc2,DeHaviland Canada DHC-2 Beaver,Vectored Soloutions
a17a9c,n1949b,dhc2,De Havilland DHC-2 Mk.I,Sail Rock Aviation
a5195d,n428af,dhc2,De Havilland DHC-2-L-20,RMA Aviation
c069f6,c-godh,dhc2,De Havilland DHC-2 Mk.III,Pacific Sky Aviation
a76468,n57576,dhc2,De Havilland DHC-2 Mk.I,Astra Pacific Aviation
a31752,n299ee,dhc2,,
c0144a,c-fhrt,dhc2,,
a58992,n456n,dhc2,,
c88074,dq-rej,dhc2,,
7c031b,vh-awd,dhc2,,
a15f33,n188jg,dhc2,,
a25d10,n251v,dhc2,,
a7a16b,n591db,dhc2,,
