icao,regid,mdl,type,operator
3d4365,d-extt,e200,Extra	EA-200,Private Owner
44d294,oo-ttt,e200,Extra EA-300/200,"Acrolim BVBA, Riemst"
49d2e2,ok-vav,e200,Extra EA-200,Private owner
406f29,g-olud,e200,Extra 200,Private owner
405c47,g-exgc,e200,Extra 200,Private owner
407275,g-uiii,e200,,
39ad0b,f-hlil,e200,,
406c56,g-wven,e200,,
