<?xml version="1.0" encoding="utf-8"?>
<!DOCTYPE svg PUBLIC "-//W3C//DTD SVG 1.1//EN" "http://www.w3.org/Graphics/SVG/1.1/DTD/svg11.dtd">
<svg version="1.1" xmlns="http://www.w3.org/2000/svg" xmlns:xlink="http://www.w3.org/1999/xlink" width="20" height="20" viewBox="0 0 20 20">
<path d="M18.5 7h-12c-0.827 0-1.5-0.673-1.5-1.5s0.673-1.5 1.5-1.5h12c0.827 0 1.5 0.673 1.5 1.5s-0.673 1.5-1.5 1.5zM6.5 5c-0.276 0-0.5 0.224-0.5 0.5s0.224 0.5 0.5 0.5h12c0.276 0 0.5-0.224 0.5-0.5s-0.224-0.5-0.5-0.5h-12z" class="tripetto-fill"></path>
<path d="M18.5 12h-12c-0.827 0-1.5-0.673-1.5-1.5s0.673-1.5 1.5-1.5h12c0.827 0 1.5 0.673 1.5 1.5s-0.673 1.5-1.5 1.5zM6.5 10c-0.276 0-0.5 0.224-0.5 0.5s0.224 0.5 0.5 0.5h12c0.276 0 0.5-0.224 0.5-0.5s-0.224-0.5-0.5-0.5h-12z" class="tripetto-fill"></path>
<path d="M18.5 17h-12c-0.827 0-1.5-0.673-1.5-1.5s0.673-1.5 1.5-1.5h12c0.827 0 1.5 0.673 1.5 1.5s-0.673 1.5-1.5 1.5zM6.5 15c-0.276 0-0.5 0.224-0.5 0.5s0.224 0.5 0.5 0.5h12c0.276 0 0.5-0.224 0.5-0.5s-0.224-0.5-0.5-0.5h-12z" class="tripetto-fill"></path>
<path d="M1.5 7c-0.827 0-1.5-0.673-1.5-1.5s0.673-1.5 1.5-1.5 1.5 0.673 1.5 1.5-0.673 1.5-1.5 1.5zM1.5 5c-0.276 0-0.5 0.224-0.5 0.5s0.224 0.5 0.5 0.5 0.5-0.224 0.5-0.5-0.224-0.5-0.5-0.5z" class="tripetto-fill"></path>
<path d="M1.5 12c-0.827 0-1.5-0.673-1.5-1.5s0.673-1.5 1.5-1.5 1.5 0.673 1.5 1.5-0.673 1.5-1.5 1.5zM1.5 10c-0.276 0-0.5 0.224-0.5 0.5s0.224 0.5 0.5 0.5 0.5-0.224 0.5-0.5-0.224-0.5-0.5-0.5z" class="tripetto-fill"></path>
<path d="M1.5 17c-0.827 0-1.5-0.673-1.5-1.5s0.673-1.5 1.5-1.5 1.5 0.673 1.5 1.5-0.673 1.5-1.5 1.5zM1.5 15c-0.276 0-0.5 0.224-0.5 0.5s0.224 0.5 0.5 0.5 0.5-0.224 0.5-0.5-0.224-0.5-0.5-0.5z" class="tripetto-fill"></path>
</svg>
