<?xml version="1.0" encoding="UTF-8"?>
<svg width="20" height="20" version="1.1" viewBox="0 0 20 20" xmlns="http://www.w3.org/2000/svg" xmlns:cc="http://creativecommons.org/ns#" xmlns:dc="http://purl.org/dc/elements/1.1/" xmlns:rdf="http://www.w3.org/1999/02/22-rdf-syntax-ns#">
 <g>
  <path d="m18 19.5h-16c-0.827 0-1.5-0.673-1.5-1.5v-16c0-0.827 0.673-1.5 1.5-1.5h16c0.827 0 1.5 0.673 1.5 1.5v16c0 0.827-0.673 1.5-1.5 1.5zm-16-18c-0.276 0-0.5 0.224-0.5 0.5v16c0 0.276 0.224 0.5 0.5 0.5h16c0.276 0 0.5-0.224 0.5-0.5v-16c0-0.276-0.224-0.5-0.5-0.5z" fill="#A8C6DF" class="tripetto-fill"/>
  <path d="m15 10.5h-10c-0.276 0-0.5-0.224-0.5-0.5s0.224-0.5 0.5-0.5h10c0.276 0 0.5 0.224 0.5 0.5s-0.224 0.5-0.5 0.5z" fill="#A8C6DF" class="tripetto-fill"/>
  <path d="m10 8c-0.5512 0-1-0.4488-1-1s0.4488-1 1-1c0.5512 0 1 0.4488 1 1s-0.4488 1-1 1z" stroke-width=".4" fill="#A8C6DF" class="tripetto-fill"/>
  <path d="m10 14c-0.5512 0-1-0.4488-1-1s0.4488-1 1-1c0.5512 0 1 0.4488 1 1s-0.4488 1-1 1z" stroke-width=".4" fill="#A8C6DF" class="tripetto-fill"/>
 </g>
</svg>
