{
  "iisSettings": {
    "windowsAuthentication": false,
    "anonymousAuthentication": true,
    "iis": {
      "applicationUrl": "http://localhost/Demo.OmniChannel.Api",
      "sslPort": 0
    },
    "iisExpress": {
      "applicationUrl": "http://localhost:60249/",
      "sslPort": 0
    }
  },
  "profiles": {
    "Demo.OmmiChannel.Api": {
      "commandName": "IISExpress",
      "launchBrowser": true,
      "environmentVariables": {
        "ASPNETCORE_ENVIRONMENT": "Development"
      },
      "ancmHostingModel": "OutOfProcess",
      "nativeDebugging": false,
      "applicationUrl": "http://localhost:5000/;https://localhost:5001/"
    },
    "Docker": {
      "commandName": "Docker",
      "launchBrowser": true,
      "launchUrl": "{Scheme}://{ServiceHost}:{ServicePort}",
      "httpPort": 60250
    }
  }
}