{
  "profiles": {
    "Demo.OmniChannel.Domain": {
      "commandName": "Project",
      "launchBrowser": true,
      "environmentVariables": {
        "ASPNETCORE_ENVIRONMENT": "Development"
      },
      "applicationUrl": "https://localhost:62612;http://localhost:62622"
    }
  }
}