<?xml version="1.0" encoding="UTF-8"?>
<svg id="Layer_1" data-name="Layer 1" xmlns="http://www.w3.org/2000/svg" viewBox="0 0 200 200">
  <defs>
    <style>
      .cls-1 {
        fill: #4caf50;
      }
    </style>
  </defs>
  <path class="cls-1" d="M165.79,41.41c-3.69-11.66-12.18-21.2-23.18-26.25-1.69-.78-3.45-1.47-5.26-2.01-4.03-1.26-8.31-1.93-12.75-1.93-4.17,0-8.19,.58-12,1.71l-.74,.22c-.42,.12-.84,.26-1.26,.42V191.63c0,1.24,1.34,2.01,2.41,1.39l53.99-31.26c.5-.29,.8-.82,.8-1.39V54.42c0-4.54-.7-8.89-2.01-13.01Z"/>
  <path class="cls-1" d="M34.32,54.42v105.96c0,.57,.3,1.1,.8,1.39l53.99,31.26c1.07,.62,2.41-.15,2.41-1.39V13.57c-.42-.16-.84-.3-1.26-.42l-.74-.22c-3.81-1.12-7.83-1.71-12-1.71-4.44,0-8.71,.66-12.75,1.93-1.81,.54-3.57,1.22-5.26,2.01-11,5.06-19.49,14.59-23.18,26.25-1.3,4.11-2.01,8.47-2.01,13.01Z"/>
  <rect class="cls-1" x="60.28" y="94.8" width="78.92" height="14.86"/>
</svg>