{
    "mappings": {
       "dynamic": true,
       "properties": {
           "rating" : { "type" : "float" },
           "content" : { "type" : "text" },
           "author": {
               "properties": {
                   "first_name": { "type": "text" },
                   "last_name": { "type": "text" },
                   "email": { "type": "keyword" }
               }
           }
        }
    }
}
