<svg xmlns="http://www.w3.org/2000/svg" width="20" height="20" viewBox="0 0 20 20">
  <path id="google-my-business" d="M22,8.5a2.5,2.5,0,0,1-5,0,2.5,2.5,0,0,1-5,0,2.5,2.5,0,1,1-5,0,2.5,2.5,0,0,1-5,0L3.39,3.08A1.454,1.454,0,0,1,4.7,2H19.3a1.454,1.454,0,0,1,1.31,1.08L22,8.5m-1,3.7V20a2.006,2.006,0,0,1-2,2H5a2.006,2.006,0,0,1-2-2V12.2a3.958,3.958,0,0,0,4-.58,4,4,0,0,0,2.5.88,3.961,3.961,0,0,0,2.5-.88,4,4,0,0,0,2.5.88,3.961,3.961,0,0,0,2.5-.88,3.982,3.982,0,0,0,2.5.88,3.936,3.936,0,0,0,1.5-.3m-2,5.13a2.765,2.765,0,0,0-.05-.63l-.03-.16H15.95v1.17h1.81a1.4,1.4,0,0,1-.31.62,1.768,1.768,0,0,1-1.26.51,1.96,1.96,0,0,1-1.35-.56,1.832,1.832,0,0,1,2.57-2.61l.14.13.84-.85-.16-.14A3.048,3.048,0,0,0,16.15,14h-.01a3.034,3.034,0,0,0-2.14.87A2.988,2.988,0,0,0,13.08,17a2.871,2.871,0,0,0,.88,2.09h0a3.2,3.2,0,0,0,2.22.91h.02a2.856,2.856,0,0,0,2.03-.8A2.784,2.784,0,0,0,19,17.33Z" transform="translate(-2 -2)" fill="rgba(0,0,0,0.6)"/>
</svg>
