1:
3.71
3.55
3.55
4.24
3.73
3.83
3.58
3.72
3.9
3.66
3.21
3.66
3.94
3.88
3.28
3.97
3.76
4.04
3.95
3.98
3.42
4.41
3.63
10:
3.29
3.16
1000:
3.43
3.28
3.15
4.15
3.64
3.55
3.46
3.8
3.36
3.2
3.47
3.61
3.45
3.98
3.79
3.35
3.33
3.35
3.43
3.65
3.63
3.79
3.01
3.36
3.86
3.38
3.64
10000:
3.69
3.75
10001:
3.61
3.99
3.76
3.2
3.92
3.52
3.56
3.82
3.82
3.3
3.91
3.92
3.3
3.94
3.71
3.76
4.04
10002:
4.05
3.57
4.27
3.84
10003:
2.82
10004:
4.38
3.89
4.01
3.81
4.19
4.01
4.07
3.97
3.99
3.91
3.93
3.78
3.99
3.75
4.5
4.12
4.07
4.06
4.16
4.26
3.98
3.86
3.77
3.92
4.51
3.76
3.93
4.03
3.48
4.18
4.12
10005:
3.61
3.84
3.41
3.32
3.57
10006:
3.78
3.49
3.88
3.24
10007:
2.89
3.2
3.03
2.98
2.84
3.12
2.91
3.28
3.05
3.24
2.98
3.2
3.06
10008:
4.23
3.56
3.64
3.35
4.0
3.88
3.87
10009:
3.65
3.6
4.18
3.2
3.13
3.55
1001:
3.54
3.57
3.66
3.34
3.87
3.81
3.67
3.63
3.14
3.65
3.62
3.84
3.25
3.65
3.51
3.46
3.81
3.71
3.27
3.41
3.39
3.66
3.46
3.19
3.57
3.26
3.61
3.63
3.78
3.86
3.64
4.17
3.29
3.54
3.47
3.55
3.85
3.17
3.44
3.67
3.79
3.31
3.62
3.81
3.85
3.71
3.51
3.34
3.4
3.84
3.39
2.92
3.07
3.6
3.83
3.89
3.52
3.47
3.55
3.38
3.51
3.37
3.29
3.25
3.84
3.36
3.19
3.3
3.8
3.53
3.25
3.43
3.57
3.31
3.0
3.67
3.11
3.05
3.61
3.57
3.87
3.79
3.07
3.3
3.55
3.42
3.48
3.89
3.48
3.28
3.83
3.53
3.52
3.7
3.36
3.13
3.36
4.01
3.45
3.74
3.56
3.64
3.33
3.32
3.42
3.53
3.64
3.75
3.64
3.13
3.32
3.48
3.5
3.31
3.5
3.03
3.31
3.87
3.68
3.33
3.45
3.54
3.55
3.54
3.42
3.45
3.33
3.63
3.6
3.46
3.53
3.67
3.61
3.47
10010:
2.95
2.85
2.87
3.29
3.09
2.89
3.01
2.89
2.71
3.06
2.83
2.75
2.9
2.66
3.24
2.86
2.76
3.13
2.43
2.93
2.73
2.69
2.88
10011:
4.07
3.89
10012:
3.48
3.94
3.45
3.48
3.77
3.81
3.16
3.25
3.43
3.6
3.8
3.45
3.48
10013:
3.6
3.38
3.52
3.65
3.49
3.55
3.34
3.62
3.47
3.73
3.19
3.87
3.59
3.54
3.35
3.45
3.21
3.38
3.45
3.2
3.33
3.24
3.42
3.71
3.67
3.37
3.46
3.11
3.33
3.51
3.28
3.35
3.3
3.72
3.41
3.3
3.48
3.81
3.8
3.2
3.89
3.45
3.64
3.69
3.44
3.19
3.44
3.54
3.37
3.61
3.33
3.37
3.6
3.69
3.41
3.09
3.73
10014:
3.22
3.68
3.08
3.72
3.38
10015:
3.73
3.47
3.28
3.6
3.8
3.58
3.86
3.75
3.8
3.65
3.81
3.65
3.53
3.89
3.89
3.59
3.68
3.91
3.6
3.87
4.41
3.9
4.15
3.65
3.42
3.49
3.99
3.67
10016:
2.76
2.75
2.94
3.11
3.62
10017:
3.19
3.45
3.43
10018:
4.15
3.94
3.24
3.4
3.6
3.77
3.69
3.48
3.07
3.91
3.56
3.86
3.48
3.77
3.43
3.78
3.65
3.69
3.45
3.69
3.98
3.41
3.91
3.97
3.58
3.89
3.79
3.75
3.88
3.93
10019:
3.56
2.79
3.72
3.34
4.02
3.96
3.6
3.14
3.74
3.59
4.08
3.31
3.33
3.45
3.72
3.63
3.77
3.65
3.52
4.05
3.72
3.74
3.73
3.62
3.81
3.68
3.38
3.46
3.54
3.72
3.66
3.28
3.72
3.84
3.46
3.85
3.02
3.76
3.81
3.89
3.84
3.95
3.85
3.77
3.95
3.3
3.74
3.93
3.62
3.62
3.4
3.5
3.81
3.47
2.47
3.02
3.18
3.43
4.03
3.48
3.31
3.53
4.03
3.52
3.84
4.22
3.51
4.19
3.62
1002:
3.56
3.18
3.5
3.6
3.29
3.64
3.9
3.04
3.58
3.64
3.91
3.55
3.49
3.35
10020:
3.86
3.91
3.76
3.97
3.8
3.69
3.77
3.99
3.94
3.84
3.82
4.32
3.89
3.69
3.84
3.82
3.99
3.59
3.95
3.65
4.06
3.54
3.75
3.75
3.49
3.09
3.97
10021:
2.98
3.17
3.24
2.76
10022:
2.93
3.49
3.28
3.24
3.57
3.5
3.07
3.08
10023:
3.81
3.78
3.8
3.62
4.25
3.63
3.54
3.76
3.59
3.82
4.05
10024:
3.57
3.81
3.58
3.75
3.61
3.59
3.35
3.44
3.68
3.69
10025:
3.24
10027:
4.14
3.85
3.73
3.72
3.37
3.71
3.57
4.25
3.44
4.09
3.76
3.81
3.93
3.6
3.81
4.16
3.64
3.9
3.97
3.91
3.54
3.78
3.77
3.84
4.0
3.89
4.06
4.12
4.39
4.13
4.16
3.96
3.51
3.76
4.05
4.01
4.25
3.9
3.92
3.65
4.06
4.09
4.4
3.74
3.7
4.1
3.89
3.84
4.0
4.04
3.81
4.02
3.71
3.67
3.61
3.86
3.63
3.66
4.07
3.98
3.72
3.58
4.02
3.51
4.14
4.4
3.57
3.94
3.52
4.0
3.96
3.95
4.03
3.93
4.14
3.86
4.01
3.76
3.33
3.71
4.25
4.31
3.54
3.84
3.9
4.03
3.77
3.91
10028:
3.46
3.58
3.45
3.96
4.17
3.41
4.11
10029:
3.38
3.84
3.81
3.22
10031:
3.46
3.19
3.64
3.01
3.75
3.3
3.14
2.91
3.17
10032:
3.41
4.25
3.93
3.99
3.88
3.23
3.61
3.52
3.75
3.1
3.39
3.95
4.2
3.57
3.93
3.21
3.66
3.56
3.53
3.67
3.44
3.62
3.48
3.57
3.74
3.36
3.36
3.59
4.05
3.44
3.63
3.74
3.92
3.73
3.21
3.84
3.65
3.47
3.54
3.62
3.6
3.66
3.58
3.34
3.53
3.65
3.82
10033:
3.83
3.57
3.2
3.7
3.4
3.3
3.47
3.42
3.72
3.44
3.77
3.6
4.24
3.86
10034:
2.54
3.37
10035:
3.15
4.2
4.15
4.05
4.09
4.07
3.86
3.68
3.66
3.69
3.87
3.81
3.88
3.94
3.8
3.81
3.9
4.02
3.99
4.47
10036:
3.84
3.55
3.65
3.51
3.82
3.79
3.37
3.74
3.28
3.4
3.45
3.69
3.89
3.83
4.17
3.88
3.7
3.86
3.16
3.4
3.75
3.55
4.29
3.84
3.71
3.98
3.78
3.87
3.87
3.37
3.66
3.39
3.36
3.54
3.37
3.62
3.76
3.73
3.63
3.86
3.56
3.7
4.01
3.78
3.85
3.95
4.14
4.37
3.45
3.91
3.52
3.77
3.68
3.34
3.68
3.82
3.62
4.29
3.6
3.9
3.76
4.05
3.49
4.1
3.41
4.13
3.75
3.73
3.79
3.87
4.21
3.92
3.82
3.53
3.8
3.97
3.97
3.46
3.94
3.93
3.75
3.69
4.16
3.9
3.28
3.77
3.62
3.82
3.84
3.57
3.25
4.0
3.64
3.95
3.65
3.51
3.47
3.83
3.61
3.95
3.95
3.38
3.63
4.08
3.63
3.33
4.19
3.45
3.68
3.8
3.78
3.56
3.59
3.71
3.6
3.69
4.18
3.57
3.65
3.84
3.73
3.78
3.85
3.68
3.81
3.5
3.83
4.14
3.66
3.54
3.96
3.45
3.5
4.33
3.68
3.49
3.86
3.74
3.95
3.36
4.14
3.97
3.71
3.71
3.44
4.22
3.54
3.78
3.58
3.55
3.98
3.81
3.92
3.65
3.66
3.59
4.28
3.77
3.67
4.08
3.92
3.66
3.84
3.9
3.71
3.72
3.9
4.06
3.91
3.62
3.53
3.63
3.95
3.67
3.84
3.83
3.64
3.89
3.84
4.07
3.71
4.07
3.48
3.78
4.22
3.67
3.71
3.56
3.88
3.7
3.67
3.48
3.83
4.2
3.92
3.38
3.71
3.96
3.44
3.77
3.74
3.76
3.59
3.84
3.32
4.3
3.75
4.07
3.85
3.66
3.66
3.59
4.06
3.66
3.6
10037:
3.87
3.36
3.54
3.79
3.72
3.75
3.49
3.22
3.54
3.75
3.54
3.53
3.34
3.56
10038:
3.98
3.37
3.43
3.36
3.42
3.66
3.66
3.32
10039:
2.59
0.96
