..................
----------------------------------------------------------------------
Ran 18 tests in 0.679s

OK
Name             Stmts   Miss Branch BrPart  Cover   Missing
------------------------------------------------------------
Collatz.py          64      3     24      1    95%   45-47, 44->45
TestCollatz.py      75      0      0      0   100%
------------------------------------------------------------
TOTAL              139      3     24      1    98%
