.................
----------------------------------------------------------------------
Ran 17 tests in 0.316s

OK
Name             Stmts   Miss Branch BrPart  Cover   Missing
------------------------------------------------------------
Collatz.py          40      1     18      1    97%   190, 189->190
TestCollatz.py      72      0      0      0   100%
------------------------------------------------------------
TOTAL              112      1     18      1    98%
