1 10 20
100 200 125
201 210 89
900 1000 174
10000 1 262
20 1 21
33 45 110
23 9999 262
300032 213 443
3405 5000 238
45000 6788 324
460000 567832 470
39 67 113
2312 345334 443
1102 4444 238
1111 2222 182
3333 4444 238
5555 6666 262
7777 7777 84
8888 8888 35
9999 9999 92
4323 38493 324
154 287 128
498 4000 238
234 893 179
545 9898 262
21312 4534 279
4000 4000 114
10 10 7
500 789 171
321 452 144
456 897 179
563 364 142
9000 10000 260
45000 90000 351
1000 5000 238
2000 10000 262
3000 15000 276
4000 20000 279
5000 25000 282
6000 30000 308
7000 35000 311
8000 40000 324
9000 45000 324
10000 50000 324
15000 55000 340
20000 60000 340
25000 65000 340
26000 70000 340
27000 75000 340
28000 80000 351
29000 85000 351
30000 90000 351
31000 95000 351
32000 100000 351
200000 200200 311
302000 310000 371
304000 320000 384
306000 330000 384
308000 340000 384
310000 350000 441
312000 360000 441
314000 370000 441
316000 380000 441
318000 390000 441
320000 400000 441
111 222 125
222 333 144
444 555 142
666 666 114
666 777 171
777 888 179
888 999 174
6666 6680 182
10000 20000 279
76 98 119
34 68 113
1223 45485 324
5000 5050 179
5001 5100 179
5002 5150 179
5003 5200 179
5004 5250 179
5005 5300 192
5006 5350 192
5007 5400 192
5008 5450 192
5009 5500 192
5010 5550 205
5011 5600 236
5022 5650 236
7777 7900 221
7777 7950 221
8888 45 262
23443 56 279
45 99992 351
621 768 171
1115 567 179
99992 53212 351
34 9933 262
12345 6789 268