layer, type, min_zoom, max_zoom
land,,0,14
foreshore,,9,14
greenspace,,10,14
woodland,,6,14
national_parks,,5,14
surfacewater,,6,14
urban_areas,,5,10
local_buildings,,11,14
district_buildings,,9,10
contours,Normal,12,14
contours,Index,9,14
airports,,10,14
boundaries,,5,14
waterlines,National,8,8
waterlines,Regional,9,9
waterlines,District,10,11
waterlines,Local,12,14
waterlines,MHW,9,14
waterlines,MLW,9,14
etl,,12,14
sites,,11,14
rail,Multi Track,10,14
rail,Single Track,10,14
rail,Narrow Gauge,14,14
rail,Tunnel,10,14
railway_stations,,12,14
roads_local,Minor,11,14
roads_local,Restricted,12,14
roads_local,Local,12,14
roads_local,Guided Busway,8,14
roads_regional,A Road,8,14
roads_regional,B Road,10,14
roads_regional,Tunnel,9,14
roads_national,,5,14
names,Country,5,14
names,Capital,5,14
names,National Park,6,14
names,City,6,14
names,Town,7,14
names,Village,9,14
names,Hamlet,9,14
names,Small Settlements,12,14
names,Suburban Area,10,14
names,Woodland,11,14
names,Landform,11,14
names,Landcover,11,14
names,Water,11,14
names,Greenspace,13,14
names,Sites,13,14
names,Motorway Junctions,14,14
