{
    "version": 8,
    "name": "OS Open Zoomstack - Outdoor",
    "metadata": {
        "mapbox:autocomposite": true,
        "mapbox:type": "template",
        "mapbox:sdk-support": {
            "js": "0.50.0",
            "android": "6.7.0",
            "ios": "4.6.0"
        },
        "mapbox:groups": {
            "e196265c0e550aaddd2885dc32fdb674": {
                "name": "Names Group",
                "collapsed": false
            },
            "2a680f24b0d35061ed7d21fd33c9cf08": {
                "name": "Road Level 0 Group",
                "collapsed": true
            },
            "52c81d2ff926c87a0714f2697b2f3694": {
                "name": "Road Level 1 Group",
                "collapsed": true
            },
            "0845f59ef0d52359da6fd788b079f747": {
                "name": "Road Level 2 Group",
                "collapsed": true
            },
            "beaf4956fb8a63410ecf80abdebcdfb5": {
                "name": "Road Names Group",
                "collapsed": true
            }
        }
    },
    "center": [-1.7245239450279541, 52.53946123863224],
    "zoom": 14.693012568240825,
    "bearing": -4.923841430083372,
    "pitch": 4.5,
    "light": {"intensity": 0.25, "color": "hsl(0, 0%, 100%)"},
    "sources": {
        "composite": {
            "url": "mapbox://ADD-SOURCE-URL-HERE",
            "type": "vector"
        }
    },
    "sprite": "/sprites/sprites",
    "glyphs": "/fonts/{fontstack}/{range}.pbf",
    "layers": [
        {
            "id": "background",
            "type": "background",
            "paint": {"background-color": "#f5f5f0"}
        },
        {
            "id": "sea shadow",
            "type": "fill",
            "source": "composite",
            "source-layer": "sea",
            "minzoom": 9,
            "layout": {},
            "paint": {
                "fill-color": "#3fb3d9",
                "fill-translate": [
                    "interpolate",
                    ["linear"],
                    ["zoom"],
                    9,
                    ["literal", [-0.5, -0.5]],
                    15,
                    ["literal", [-1, -1]]
                ],
                "fill-translate-anchor": "viewport"
            }
        },
        {
            "id": "sea",
            "type": "fill",
            "source": "composite",
            "source-layer": "sea",
            "layout": {},
            "paint": {"fill-color": "#a9ddef"}
        },
        {
            "id": "national-parks",
            "type": "fill",
            "source": "composite",
            "source-layer": "national_parks",
            "maxzoom": 12,
            "layout": {},
            "paint": {
                "fill-color": "hsla(84, 51%, 87%, 0.7)",
                "fill-opacity": [
                    "interpolate",
                    ["linear"],
                    ["zoom"],
                    9,
                    1,
                    12,
                    0.1
                ]
            }
        },
        {
            "id": "urban-areas",
            "type": "fill",
            "source": "composite",
            "source-layer": "urban_areas",
            "maxzoom": 11,
            "layout": {},
            "paint": {
                "fill-color": "hsl(46, 24%, 82%)",
                "fill-opacity": [
                    "interpolate",
                    ["linear"],
                    ["zoom"],
                    6,
                    0.4,
                    11,
                    0.6
                ]
            }
        },
        {
            "id": "sites",
            "type": "fill",
            "source": "composite",
            "source-layer": "sites",
            "layout": {},
            "paint": {
                "fill-color": [
                    "match",
                    ["get", "type"],
                    ["Air Transport"],
                    "#e6e6e6",
                    ["Education"],
                    "#f7eaca",
                    ["Medical Care"],
                    "#f3d8e7",
                    ["Road Transport"],
                    "#f7f3ca",
                    ["Water Transport"],
                    "#d8e6f3",
                    "#e6e6e6"
                ],
                "fill-opacity": 0.7
            }
        },
        {
            "id": "greenspace",
            "type": "fill",
            "source": "composite",
            "source-layer": "greenspaces",
            "layout": {},
            "paint": {"fill-color": "#e3f0db", "fill-antialias": false}
        },
        {
            "id": "greenspace outlines",
            "type": "line",
            "source": "composite",
            "source-layer": "greenspaces",
            "layout": {"line-join": "round"},
            "paint": {
                "line-color": "#b9dba4",
                "line-width": [
                    "interpolate",
                    ["linear"],
                    ["zoom"],
                    10,
                    0.1,
                    15,
                    0.3,
                    18,
                    0.6
                ]
            }
        },
        {
            "id": "woodland",
            "type": "fill",
            "source": "composite",
            "source-layer": "woodland",
            "layout": {},
            "paint": {
                "fill-color": "hsl(97, 43%, 84%)",
                "fill-opacity": [
                    "interpolate",
                    ["linear"],
                    ["zoom"],
                    6,
                    0.5,
                    12,
                    1
                ]
            }
        },
        {
            "id": "contours",
            "type": "line",
            "source": "composite",
            "source-layer": "contours",
            "layout": {"line-join": "round"},
            "paint": {
                "line-color": "#857660",
                "line-opacity": [
                    "interpolate",
                    ["linear"],
                    ["zoom"],
                    9,
                    0.25,
                    12,
                    0.45,
                    13,
                    0.7
                ],
                "line-width": [
                    "match",
                    ["get", "type"],
                    ["Normal"],
                    0.25,
                    ["Index"],
                    0.5,
                    0.2
                ]
            }
        },
        {
            "id": "surfacewater shadow",
            "type": "fill",
            "source": "composite",
            "source-layer": "surfacewater",
            "minzoom": 9,
            "layout": {},
            "paint": {
                "fill-color": "#3fb3d9",
                "fill-translate": [
                    "interpolate",
                    ["linear"],
                    ["zoom"],
                    9,
                    ["literal", [-0.5, -0.5]],
                    15,
                    ["literal", [-1, -1]]
                ],
                "fill-translate-anchor": "viewport"
            }
        },
        {
            "id": "surfacewater",
            "type": "fill",
            "source": "composite",
            "source-layer": "surfacewater",
            "layout": {},
            "paint": {"fill-color": "#a9ddef"}
        },
        {
            "id": "foreshore",
            "type": "fill",
            "source": "composite",
            "source-layer": "foreshore",
            "layout": {},
            "paint": {"fill-color": "hsl(60, 36%, 87%)"}
        },
        {
            "id": "waterlines",
            "type": "line",
            "source": "composite",
            "source-layer": "waterlines",
            "layout": {"line-join": "round"},
            "paint": {
                "line-color": "#a4daeb",
                "line-width": [
                    "match",
                    ["get", "type"],
                    ["National", "Regional", "District", "Local"],
                    1,
                    ["MHW"],
                    1.2,
                    ["MLW"],
                    0.7,
                    1
                ]
            }
        },
        {
            "id": "buildings 2D",
            "type": "fill",
            "source": "composite",
            "source-layer": "buildings",
            "maxzoom": 14,
            "layout": {},
            "paint": {
                "fill-color": "hsl(46, 24%, 82%)",
                "fill-translate": [0, 0]
            }
        },
        {
            "id": "roads 0 Restricted Road",
            "type": "line",
            "metadata": {"mapbox:group": "2a680f24b0d35061ed7d21fd33c9cf08"},
            "source": "composite",
            "source-layer": "roads",
            "filter": [
                "all",
                ["==", ["get", "level"], 0],
                ["match", ["get", "type"], ["Restricted"], true, false]
            ],
            "layout": {"line-join": "round"},
            "paint": {
                "line-color": "hsl(0, 0%, 100%)",
                "line-width": [
                    "interpolate",
                    ["linear"],
                    ["zoom"],
                    12,
                    1,
                    14,
                    2.5,
                    15,
                    4,
                    16,
                    7,
                    18,
                    24,
                    22,
                    85
                ],
                "line-opacity": 1,
                "line-dasharray": [2, 0.5]
            }
        },
        {
            "id": "roads 0 Local Road",
            "type": "line",
            "metadata": {"mapbox:group": "2a680f24b0d35061ed7d21fd33c9cf08"},
            "source": "composite",
            "source-layer": "roads",
            "filter": [
                "all",
                ["==", ["get", "level"], 0],
                ["match", ["get", "type"], ["Local"], true, false]
            ],
            "layout": {"line-cap": "round", "line-join": "round"},
            "paint": {
                "line-width": [
                    "interpolate",
                    ["linear"],
                    ["zoom"],
                    12,
                    1.4,
                    14,
                    3.5,
                    15,
                    5,
                    16,
                    12,
                    18,
                    35,
                    22,
                    100
                ],
                "line-color": "#ffffff"
            }
        },
        {
            "id": "roads 0 Guided Busway Casing",
            "type": "line",
            "metadata": {"mapbox:group": "2a680f24b0d35061ed7d21fd33c9cf08"},
            "source": "composite",
            "source-layer": "roads",
            "filter": [
                "all",
                ["==", ["get", "level"], 0],
                ["match", ["get", "type"], ["Guided Busway"], true, false]
            ],
            "layout": {"line-cap": "round", "line-join": "round"},
            "paint": {
                "line-width": [
                    "interpolate",
                    ["linear"],
                    ["zoom"],
                    5,
                    0.35,
                    10,
                    1.5,
                    12,
                    1.7,
                    14,
                    3.5,
                    15,
                    5,
                    16,
                    12,
                    18,
                    35,
                    22,
                    100
                ],
                "line-color": "#ffffff"
            }
        },
        {
            "id": "roads 0 Guided Busway Centreline",
            "type": "line",
            "metadata": {"mapbox:group": "2a680f24b0d35061ed7d21fd33c9cf08"},
            "source": "composite",
            "source-layer": "roads",
            "filter": [
                "all",
                ["==", ["get", "level"], 0],
                ["match", ["get", "type"], ["Guided Busway"], true, false]
            ],
            "layout": {"line-cap": "round", "line-join": "round"},
            "paint": {
                "line-width": [
                    "interpolate",
                    ["linear"],
                    ["zoom"],
                    8,
                    0.1,
                    10,
                    0.2,
                    12,
                    0.2,
                    14,
                    0.4,
                    15,
                    0.6,
                    16,
                    0.75,
                    18,
                    3,
                    22,
                    10
                ],
                "line-color": "#dbd9dd"
            }
        },
        {
            "id": "roads 0 Motorway",
            "type": "line",
            "metadata": {"mapbox:group": "2a680f24b0d35061ed7d21fd33c9cf08"},
            "source": "composite",
            "source-layer": "roads",
            "filter": [
                "all",
                ["==", ["get", "level"], 0],
                ["match", ["get", "type"], ["Motorway"], true, false]
            ],
            "layout": {"line-cap": "round", "line-join": "round"},
            "paint": {
                "line-width": [
                    "interpolate",
                    ["linear"],
                    ["zoom"],
                    5,
                    0.75,
                    10,
                    2,
                    12,
                    2.75,
                    14,
                    4.5,
                    15,
                    8,
                    16,
                    17,
                    18,
                    48,
                    22,
                    140
                ],
                "line-color": "hsl(193, 93%, 47%)"
            }
        },
        {
            "id": "roads 0 Minor Road",
            "type": "line",
            "metadata": {"mapbox:group": "2a680f24b0d35061ed7d21fd33c9cf08"},
            "source": "composite",
            "source-layer": "roads",
            "filter": [
                "all",
                ["==", ["get", "level"], 0],
                ["match", ["get", "type"], ["Minor"], true, false]
            ],
            "layout": {"line-cap": "round", "line-join": "round"},
            "paint": {
                "line-width": [
                    "interpolate",
                    ["linear"],
                    ["zoom"],
                    5,
                    0.35,
                    10,
                    1.5,
                    12,
                    1.7,
                    14,
                    3.5,
                    15,
                    6.5,
                    16,
                    15,
                    18,
                    44,
                    22,
                    120
                ],
                "line-color": "hsl(0, 0%, 100%)"
            }
        },
        {
            "id": "roads 0 B Road",
            "type": "line",
            "metadata": {"mapbox:group": "2a680f24b0d35061ed7d21fd33c9cf08"},
            "source": "composite",
            "source-layer": "roads",
            "filter": [
                "all",
                ["==", ["get", "level"], 0],
                ["match", ["get", "type"], ["B Road"], true, false]
            ],
            "layout": {"line-cap": "round", "line-join": "round"},
            "paint": {
                "line-width": [
                    "interpolate",
                    ["linear"],
                    ["zoom"],
                    5,
                    0.35,
                    10,
                    1.5,
                    12,
                    1.7,
                    14,
                    3.5,
                    15,
                    6.5,
                    16,
                    15,
                    18,
                    44,
                    22,
                    120
                ],
                "line-color": "hsl(0, 0%, 100%)"
            }
        },
        {
            "id": "roads 0 A Road",
            "type": "line",
            "metadata": {"mapbox:group": "2a680f24b0d35061ed7d21fd33c9cf08"},
            "source": "composite",
            "source-layer": "roads",
            "filter": [
                "all",
                ["==", ["get", "level"], 0],
                ["match", ["get", "type"], ["A Road"], true, false]
            ],
            "layout": {"line-cap": "round", "line-join": "round"},
            "paint": {
                "line-width": [
                    "interpolate",
                    ["linear"],
                    ["zoom"],
                    5,
                    0.35,
                    10,
                    1.5,
                    12,
                    1.7,
                    14,
                    3.5,
                    15,
                    6.5,
                    16,
                    15,
                    18,
                    44,
                    22,
                    120
                ],
                "line-color": "hsl(0, 0%, 100%)"
            }
        },
        {
            "id": "roads 0 Primary Road",
            "type": "line",
            "metadata": {"mapbox:group": "2a680f24b0d35061ed7d21fd33c9cf08"},
            "source": "composite",
            "source-layer": "roads",
            "filter": [
                "all",
                ["==", ["get", "level"], 0],
                ["match", ["get", "type"], ["Primary"], true, false]
            ],
            "layout": {"line-cap": "round", "line-join": "round"},
            "paint": {
                "line-width": [
                    "interpolate",
                    ["linear"],
                    ["zoom"],
                    5,
                    0.5,
                    10,
                    1.75,
                    12,
                    2,
                    14,
                    4,
                    15,
                    7.5,
                    16,
                    16,
                    18,
                    46,
                    22,
                    130
                ],
                "line-color": "#77c776",
                "line-opacity": [
                    "interpolate",
                    ["linear"],
                    ["zoom"],
                    5,
                    0.6,
                    9,
                    1
                ]
            }
        },
        {
            "id": "roads 1 Local Road Casing",
            "type": "line",
            "metadata": {"mapbox:group": "52c81d2ff926c87a0714f2697b2f3694"},
            "source": "composite",
            "source-layer": "roads",
            "filter": [
                "all",
                ["match", ["get", "level"], [1], true, false],
                ["match", ["get", "type"], ["Local"], true, false]
            ],
            "layout": {"line-join": "round"},
            "paint": {
                "line-width": [
                    "interpolate",
                    ["linear"],
                    ["zoom"],
                    12,
                    2.2,
                    14,
                    5,
                    15,
                    7,
                    16,
                    18,
                    18,
                    48,
                    22,
                    140
                ],
                "line-color": "#ebebe0"
            }
        },
        {
            "id": "roads 1 Minor Road Casing",
            "type": "line",
            "metadata": {"mapbox:group": "52c81d2ff926c87a0714f2697b2f3694"},
            "source": "composite",
            "source-layer": "roads",
            "filter": [
                "all",
                ["match", ["get", "level"], [1], true, false],
                ["match", ["get", "type"], ["Minor"], true, false]
            ],
            "layout": {"line-join": "round"},
            "paint": {
                "line-width": [
                    "interpolate",
                    ["linear"],
                    ["zoom"],
                    5,
                    0.35,
                    10,
                    2,
                    12,
                    3,
                    14,
                    6.5,
                    15,
                    10,
                    16,
                    23,
                    18,
                    58,
                    22,
                    160
                ],
                "line-color": "#ebebe0"
            }
        },
        {
            "id": "roads 1 B Road Casing",
            "type": "line",
            "metadata": {"mapbox:group": "52c81d2ff926c87a0714f2697b2f3694"},
            "source": "composite",
            "source-layer": "roads",
            "filter": [
                "all",
                ["match", ["get", "level"], [1], true, false],
                ["match", ["get", "type"], ["B Road"], true, false]
            ],
            "layout": {"line-join": "round"},
            "paint": {
                "line-width": [
                    "interpolate",
                    ["linear"],
                    ["zoom"],
                    5,
                    0.35,
                    10,
                    2,
                    12,
                    3,
                    14,
                    6.5,
                    15,
                    10,
                    16,
                    23,
                    18,
                    58,
                    22,
                    160
                ],
                "line-color": "#ebebe0"
            }
        },
        {
            "id": "roads 1 A Road Casing",
            "type": "line",
            "metadata": {"mapbox:group": "52c81d2ff926c87a0714f2697b2f3694"},
            "source": "composite",
            "source-layer": "roads",
            "filter": [
                "all",
                ["match", ["get", "level"], [1], true, false],
                ["match", ["get", "type"], ["A Road"], true, false]
            ],
            "layout": {"line-join": "round"},
            "paint": {
                "line-width": [
                    "interpolate",
                    ["linear"],
                    ["zoom"],
                    5,
                    0.35,
                    10,
                    2,
                    12,
                    3,
                    14,
                    6.5,
                    15,
                    10,
                    16,
                    23,
                    18,
                    58,
                    22,
                    160
                ],
                "line-color": "#ebebe0"
            }
        },
        {
            "id": "roads 1 Primary Road Casing",
            "type": "line",
            "metadata": {"mapbox:group": "52c81d2ff926c87a0714f2697b2f3694"},
            "source": "composite",
            "source-layer": "roads",
            "filter": [
                "all",
                ["match", ["get", "level"], [1], true, false],
                ["match", ["get", "type"], ["Primary"], true, false]
            ],
            "layout": {"line-join": "round"},
            "paint": {
                "line-width": [
                    "interpolate",
                    ["linear"],
                    ["zoom"],
                    5,
                    0.35,
                    10,
                    2,
                    12,
                    3,
                    14,
                    6.5,
                    15,
                    10,
                    16,
                    23,
                    18,
                    58,
                    22,
                    160
                ],
                "line-color": "#ebebe0",
                "line-opacity": [
                    "interpolate",
                    ["linear"],
                    ["zoom"],
                    5,
                    0.4,
                    9,
                    1
                ]
            }
        },
        {
            "id": "roads 1 Motorway Casing",
            "type": "line",
            "metadata": {"mapbox:group": "52c81d2ff926c87a0714f2697b2f3694"},
            "source": "composite",
            "source-layer": "roads",
            "filter": [
                "all",
                ["match", ["get", "level"], [1], true, false],
                ["match", ["get", "type"], ["Motorway"], true, false]
            ],
            "layout": {"line-join": "round"},
            "paint": {
                "line-width": [
                    "interpolate",
                    ["linear"],
                    ["zoom"],
                    5,
                    0.35,
                    10,
                    2,
                    12,
                    3,
                    14,
                    6.5,
                    15,
                    10,
                    16,
                    23,
                    18,
                    58,
                    22,
                    160
                ],
                "line-color": "#ebebe0"
            }
        },
        {
            "id": "roads 1 Restricted Road",
            "type": "line",
            "metadata": {"mapbox:group": "52c81d2ff926c87a0714f2697b2f3694"},
            "source": "composite",
            "source-layer": "roads",
            "filter": [
                "all",
                ["match", ["get", "level"], [1], true, false],
                ["match", ["get", "type"], ["Restricted"], true, false]
            ],
            "layout": {"line-join": "round"},
            "paint": {
                "line-color": "hsl(0, 0%, 100%)",
                "line-width": [
                    "interpolate",
                    ["linear"],
                    ["zoom"],
                    12,
                    1,
                    14,
                    2.5,
                    15,
                    4,
                    16,
                    7,
                    18,
                    24,
                    22,
                    85
                ],
                "line-opacity": 1,
                "line-dasharray": [2, 0.5]
            }
        },
        {
            "id": "roads 1 Local Road",
            "type": "line",
            "metadata": {"mapbox:group": "52c81d2ff926c87a0714f2697b2f3694"},
            "source": "composite",
            "source-layer": "roads",
            "filter": [
                "all",
                ["match", ["get", "level"], [1], true, false],
                ["match", ["get", "type"], ["Local"], true, false]
            ],
            "layout": {"line-cap": "round", "line-join": "round"},
            "paint": {
                "line-width": [
                    "interpolate",
                    ["linear"],
                    ["zoom"],
                    12,
                    1.4,
                    14,
                    3.5,
                    15,
                    5,
                    16,
                    12,
                    18,
                    35,
                    22,
                    100
                ],
                "line-color": "#ffffff"
            }
        },
        {
            "id": "roads 1 Guided Busway Casing",
            "type": "line",
            "metadata": {"mapbox:group": "52c81d2ff926c87a0714f2697b2f3694"},
            "source": "composite",
            "source-layer": "roads",
            "filter": [
                "all",
                ["match", ["get", "level"], [1], true, false],
                ["match", ["get", "type"], ["Guided Busway"], true, false]
            ],
            "layout": {"line-cap": "round", "line-join": "round"},
            "paint": {
                "line-width": [
                    "interpolate",
                    ["linear"],
                    ["zoom"],
                    5,
                    0.35,
                    10,
                    1.5,
                    12,
                    1.7,
                    14,
                    3.5,
                    15,
                    5,
                    16,
                    12,
                    18,
                    35,
                    22,
                    100
                ],
                "line-color": "#ffffff"
            }
        },
        {
            "id": "roads 1 Guided Busway Centreline",
            "type": "line",
            "metadata": {"mapbox:group": "52c81d2ff926c87a0714f2697b2f3694"},
            "source": "composite",
            "source-layer": "roads",
            "filter": [
                "all",
                ["match", ["get", "level"], [1], true, false],
                ["match", ["get", "type"], ["Guided Busway"], true, false]
            ],
            "layout": {"line-cap": "round", "line-join": "round"},
            "paint": {
                "line-width": [
                    "interpolate",
                    ["linear"],
                    ["zoom"],
                    8,
                    0.1,
                    10,
                    0.2,
                    12,
                    0.2,
                    14,
                    0.4,
                    15,
                    0.6,
                    16,
                    0.75,
                    18,
                    3,
                    22,
                    10
                ],
                "line-color": "#dbd9dd"
            }
        },
        {
            "id": "roads 1 Motorway",
            "type": "line",
            "metadata": {"mapbox:group": "52c81d2ff926c87a0714f2697b2f3694"},
            "source": "composite",
            "source-layer": "roads",
            "filter": [
                "all",
                ["match", ["get", "level"], [1], true, false],
                ["match", ["get", "type"], ["Motorway"], true, false]
            ],
            "layout": {"line-cap": "round", "line-join": "round"},
            "paint": {
                "line-width": [
                    "interpolate",
                    ["linear"],
                    ["zoom"],
                    5,
                    0.75,
                    10,
                    2,
                    12,
                    2.75,
                    14,
                    4.5,
                    15,
                    8,
                    16,
                    17,
                    18,
                    48,
                    22,
                    140
                ],
                "line-color": "hsl(193, 93%, 47%)"
            }
        },
        {
            "id": "roads 1 Minor Road",
            "type": "line",
            "metadata": {"mapbox:group": "52c81d2ff926c87a0714f2697b2f3694"},
            "source": "composite",
            "source-layer": "roads",
            "filter": [
                "all",
                ["match", ["get", "level"], [1], true, false],
                ["match", ["get", "type"], ["Minor"], true, false]
            ],
            "layout": {"line-cap": "round", "line-join": "round"},
            "paint": {
                "line-width": [
                    "interpolate",
                    ["linear"],
                    ["zoom"],
                    5,
                    0.35,
                    10,
                    1.5,
                    12,
                    1.7,
                    14,
                    3.5,
                    15,
                    6.5,
                    16,
                    15,
                    18,
                    44,
                    22,
                    120
                ],
                "line-color": "hsl(0, 0%, 100%)"
            }
        },
        {
            "id": "roads 1 B Road",
            "type": "line",
            "metadata": {"mapbox:group": "52c81d2ff926c87a0714f2697b2f3694"},
            "source": "composite",
            "source-layer": "roads",
            "filter": [
                "all",
                ["match", ["get", "level"], [1], true, false],
                ["match", ["get", "type"], ["B Road"], true, false]
            ],
            "layout": {"line-cap": "round", "line-join": "round"},
            "paint": {
                "line-width": [
                    "interpolate",
                    ["linear"],
                    ["zoom"],
                    5,
                    0.35,
                    10,
                    1.5,
                    12,
                    1.7,
                    14,
                    3.5,
                    15,
                    6.5,
                    16,
                    15,
                    18,
                    44,
                    22,
                    120
                ],
                "line-color": "hsl(0, 0%, 100%)"
            }
        },
        {
            "id": "roads 1 A Road",
            "type": "line",
            "metadata": {"mapbox:group": "52c81d2ff926c87a0714f2697b2f3694"},
            "source": "composite",
            "source-layer": "roads",
            "filter": [
                "all",
                ["match", ["get", "level"], [1], true, false],
                ["match", ["get", "type"], ["A Road"], true, false]
            ],
            "layout": {"line-cap": "round", "line-join": "round"},
            "paint": {
                "line-width": [
                    "interpolate",
                    ["linear"],
                    ["zoom"],
                    5,
                    0.35,
                    10,
                    1.5,
                    12,
                    1.7,
                    14,
                    3.5,
                    15,
                    6.5,
                    16,
                    15,
                    18,
                    44,
                    22,
                    120
                ],
                "line-color": "hsl(0, 0%, 100%)"
            }
        },
        {
            "id": "roads 1 Primary Road",
            "type": "line",
            "metadata": {"mapbox:group": "52c81d2ff926c87a0714f2697b2f3694"},
            "source": "composite",
            "source-layer": "roads",
            "filter": [
                "all",
                ["match", ["get", "level"], [1], true, false],
                ["match", ["get", "type"], ["Primary"], true, false]
            ],
            "layout": {"line-join": "round", "line-cap": "round"},
            "paint": {
                "line-width": [
                    "interpolate",
                    ["linear"],
                    ["zoom"],
                    5,
                    0.5,
                    10,
                    1.75,
                    12,
                    2,
                    14,
                    4,
                    15,
                    7.5,
                    16,
                    16,
                    18,
                    46,
                    22,
                    130
                ],
                "line-color": "#77c776",
                "line-opacity": [
                    "interpolate",
                    ["linear"],
                    ["zoom"],
                    5,
                    0.6,
                    9,
                    1
                ]
            }
        },
        {
            "id": "roads 2 Local Road Casing",
            "type": "line",
            "metadata": {"mapbox:group": "0845f59ef0d52359da6fd788b079f747"},
            "source": "composite",
            "source-layer": "roads",
            "filter": [
                "all",
                ["match", ["get", "level"], [2], true, false],
                ["match", ["get", "type"], ["Local"], true, false]
            ],
            "layout": {"line-join": "round"},
            "paint": {
                "line-width": [
                    "interpolate",
                    ["linear"],
                    ["zoom"],
                    12,
                    2.2,
                    14,
                    5,
                    15,
                    7,
                    16,
                    18,
                    18,
                    48,
                    22,
                    140
                ],
                "line-color": "#ebebe0"
            }
        },
        {
            "id": "roads 2 Minor Road Casing",
            "type": "line",
            "metadata": {"mapbox:group": "0845f59ef0d52359da6fd788b079f747"},
            "source": "composite",
            "source-layer": "roads",
            "filter": [
                "all",
                ["match", ["get", "level"], [2], true, false],
                ["match", ["get", "type"], ["Minor"], true, false]
            ],
            "layout": {"line-join": "round"},
            "paint": {
                "line-width": [
                    "interpolate",
                    ["linear"],
                    ["zoom"],
                    5,
                    0.35,
                    10,
                    2,
                    12,
                    3,
                    14,
                    6.5,
                    15,
                    10,
                    16,
                    23,
                    18,
                    58,
                    22,
                    160
                ],
                "line-color": "#ebebe0"
            }
        },
        {
            "id": "roads 2 B Road Casing",
            "type": "line",
            "metadata": {"mapbox:group": "0845f59ef0d52359da6fd788b079f747"},
            "source": "composite",
            "source-layer": "roads",
            "filter": [
                "all",
                ["match", ["get", "level"], [2], true, false],
                ["match", ["get", "type"], ["B Road"], true, false]
            ],
            "layout": {"line-join": "round"},
            "paint": {
                "line-width": [
                    "interpolate",
                    ["linear"],
                    ["zoom"],
                    5,
                    0.35,
                    10,
                    2,
                    12,
                    3,
                    14,
                    6.5,
                    15,
                    10,
                    16,
                    23,
                    18,
                    58,
                    22,
                    160
                ],
                "line-color": "#ebebe0"
            }
        },
        {
            "id": "roads 2 A Road Casing",
            "type": "line",
            "metadata": {"mapbox:group": "0845f59ef0d52359da6fd788b079f747"},
            "source": "composite",
            "source-layer": "roads",
            "filter": [
                "all",
                ["match", ["get", "level"], [2], true, false],
                ["match", ["get", "type"], ["A Road"], true, false]
            ],
            "layout": {"line-join": "round"},
            "paint": {
                "line-width": [
                    "interpolate",
                    ["linear"],
                    ["zoom"],
                    5,
                    0.35,
                    10,
                    2,
                    12,
                    3,
                    14,
                    6.5,
                    15,
                    10,
                    16,
                    23,
                    18,
                    58,
                    22,
                    160
                ],
                "line-color": "#ebebe0"
            }
        },
        {
            "id": "roads 2 Primary Road Casing",
            "type": "line",
            "metadata": {"mapbox:group": "0845f59ef0d52359da6fd788b079f747"},
            "source": "composite",
            "source-layer": "roads",
            "filter": [
                "all",
                ["match", ["get", "level"], [2], true, false],
                ["match", ["get", "type"], ["Primary"], true, false]
            ],
            "layout": {"line-join": "round"},
            "paint": {
                "line-width": [
                    "interpolate",
                    ["linear"],
                    ["zoom"],
                    5,
                    0.35,
                    10,
                    2,
                    12,
                    3,
                    14,
                    6.5,
                    15,
                    10,
                    16,
                    23,
                    18,
                    58,
                    22,
                    160
                ],
                "line-color": "#ebebe0",
                "line-opacity": [
                    "interpolate",
                    ["linear"],
                    ["zoom"],
                    5,
                    0.4,
                    9,
                    1
                ]
            }
        },
        {
            "id": "roads 2 Motorway Casing",
            "type": "line",
            "metadata": {"mapbox:group": "0845f59ef0d52359da6fd788b079f747"},
            "source": "composite",
            "source-layer": "roads",
            "filter": [
                "all",
                ["match", ["get", "level"], [2], true, false],
                ["match", ["get", "type"], ["Motorway"], true, false]
            ],
            "layout": {"line-join": "round"},
            "paint": {
                "line-width": [
                    "interpolate",
                    ["linear"],
                    ["zoom"],
                    5,
                    0.35,
                    10,
                    2,
                    12,
                    3,
                    14,
                    6.5,
                    15,
                    10,
                    16,
                    23,
                    18,
                    58,
                    22,
                    160
                ],
                "line-color": "#ebebe0"
            }
        },
        {
            "id": "roads 2 Restricted Road",
            "type": "line",
            "metadata": {"mapbox:group": "0845f59ef0d52359da6fd788b079f747"},
            "source": "composite",
            "source-layer": "roads",
            "filter": [
                "all",
                ["match", ["get", "level"], [2], true, false],
                ["match", ["get", "type"], ["Restricted"], true, false]
            ],
            "layout": {"line-join": "round"},
            "paint": {
                "line-color": "hsl(0, 0%, 100%)",
                "line-width": [
                    "interpolate",
                    ["linear"],
                    ["zoom"],
                    12,
                    1,
                    14,
                    2.5,
                    15,
                    4,
                    16,
                    7,
                    18,
                    24,
                    22,
                    85
                ],
                "line-opacity": 1,
                "line-dasharray": [2, 0.5]
            }
        },
        {
            "id": "roads 2 Local Road",
            "type": "line",
            "metadata": {"mapbox:group": "0845f59ef0d52359da6fd788b079f747"},
            "source": "composite",
            "source-layer": "roads",
            "filter": [
                "all",
                ["match", ["get", "level"], [2], true, false],
                ["match", ["get", "type"], ["Local"], true, false]
            ],
            "layout": {"line-cap": "round", "line-join": "round"},
            "paint": {
                "line-width": [
                    "interpolate",
                    ["linear"],
                    ["zoom"],
                    12,
                    1.4,
                    14,
                    3.5,
                    15,
                    5,
                    16,
                    12,
                    18,
                    35,
                    22,
                    100
                ],
                "line-color": "#ffffff"
            }
        },
        {
            "id": "roads 2 Guided Busway Casing",
            "type": "line",
            "metadata": {"mapbox:group": "0845f59ef0d52359da6fd788b079f747"},
            "source": "composite",
            "source-layer": "roads",
            "filter": [
                "all",
                ["match", ["get", "level"], [2], true, false],
                ["match", ["get", "type"], ["Guided Busway"], true, false]
            ],
            "layout": {"line-cap": "round", "line-join": "round"},
            "paint": {
                "line-width": [
                    "interpolate",
                    ["linear"],
                    ["zoom"],
                    5,
                    0.35,
                    10,
                    1.5,
                    12,
                    1.7,
                    14,
                    3.5,
                    15,
                    5,
                    16,
                    12,
                    18,
                    35,
                    22,
                    100
                ],
                "line-color": "#ffffff"
            }
        },
        {
            "id": "roads 2 Guided Busway Centreline",
            "type": "line",
            "metadata": {"mapbox:group": "0845f59ef0d52359da6fd788b079f747"},
            "source": "composite",
            "source-layer": "roads",
            "filter": [
                "all",
                ["match", ["get", "level"], [2], true, false],
                ["match", ["get", "type"], ["Guided Busway"], true, false]
            ],
            "layout": {"line-cap": "round", "line-join": "round"},
            "paint": {
                "line-width": [
                    "interpolate",
                    ["linear"],
                    ["zoom"],
                    8,
                    0.1,
                    10,
                    0.2,
                    12,
                    0.2,
                    14,
                    0.4,
                    15,
                    0.6,
                    16,
                    0.75,
                    18,
                    3,
                    22,
                    10
                ],
                "line-color": "#dbd9dd"
            }
        },
        {
            "id": "roads 2 Motorway",
            "type": "line",
            "metadata": {"mapbox:group": "0845f59ef0d52359da6fd788b079f747"},
            "source": "composite",
            "source-layer": "roads",
            "filter": [
                "all",
                ["match", ["get", "level"], [2], true, false],
                ["match", ["get", "type"], ["Motorway"], true, false]
            ],
            "layout": {"line-cap": "round", "line-join": "round"},
            "paint": {
                "line-width": [
                    "interpolate",
                    ["linear"],
                    ["zoom"],
                    5,
                    0.75,
                    10,
                    2,
                    12,
                    2.75,
                    14,
                    4.5,
                    15,
                    8,
                    16,
                    17,
                    18,
                    48,
                    22,
                    140
                ],
                "line-color": "hsl(193, 93%, 47%)"
            }
        },
        {
            "id": "roads 2 Minor Road",
            "type": "line",
            "metadata": {"mapbox:group": "0845f59ef0d52359da6fd788b079f747"},
            "source": "composite",
            "source-layer": "roads",
            "filter": [
                "all",
                ["match", ["get", "level"], [2], true, false],
                ["match", ["get", "type"], ["Minor"], true, false]
            ],
            "layout": {"line-cap": "round", "line-join": "round"},
            "paint": {
                "line-width": [
                    "interpolate",
                    ["linear"],
                    ["zoom"],
                    5,
                    0.35,
                    10,
                    1.5,
                    12,
                    1.7,
                    14,
                    3.5,
                    15,
                    6.5,
                    16,
                    15,
                    18,
                    44,
                    22,
                    120
                ],
                "line-color": "hsl(0, 0%, 100%)"
            }
        },
        {
            "id": "roads 2 B Road",
            "type": "line",
            "metadata": {"mapbox:group": "0845f59ef0d52359da6fd788b079f747"},
            "source": "composite",
            "source-layer": "roads",
            "filter": [
                "all",
                ["match", ["get", "level"], [2], true, false],
                ["match", ["get", "type"], ["B Road"], true, false]
            ],
            "layout": {"line-cap": "round", "line-join": "round"},
            "paint": {
                "line-width": [
                    "interpolate",
                    ["linear"],
                    ["zoom"],
                    5,
                    0.35,
                    10,
                    1.5,
                    12,
                    1.7,
                    14,
                    3.5,
                    15,
                    6.5,
                    16,
                    15,
                    18,
                    44,
                    22,
                    120
                ],
                "line-color": "hsl(0, 0%, 100%)"
            }
        },
        {
            "id": "roads 2 A Road",
            "type": "line",
            "metadata": {"mapbox:group": "0845f59ef0d52359da6fd788b079f747"},
            "source": "composite",
            "source-layer": "roads",
            "filter": [
                "all",
                ["match", ["get", "level"], [2], true, false],
                ["match", ["get", "type"], ["A Road"], true, false]
            ],
            "layout": {"line-cap": "round", "line-join": "round"},
            "paint": {
                "line-width": [
                    "interpolate",
                    ["linear"],
                    ["zoom"],
                    5,
                    0.35,
                    10,
                    1.5,
                    12,
                    1.7,
                    14,
                    3.5,
                    15,
                    6.5,
                    16,
                    15,
                    18,
                    44,
                    22,
                    120
                ],
                "line-color": "hsl(0, 0%, 100%)"
            }
        },
        {
            "id": "roads 2 Primary Road",
            "type": "line",
            "metadata": {"mapbox:group": "0845f59ef0d52359da6fd788b079f747"},
            "source": "composite",
            "source-layer": "roads",
            "filter": [
                "all",
                ["match", ["get", "level"], [2], true, false],
                ["match", ["get", "type"], ["Primary"], true, false]
            ],
            "layout": {"line-cap": "round", "line-join": "round"},
            "paint": {
                "line-width": [
                    "interpolate",
                    ["linear"],
                    ["zoom"],
                    5,
                    0.5,
                    10,
                    1.75,
                    12,
                    2,
                    14,
                    4,
                    15,
                    7.5,
                    16,
                    16,
                    18,
                    46,
                    22,
                    130
                ],
                "line-color": "#77c776",
                "line-opacity": [
                    "interpolate",
                    ["linear"],
                    ["zoom"],
                    5,
                    0.6,
                    9,
                    1
                ]
            }
        },
        {
            "id": "road Tunnels",
            "type": "line",
            "source": "composite",
            "source-layer": "roads",
            "filter": ["match", ["get", "type"], ["Tunnels"], true, false],
            "layout": {"line-cap": "round", "line-join": "round"},
            "paint": {
                "line-width": [
                    "interpolate",
                    ["linear"],
                    ["zoom"],
                    9,
                    0.5,
                    17,
                    2
                ],
                "line-color": "#4b4444",
                "line-opacity": [
                    "interpolate",
                    ["linear"],
                    ["zoom"],
                    9,
                    0.1,
                    14,
                    0.35
                ],
                "line-dasharray": [3, 2.5]
            }
        },
        {
            "id": "rail",
            "type": "line",
            "source": "composite",
            "source-layer": "rail",
            "filter": ["match", ["get", "type"], ["Tunnel"], false, true],
            "layout": {"line-join": "round"},
            "paint": {
                "line-color": "hsl(270, 3%, 58%)",
                "line-opacity": [
                    "interpolate",
                    ["linear"],
                    ["zoom"],
                    10,
                    0.2,
                    14,
                    1
                ],
                "line-width": [
                    "interpolate",
                    ["linear"],
                    ["zoom"],
                    10,
                    [
                        "match",
                        ["get", "type"],
                        ["Multi Track"],
                        0.6,
                        ["Single Track"],
                        0.5,
                        ["Narrow Gauge"],
                        0.4,
                        1
                    ],
                    17,
                    [
                        "match",
                        ["get", "type"],
                        ["Multi Track"],
                        2,
                        ["Single Track"],
                        1.5,
                        ["Narrow Gauge"],
                        1,
                        1
                    ]
                ]
            }
        },
        {
            "id": "rail tunnel",
            "type": "line",
            "source": "composite",
            "source-layer": "rail",
            "filter": ["match", ["get", "type"], ["Tunnel"], true, false],
            "layout": {"line-join": "round"},
            "paint": {
                "line-color": "hsl(270, 3%, 58%)",
                "line-opacity": [
                    "interpolate",
                    ["linear"],
                    ["zoom"],
                    10,
                    0.2,
                    14,
                    0.6
                ],
                "line-width": [
                    "interpolate",
                    ["linear"],
                    ["zoom"],
                    10,
                    0.6,
                    17,
                    1.5
                ],
                "line-dasharray": [5, 3]
            }
        },
        {
            "id": "buildings 3D",
            "type": "fill-extrusion",
            "source": "composite",
            "source-layer": "buildings",
            "minzoom": 14,
            "layout": {},
            "paint": {
                "fill-extrusion-color": "#dcd7c6",
                "fill-extrusion-height": [
                    "interpolate",
                    ["linear"],
                    ["zoom"],
                    14,
                    0,
                    15,
                    8
                ]
            }
        },
        {
            "id": "boundaries",
            "type": "line",
            "source": "composite",
            "source-layer": "boundaries",
            "layout": {"line-join": "round"},
            "paint": {"line-color": "hsl(0, 0%, 77%)"}
        },
        {
            "id": "etl",
            "type": "line",
            "source": "composite",
            "source-layer": "etl",
            "layout": {"line-join": "round"},
            "paint": {
                "line-color": "hsl(0, 9%, 55%)",
                "line-opacity": 0.5,
                "line-dasharray": [10, 5]
            }
        },
        {
            "id": "road numbers",
            "type": "symbol",
            "metadata": {"mapbox:group": "beaf4956fb8a63410ecf80abdebcdfb5"},
            "source": "composite",
            "source-layer": "roads",
            "minzoom": 10,
            "filter": [
                "match",
                ["get", "type"],
                ["Primary", "Motorway"],
                false,
                true
            ],
            "layout": {
                "text-field": ["to-string", ["get", "number"]],
                "symbol-placement": "line",
                "text-max-angle": 45,
                "text-size": [
                    "interpolate",
                    ["linear"],
                    ["zoom"],
                    10,
                    8,
                    15,
                    11,
                    22,
                    28
                ],
                "text-font": [
                    "Source Sans Pro Regular",
                    "Arial Unicode MS Regular"
                ]
            },
            "paint": {
                "text-halo-color": "hsl(0, 0%, 100%)",
                "text-halo-width": 1,
                "text-halo-blur": 1,
                "text-color": "#858585"
            }
        },
        {
            "id": "road names",
            "type": "symbol",
            "metadata": {"mapbox:group": "beaf4956fb8a63410ecf80abdebcdfb5"},
            "source": "composite",
            "source-layer": "roads",
            "minzoom": 10,
            "filter": [
                "match",
                ["get", "type"],
                ["Primary", "Motorway"],
                false,
                true
            ],
            "layout": {
                "text-field": ["to-string", ["get", "name"]],
                "symbol-placement": "line",
                "text-font": [
                    "Source Sans Pro Regular",
                    "Arial Unicode MS Regular"
                ],
                "text-size": [
                    "interpolate",
                    ["linear"],
                    ["zoom"],
                    10,
                    8,
                    15,
                    10,
                    22,
                    25
                ],
                "symbol-spacing": [
                    "interpolate",
                    ["linear"],
                    ["zoom"],
                    10,
                    25,
                    15,
                    97,
                    17,
                    250
                ],
                "text-max-angle": 82,
                "text-padding": 1
            },
            "paint": {
                "text-halo-color": "hsl(0, 0%, 100%)",
                "text-halo-width": 1,
                "text-halo-blur": 1,
                "text-color": "#5c5c5c"
            }
        },
        {
            "id": "primary road numbers",
            "type": "symbol",
            "metadata": {"mapbox:group": "beaf4956fb8a63410ecf80abdebcdfb5"},
            "source": "composite",
            "source-layer": "roads",
            "minzoom": 9,
            "filter": ["match", ["get", "type"], ["Primary"], true, false],
            "layout": {
                "text-field": ["to-string", ["get", "number"]],
                "symbol-placement": "line",
                "text-max-angle": 65,
                "text-size": [
                    "interpolate",
                    ["linear"],
                    ["zoom"],
                    9,
                    8.5,
                    15,
                    12,
                    22,
                    28
                ],
                "text-font": [
                    "Source Sans Pro Bold",
                    "Arial Unicode MS Regular"
                ],
                "text-letter-spacing": 0.1,
                "symbol-spacing": [
                    "interpolate",
                    ["linear"],
                    ["zoom"],
                    9,
                    50,
                    15,
                    250
                ]
            },
            "paint": {
                "text-halo-color": "#77c776",
                "text-halo-width": 1.25,
                "text-halo-blur": 0,
                "text-color": "hsl(0, 0%, 100%)"
            }
        },
        {
            "id": "motorway numbers",
            "type": "symbol",
            "metadata": {"mapbox:group": "beaf4956fb8a63410ecf80abdebcdfb5"},
            "source": "composite",
            "source-layer": "roads",
            "minzoom": 8,
            "filter": ["match", ["get", "type"], ["Motorway"], true, false],
            "layout": {
                "text-field": ["to-string", ["get", "number"]],
                "symbol-placement": "line",
                "text-max-angle": 45,
                "text-size": [
                    "interpolate",
                    ["linear"],
                    ["zoom"],
                    8,
                    8.5,
                    10,
                    9,
                    15,
                    12,
                    22,
                    28
                ],
                "text-font": [
                    "Source Sans Pro Bold",
                    "Arial Unicode MS Regular"
                ],
                "text-letter-spacing": 0.1,
                "symbol-spacing": [
                    "interpolate",
                    ["linear"],
                    ["zoom"],
                    8,
                    50,
                    15,
                    250
                ]
            },
            "paint": {
                "text-halo-color": "#08b8e8",
                "text-halo-width": 1.25,
                "text-halo-blur": 0,
                "text-color": "hsl(0, 0%, 100%)"
            }
        },
        {
            "id": "contour labels",
            "type": "symbol",
            "metadata": {"mapbox:group": "e196265c0e550aaddd2885dc32fdb674"},
            "source": "composite",
            "source-layer": "contours",
            "layout": {
                "symbol-placement": "line",
                "text-field": ["to-string", ["get", "height"]],
                "text-max-angle": 35,
                "text-size": [
                    "interpolate",
                    ["linear"],
                    ["zoom"],
                    12,
                    7.5,
                    15,
                    9.5,
                    22,
                    21
                ],
                "text-letter-spacing": 0.05,
                "text-font": [
                    "Source Sans Pro Regular",
                    "Arial Unicode MS Regular"
                ]
            },
            "paint": {
                "text-color": "#b2a695",
                "text-halo-color": "hsla(60, 20%, 95%, 0.8)",
                "text-halo-width": 1,
                "text-halo-blur": 0.5
            }
        },
        {
            "id": "motorway junction numbers",
            "type": "symbol",
            "metadata": {"mapbox:group": "e196265c0e550aaddd2885dc32fdb674"},
            "source": "composite",
            "source-layer": "names",
            "minzoom": 13,
            "filter": [
                "match",
                ["get", "type"],
                ["Motorway Junctions"],
                true,
                false
            ],
            "layout": {
                "text-field": ["to-string", ["get", "name1"]],
                "text-size": [
                    "interpolate",
                    ["linear"],
                    ["zoom"],
                    13,
                    11,
                    16,
                    16,
                    22,
                    30
                ],
                "text-font": [
                    "Source Sans Pro Bold",
                    "Arial Unicode MS Regular"
                ]
            },
            "paint": {
                "text-color": "#ffffff",
                "text-halo-color": "#1484a3",
                "text-halo-width": 10
            }
        },
        {
            "id": "greenspace names",
            "type": "symbol",
            "metadata": {"mapbox:group": "e196265c0e550aaddd2885dc32fdb674"},
            "source": "composite",
            "source-layer": "names",
            "minzoom": 13,
            "filter": ["match", ["get", "type"], ["Greenspace"], true, false],
            "layout": {
                "text-field": ["to-string", ["get", "name1"]],
                "text-size": [
                    "interpolate",
                    ["linear"],
                    ["zoom"],
                    13,
                    9,
                    14,
                    11
                ],
                "text-font": [
                    "Source Sans Pro Regular",
                    "Arial Unicode MS Regular"
                ],
                "text-line-height": 1
            },
            "paint": {
                "text-color": "#438519",
                "text-halo-color": "#f4f4ee",
                "text-halo-width": 1,
                "text-halo-blur": 1
            }
        },
        {
            "id": "sites names",
            "type": "symbol",
            "metadata": {"mapbox:group": "e196265c0e550aaddd2885dc32fdb674"},
            "source": "composite",
            "source-layer": "names",
            "minzoom": 13,
            "filter": ["match", ["get", "type"], ["Sites"], true, false],
            "layout": {
                "text-field": ["to-string", ["get", "name1"]],
                "text-size": [
                    "interpolate",
                    ["linear"],
                    ["zoom"],
                    13,
                    9,
                    14,
                    11
                ],
                "text-font": [
                    "Source Sans Pro Regular",
                    "Arial Unicode MS Regular"
                ],
                "text-line-height": 1
            },
            "paint": {
                "text-color": "#a79720",
                "text-halo-color": "#f4f4ee",
                "text-halo-width": 1,
                "text-halo-blur": 1
            }
        },
        {
            "id": "landform names",
            "type": "symbol",
            "metadata": {"mapbox:group": "e196265c0e550aaddd2885dc32fdb674"},
            "source": "composite",
            "source-layer": "names",
            "minzoom": 5,
            "filter": ["match", ["get", "type"], ["Landform"], true, false],
            "layout": {
                "text-field": ["to-string", ["get", "name1"]],
                "text-size": [
                    "interpolate",
                    ["linear"],
                    ["zoom"],
                    11,
                    9,
                    14,
                    11
                ],
                "text-font": [
                    "Source Sans Pro Regular",
                    "Arial Unicode MS Regular"
                ],
                "text-line-height": 1
            },
            "paint": {
                "text-color": "#af7631",
                "text-halo-color": "#f4f4ee",
                "text-halo-width": 1,
                "text-halo-blur": 1
            }
        },
        {
            "id": "landcover names",
            "type": "symbol",
            "metadata": {"mapbox:group": "e196265c0e550aaddd2885dc32fdb674"},
            "source": "composite",
            "source-layer": "names",
            "minzoom": 5,
            "filter": ["match", ["get", "type"], ["Landcover"], true, false],
            "layout": {
                "text-field": ["to-string", ["get", "name1"]],
                "text-size": [
                    "interpolate",
                    ["linear"],
                    ["zoom"],
                    11,
                    9.5,
                    14,
                    12
                ],
                "text-font": [
                    "Source Sans Pro Regular",
                    "Arial Unicode MS Regular"
                ],
                "text-line-height": 1
            },
            "paint": {
                "text-color": "#af9031",
                "text-halo-color": "#f4f4ee",
                "text-halo-width": 1,
                "text-halo-blur": 1
            }
        },
        {
            "id": "water names",
            "type": "symbol",
            "metadata": {"mapbox:group": "e196265c0e550aaddd2885dc32fdb674"},
            "source": "composite",
            "source-layer": "names",
            "minzoom": 12,
            "filter": ["match", ["get", "type"], ["Water"], true, false],
            "layout": {
                "text-field": ["to-string", ["get", "name1"]],
                "text-size": [
                    "interpolate",
                    ["linear"],
                    ["zoom"],
                    11,
                    9,
                    14,
                    11
                ],
                "text-font": [
                    "Source Sans Pro Italic",
                    "Arial Unicode MS Regular"
                ],
                "text-line-height": 1
            },
            "paint": {
                "text-color": "#318fae",
                "text-halo-color": "#f4f4ee",
                "text-halo-width": 1,
                "text-halo-blur": 1
            }
        },
        {
            "id": "woodland names",
            "type": "symbol",
            "metadata": {"mapbox:group": "e196265c0e550aaddd2885dc32fdb674"},
            "source": "composite",
            "source-layer": "names",
            "minzoom": 5,
            "filter": ["match", ["get", "type"], ["Woodland"], true, false],
            "layout": {
                "text-field": ["to-string", ["get", "name1"]],
                "text-size": [
                    "interpolate",
                    ["linear"],
                    ["zoom"],
                    11,
                    9.5,
                    14,
                    11.5
                ],
                "text-font": [
                    "Source Sans Pro Regular",
                    "Arial Unicode MS Regular"
                ],
                "text-line-height": 1,
                "text-padding": [
                    "interpolate",
                    ["linear"],
                    ["zoom"],
                    14,
                    10,
                    16,
                    2
                ]
            },
            "paint": {
                "text-color": "#599c30",
                "text-halo-color": "#f4f4ee",
                "text-halo-width": 1,
                "text-halo-blur": 1
            }
        },
        {
            "id": "small settlement names",
            "type": "symbol",
            "metadata": {"mapbox:group": "e196265c0e550aaddd2885dc32fdb674"},
            "source": "composite",
            "source-layer": "names",
            "minzoom": 5,
            "filter": [
                "match",
                ["get", "type"],
                ["Small Settlements"],
                true,
                false
            ],
            "layout": {
                "text-field": ["to-string", ["get", "name1"]],
                "text-size": [
                    "interpolate",
                    ["linear"],
                    ["zoom"],
                    12,
                    9,
                    14,
                    11
                ],
                "text-font": [
                    "Source Sans Pro Regular",
                    "Arial Unicode MS Regular"
                ],
                "text-line-height": 1
            },
            "paint": {
                "text-color": "#725f17",
                "text-halo-color": "#f4f4ee",
                "text-halo-width": 1,
                "text-halo-blur": 1
            }
        },
        {
            "id": "suburban area names",
            "type": "symbol",
            "metadata": {"mapbox:group": "e196265c0e550aaddd2885dc32fdb674"},
            "source": "composite",
            "source-layer": "names",
            "minzoom": 10,
            "filter": [
                "match",
                ["get", "type"],
                ["Suburban Area"],
                true,
                false
            ],
            "layout": {
                "text-field": ["to-string", ["get", "name1"]],
                "text-size": [
                    "interpolate",
                    ["linear"],
                    ["zoom"],
                    10,
                    10.5,
                    14,
                    14
                ],
                "text-font": [
                    "Source Sans Pro Regular",
                    "Arial Unicode MS Regular"
                ],
                "text-line-height": 1,
                "text-padding": [
                    "interpolate",
                    ["linear"],
                    ["zoom"],
                    10,
                    10,
                    14,
                    2
                ]
            },
            "paint": {
                "text-color": "#725f17",
                "text-halo-color": "#f4f4ee",
                "text-halo-width": 1,
                "text-halo-blur": 1,
                "text-opacity": [
                    "interpolate",
                    ["linear"],
                    ["zoom"],
                    10,
                    0.8,
                    14,
                    1
                ]
            }
        },
        {
            "id": "railwaystations",
            "type": "symbol",
            "metadata": {"mapbox:group": "e196265c0e550aaddd2885dc32fdb674"},
            "source": "composite",
            "source-layer": "railwaystations",
            "layout": {
                "text-line-height": 1,
                "text-size": [
                    "interpolate",
                    ["linear"],
                    ["zoom"],
                    12,
                    9,
                    15,
                    13
                ],
                "icon-image": [
                    "match",
                    ["get", "type"],
                    ["Railway Station"],
                    "RS",
                    ["London Underground Station"],
                    "UG",
                    ["Light Rapid Transit Station"],
                    "LRTS",
                    [
                        "Light Rapid Transit Station And London Underground Station"
                    ],
                    "LRTS-UG",
                    ["Light Rapid Transit Station And Railway Station"],
                    "RS-LRTS",
                    ["Railway Station And London Underground Station"],
                    "RS-UG",
                    ""
                ],
                "text-font": [
                    "Source Sans Pro Regular",
                    "Arial Unicode MS Regular"
                ],
                "text-justify": "left",
                "text-offset": [
                    "match",
                    ["get", "type"],
                    ["Railway Station"],
                    ["literal", [1, 0]],
                    ["Light Rapid Transit Station"],
                    ["literal", [1, 0]],
                    ["London Underground Station"],
                    ["literal", [1, 0]],
                    ["Railway Station And London Underground Station"],
                    ["literal", [1.7, 0]],
                    [
                        "Light Rapid Transit Station And London Underground Station"
                    ],
                    ["literal", [1.5, 0]],
                    ["Light Rapid Transit Station And Railway Station"],
                    ["literal", [1.7, 0]],
                    ["literal", [0, 0]]
                ],
                "icon-size": [
                    "interpolate",
                    ["linear"],
                    ["zoom"],
                    12,
                    0.5,
                    15,
                    1
                ],
                "text-anchor": "left",
                "text-field": ["to-string", ["get", "name"]]
            },
            "paint": {
                "text-halo-color": "#ffffff",
                "text-halo-width": 1,
                "text-halo-blur": 1
            }
        },
        {
            "id": "airports",
            "type": "symbol",
            "metadata": {"mapbox:group": "e196265c0e550aaddd2885dc32fdb674"},
            "source": "composite",
            "source-layer": "airports",
            "layout": {
                "icon-image": "Airport",
                "icon-size": [
                    "interpolate",
                    ["linear"],
                    ["zoom"],
                    10,
                    0.8,
                    15,
                    1
                ],
                "text-field": ["to-string", ["get", "name"]],
                "text-font": [
                    "Source Sans Pro Regular",
                    "Arial Unicode MS Regular"
                ],
                "text-size": [
                    "interpolate",
                    ["linear"],
                    ["zoom"],
                    10,
                    9,
                    15,
                    13
                ],
                "text-justify": "left",
                "text-anchor": "left",
                "text-offset": [0.8, 0]
            },
            "paint": {
                "text-color": "#303030",
                "text-halo-color": "hsl(0, 0%, 100%)",
                "text-halo-width": 1,
                "text-halo-blur": 1
            }
        },
        {
            "id": "village and hamlet names",
            "type": "symbol",
            "metadata": {"mapbox:group": "e196265c0e550aaddd2885dc32fdb674"},
            "source": "composite",
            "source-layer": "names",
            "minzoom": 5,
            "filter": [
                "match",
                ["get", "type"],
                ["Village", "Hamlet"],
                true,
                false
            ],
            "layout": {
                "text-field": ["to-string", ["get", "name1"]],
                "text-size": [
                    "interpolate",
                    ["linear"],
                    ["zoom"],
                    9,
                    9,
                    14,
                    15
                ],
                "text-font": [
                    "Source Sans Pro Regular",
                    "Arial Unicode MS Regular"
                ],
                "text-line-height": 1,
                "text-padding": 2
            },
            "paint": {
                "text-color": "#655314",
                "text-halo-color": "#f4f4ee",
                "text-halo-width": 1,
                "text-halo-blur": 1,
                "text-opacity": 1
            }
        },
        {
            "id": "town names",
            "type": "symbol",
            "metadata": {"mapbox:group": "e196265c0e550aaddd2885dc32fdb674"},
            "source": "composite",
            "source-layer": "names",
            "minzoom": 5,
            "filter": ["match", ["get", "type"], ["Town"], true, false],
            "layout": {
                "text-field": ["to-string", ["get", "name1"]],
                "text-size": [
                    "interpolate",
                    ["linear"],
                    ["zoom"],
                    7,
                    10,
                    14,
                    18
                ],
                "text-font": [
                    "Source Sans Pro Regular",
                    "Arial Unicode MS Regular"
                ],
                "text-line-height": 1,
                "text-padding": 2
            },
            "paint": {
                "text-color": "#372d0b",
                "text-halo-color": "#f4f4ee",
                "text-halo-width": 1,
                "text-halo-blur": 1,
                "text-opacity": 1
            }
        },
        {
            "id": "city names",
            "type": "symbol",
            "metadata": {"mapbox:group": "e196265c0e550aaddd2885dc32fdb674"},
            "source": "composite",
            "source-layer": "names",
            "minzoom": 5,
            "filter": ["match", ["get", "type"], ["City"], true, false],
            "layout": {
                "text-field": ["to-string", ["get", "name1"]],
                "text-size": [
                    "interpolate",
                    ["linear"],
                    ["zoom"],
                    6,
                    10,
                    14,
                    20
                ],
                "text-font": [
                    "Source Sans Pro SemiBold",
                    "Arial Unicode MS Regular"
                ],
                "text-line-height": 1,
                "text-padding": 2,
                "text-letter-spacing": 0.05
            },
            "paint": {
                "text-color": "#342a07",
                "text-halo-color": "#f4f4ee",
                "text-halo-width": 1,
                "text-halo-blur": 1,
                "text-opacity": 1
            }
        },
        {
            "id": "national park names",
            "type": "symbol",
            "metadata": {"mapbox:group": "e196265c0e550aaddd2885dc32fdb674"},
            "source": "composite",
            "source-layer": "names",
            "minzoom": 5,
            "filter": [
                "match",
                ["get", "type"],
                ["National Park"],
                true,
                false
            ],
            "layout": {
                "text-field": ["to-string", ["get", "name1"]],
                "text-size": [
                    "interpolate",
                    ["linear"],
                    ["zoom"],
                    6,
                    8,
                    14,
                    15
                ],
                "text-font": [
                    "Source Sans Pro SemiBold",
                    "Arial Unicode MS Regular"
                ],
                "text-line-height": 1,
                "text-padding": 2,
                "text-letter-spacing": 0.06
            },
            "paint": {
                "text-color": "#599c30",
                "text-halo-color": "#f4f4ee",
                "text-halo-width": 1,
                "text-halo-blur": 1,
                "text-opacity": 0.8
            }
        },
        {
            "id": "capital city names",
            "type": "symbol",
            "metadata": {"mapbox:group": "e196265c0e550aaddd2885dc32fdb674"},
            "source": "composite",
            "source-layer": "names",
            "minzoom": 5,
            "filter": ["match", ["get", "type"], ["Capital"], true, false],
            "layout": {
                "text-field": ["to-string", ["get", "name1"]],
                "text-size": [
                    "interpolate",
                    ["linear"],
                    ["zoom"],
                    5,
                    10.5,
                    14,
                    22
                ],
                "text-font": [
                    "Source Sans Pro Bold",
                    "Arial Unicode MS Regular"
                ],
                "text-line-height": 1,
                "text-padding": 2,
                "text-letter-spacing": 0.1,
                "text-transform": "uppercase"
            },
            "paint": {
                "text-color": "#342a07",
                "text-halo-color": "#f4f4ee",
                "text-halo-width": 1,
                "text-halo-blur": 1,
                "text-opacity": 1
            }
        },
        {
            "id": "country names",
            "type": "symbol",
            "metadata": {"mapbox:group": "e196265c0e550aaddd2885dc32fdb674"},
            "source": "composite",
            "source-layer": "names",
            "minzoom": 5,
            "maxzoom": 10,
            "filter": ["match", ["get", "type"], ["Country"], true, false],
            "layout": {
                "text-field": ["to-string", ["get", "name1"]],
                "text-size": [
                    "interpolate",
                    ["linear"],
                    ["zoom"],
                    5,
                    18,
                    10,
                    35
                ],
                "text-font": [
                    "Source Sans Pro SemiBold",
                    "Arial Unicode MS Regular"
                ],
                "text-line-height": 1,
                "text-padding": 2,
                "text-letter-spacing": 0.3,
                "text-transform": "uppercase"
            },
            "paint": {
                "text-color": "#362c07",
                "text-halo-color": "#f4f4ee",
                "text-halo-width": 1,
                "text-halo-blur": 1,
                "text-opacity": 0.5
            }
        }
    ],
    "created": "2019-01-16T20:32:55.069Z",
    "id": "cjqzn7wul164r2ro6u6awxepx",
    "modified": "2019-02-04T10:17:59.178Z",
    "owner": "ordnancesurvey",
    "visibility": "public",
    "draft": false
}
