{
    "id": "ef67e4f3-58aa-403c-90b8-7906e171cb14",
    "timestamp": "1614186006.436249",
    "randomInt": 85,
    "type": "sampleQuestion",
    "user": "doublethink",
    "question": "Which Flutter Widget allows an app to display an image from the Internet?",
    "answers": [
        "Text(aUrl)",
        "Navigator.pushNamed(context, aUrl)",
        "myController.get(aUrl)",
        "Image.network(aUrl)"    
    ],
    "correctAnswers": {
        "0": false, 
        "1": false,
        "2": false,
        "3": true
    },
    "categories": [
        "Flutter"
    ],
    "explanation": "Flutter provides the Image widget to display different types of images.\nTo work with images from a URL, use the Image.network() constructor.\nSources:https://flutter.dev/docs/cookbook/images/network-image"
}