{
    "id": "471a5c20-172d-43ab-a8fe-06a8ad95468f",
    "timestamp": "1614186379.9693215",
    "randomInt": 20,
    "type": "sampleQuestion",
    "user": "doublethink",
    "question": "You need to create a Kubernetes cluster in Azure with auto-scaling configuration enabled. Which tool should you use?",
    "answers": [
        "The az aks command",
        "The Azure portal",
        "The kubectl command",
        "The Set-AzVm cmdlet",
        "The Set-AzAks cmdlet"
    ],
    "correctAnswers": {
        "0": true,
        "1": false,
        "2": false,
        "3": false,
        "4": false
    },
    "categories": [
        "Azure",
        "AZ-104"
    ],
    "explanation": "If you need to create an AKS cluster, use the az aks create command. To enable and configure the cluster autoscaler on the node pool for the cluster, use the --enable-cluster-autoscaler parameter, and specify a node --min-count and --max-count. Azure advises against using the portal to deploy this type of cluster.\nCheck the official documentation for additional information.\nSources:\nhttps://docs.microsoft.com/en-us/azure/aks/cluster-autoscaler"
}