{
    "id": "def1047a-7bd0-4124-80d4-22530ae40ad6",
    "timestamp": "1614185845.8654318",
    "randomInt": 53,
    "type": "sampleQuestion",
    "user": "doublethink",
    "question": "What is swap space?",
    "answers": [
        "A sexy underground club in Lisbon",
        "A boot loader",
        "A type of symbolic link to a directory",
        "Swap space is a certain amount of space used by Linux to temporarily hold some programs that are running concurrently"
    ],
    "correctAnswers": {
        "0": false,
        "1": false,
        "2": false,
        "3": true,
    }
    "categories": [
        "Linux"
    ],
    "explanation": "Swap space is a certain amount of space used by Linux to temporarily hold some programs that are running concurrently. This happens when RAM does not have enough memory to hold all programs that are executing.\nSources:\nhttps://opensource.com/article/18/9/swap-space-linux-systems"
}