commit 94b7a1ba57aba704284770857313a45aabe95d46
Author: tself12 <tself12@wgu.edu>
Date:   Sun Jan 29 15:17:30 2023 -0700

    changed about.html

commit 0e445c004807b0fb1e6be881809e7127ab516779
Author: tself12 <tself12@wgu.edu>
Date:   Sun Jan 29 15:14:17 2023 -0700

    changed services.html

commit 147654ff4b0be1ecf89bcd3bafe4a23a9a843816
Author: tself12 <tself12@wgu.edu>
Date:   Sun Jan 29 15:12:41 2023 -0700

    changed contact.html

commit 5992106a5764057a574252f780781ad8f7b452b3
Author: tself12 <tself12@wgu.edu>
Date:   Sun Jan 29 15:10:16 2023 -0700

    changed contact.html

commit 75050ebfcd9e0c64d99538d9de7bb68139e12fc7
Author: tself12 <tself12@wgu.edu>
Date:   Sun Jan 29 15:01:31 2023 -0700

    Changed about html

commit bd1ef5218deeac9676d1a1cd375a0b2cfcd7eeba
Author: Trenton Self <trent.self@campus.masterschool.com>
Date:   Sun Jan 29 04:26:14 2023 +0000

    Upload New File
