{
    "user": {
      "external_id": "56780",
      "email": "hana@supportbee.com",
      "first_name": "Hana",
      "last_name": "Mohan",
      "phone_numbers": [
        "+15005550001"
      ]
      
    }
  }