\relax 
\providecommand\hyper@newdestlabel[2]{}
\@writefile{toc}{\defcounter {refsection}{0}\relax }\@writefile{toc}{\contentsline {chapter}{\numberline {2}Grundlagen}{2}{chapter.2}\protected@file@percent }
\@writefile{lof}{\defcounter {refsection}{0}\relax }\@writefile{lof}{\addvspace {10\p@ }}
\@writefile{lot}{\defcounter {refsection}{0}\relax }\@writefile{lot}{\addvspace {10\p@ }}
\newlabel{chap: Grundlagen}{{2}{2}{Grundlagen}{chapter.2}{}}
\newlabel{chap: Grundlagen@cref}{{[chapter][2][]2}{[1][2][]2}}
\@writefile{toc}{\defcounter {refsection}{0}\relax }\@writefile{toc}{\contentsline {section}{\numberline {2.1}Mensch-Maschine-Kommunikation}{2}{section.2.1}\protected@file@percent }
\@writefile{toc}{\defcounter {refsection}{0}\relax }\@writefile{toc}{\contentsline {subsection}{\numberline {2.1.1}User Interface Design}{2}{subsection.2.1.1}\protected@file@percent }
\@writefile{toc}{\defcounter {refsection}{0}\relax }\@writefile{toc}{\contentsline {subsection}{\numberline {2.1.2}User Experience Testing}{3}{subsection.2.1.2}\protected@file@percent }
\@writefile{toc}{\defcounter {refsection}{0}\relax }\@writefile{toc}{\contentsline {section}{\numberline {2.2}Standardsoftware}{3}{section.2.2}\protected@file@percent }
\newlabel{sec: Standard Software}{{2.2}{3}{Standardsoftware}{section.2.2}{}}
\newlabel{sec: Standard Software@cref}{{[section][2][2]2.2}{[1][3][]3}}
\@writefile{toc}{\defcounter {refsection}{0}\relax }\@writefile{toc}{\contentsline {section}{\numberline {2.3}Individual Software}{3}{section.2.3}\protected@file@percent }
\newlabel{sec: Individual Software}{{2.3}{3}{Individual Software}{section.2.3}{}}
\newlabel{sec: Individual Software@cref}{{[section][3][2]2.3}{[1][3][]3}}
\@writefile{toc}{\defcounter {refsection}{0}\relax }\@writefile{toc}{\contentsline {section}{\numberline {2.4}Microservices}{4}{section.2.4}\protected@file@percent }
\newlabel{sec:Microservices}{{2.4}{4}{Microservices}{section.2.4}{}}
\newlabel{sec:Microservices@cref}{{[section][4][2]2.4}{[1][4][]4}}
\newlabel{subsec: User Experience Testing}{{2.4}{4}{Microservices}{section.2.4}{}}
\newlabel{subsec: User Experience Testing@cref}{{[section][4][2]2.4}{[1][4][]4}}
\@writefile{toc}{\defcounter {refsection}{0}\relax }\@writefile{toc}{\contentsline {section}{\numberline {2.5}Grundlagen von Webanwendungen}{4}{section.2.5}\protected@file@percent }
\@writefile{toc}{\defcounter {refsection}{0}\relax }\@writefile{toc}{\contentsline {subsection}{\numberline {2.5.1}Client-Server Architektur}{4}{subsection.2.5.1}\protected@file@percent }
\@writefile{lof}{\defcounter {refsection}{0}\relax }\@writefile{lof}{\contentsline {figure}{\numberline {2.1}{\ignorespaces Client-Server-Architektur\relax }}{5}{figure.caption.8}\protected@file@percent }
\providecommand*\caption@xref[2]{\@setref\relax\@undefined{#1}}
\newlabel{fig:clientserverarchitektur}{{2.1}{5}{Client-Server-Architektur\relax }{figure.caption.8}{}}
\newlabel{fig:clientserverarchitektur@cref}{{[figure][1][2]2.1}{[1][5][]5}}
\@writefile{toc}{\defcounter {refsection}{0}\relax }\@writefile{toc}{\contentsline {subsection}{\numberline {2.5.2}Aufbau einer Webapplikation}{5}{subsection.2.5.2}\protected@file@percent }
\@writefile{toc}{\defcounter {refsection}{0}\relax }\@writefile{toc}{\contentsline {subsubsection}{\numberline {2.5.2.1}Frontend}{5}{subsubsection.2.5.2.1}\protected@file@percent }
\@writefile{toc}{\defcounter {refsection}{0}\relax }\@writefile{toc}{\contentsline {subsubsection}{\numberline {2.5.2.2}Backend}{6}{subsubsection.2.5.2.2}\protected@file@percent }
\@writefile{toc}{\defcounter {refsection}{0}\relax }\@writefile{toc}{\contentsline {subsection}{\numberline {2.5.3}Kommunikationsaustausch zwischen Webapplikationen}{6}{subsection.2.5.3}\protected@file@percent }
\@writefile{toc}{\defcounter {refsection}{0}\relax }\@writefile{toc}{\contentsline {subsubsection}{\numberline {2.5.3.1}Representational State Transfer}{6}{subsubsection.2.5.3.1}\protected@file@percent }
\@writefile{toc}{\defcounter {refsection}{0}\relax }\@writefile{toc}{\contentsline {subsubsection}{\numberline {2.5.3.2}GraphQL}{6}{subsubsection.2.5.3.2}\protected@file@percent }
\newlabel{lst:graphqlSchema}{{2.1}{6}{Beispielhaftes GraphQL Schema}{lstlisting.2.1}{}}
\newlabel{lst:graphqlSchema@cref}{{[listing][1][2]2.1}{[1][6][]6}}
\@writefile{lol}{\defcounter {refsection}{0}\relax }\@writefile{lol}{\contentsline {lstlisting}{\numberline {2.1}{\ignorespaces Beispielhaftes GraphQL Schema}}{6}{lstlisting.2.1}\protected@file@percent }
\newlabel{lst:graphqlQuery}{{2.2}{6}{Beispielhafte GraphQL Query}{lstlisting.2.2}{}}
\newlabel{lst:graphqlQuery@cref}{{[listing][2][2]2.2}{[1][6][]6}}
\@writefile{lol}{\defcounter {refsection}{0}\relax }\@writefile{lol}{\contentsline {lstlisting}{\numberline {2.2}{\ignorespaces Beispielhafte GraphQL Query}}{6}{lstlisting.2.2}\protected@file@percent }
\newlabel{lst:graphqlJSON}{{2.3}{7}{Beispielhafte JSON-Ausgabe auf GraphQL Query}{lstlisting.2.3}{}}
\newlabel{lst:graphqlJSON@cref}{{[listing][3][2]2.3}{[1][7][]7}}
\@writefile{lol}{\defcounter {refsection}{0}\relax }\@writefile{lol}{\contentsline {lstlisting}{\numberline {2.3}{\ignorespaces Beispielhafte JSON-Ausgabe auf GraphQL Query}}{7}{lstlisting.2.3}\protected@file@percent }
\@writefile{toc}{\defcounter {refsection}{0}\relax }\@writefile{toc}{\contentsline {subsubsection}{\numberline {2.5.3.3}Gegenüberstellung REST und GraphQL}{7}{subsubsection.2.5.3.3}\protected@file@percent }
\@writefile{toc}{\defcounter {refsection}{0}\relax }\@writefile{toc}{\contentsline {section}{\numberline {2.6}Prototyping}{7}{section.2.6}\protected@file@percent }
\newlabel{sec:Prototyping}{{2.6}{7}{Prototyping}{section.2.6}{}}
\newlabel{sec:Prototyping@cref}{{[section][6][2]2.6}{[1][7][]7}}
\@writefile{toc}{\defcounter {refsection}{0}\relax }\@writefile{toc}{\contentsline {subsection}{\numberline {2.6.1}Arten des Prototypings}{7}{subsection.2.6.1}\protected@file@percent }
\@writefile{toc}{\defcounter {refsection}{0}\relax }\@writefile{toc}{\contentsline {subsection}{\numberline {2.6.2}Muster von Prototypen}{8}{subsection.2.6.2}\protected@file@percent }
\@writefile{lof}{\defcounter {refsection}{0}\relax }\@writefile{lof}{\contentsline {figure}{\numberline {2.2}{\ignorespaces Gegenüberstellung horizontaler und vertikaler Prototyp\relax }}{8}{figure.caption.9}\protected@file@percent }
\newlabel{fig:prototypenmuster}{{2.2}{8}{Gegenüberstellung horizontaler und vertikaler Prototyp\relax }{figure.caption.9}{}}
\newlabel{fig:prototypenmuster@cref}{{[figure][2][2]2.2}{[1][8][]8}}
\@writefile{toc}{\defcounter {refsection}{0}\relax }\@writefile{toc}{\contentsline {subsubsection}{\numberline {2.6.2.1}Horizontaler Prototyp}{8}{subsubsection.2.6.2.1}\protected@file@percent }
\@writefile{toc}{\defcounter {refsection}{0}\relax }\@writefile{toc}{\contentsline {subsubsection}{\numberline {2.6.2.2}Vertikaler Prototyp}{8}{subsubsection.2.6.2.2}\protected@file@percent }
\@writefile{toc}{\defcounter {refsection}{0}\relax }\@writefile{toc}{\contentsline {section}{\numberline {2.7}Anforderungsanalyse in der Softwareentwicklung}{9}{section.2.7}\protected@file@percent }
\@writefile{toc}{\defcounter {refsection}{0}\relax }\@writefile{toc}{\contentsline {section}{\numberline {2.8}Benachrichtigungen}{9}{section.2.8}\protected@file@percent }
\newlabel{sec: Benachrichtigungen}{{2.8}{9}{Benachrichtigungen}{section.2.8}{}}
\newlabel{sec: Benachrichtigungen@cref}{{[section][8][2]2.8}{[1][9][]9}}
\@writefile{toc}{\defcounter {refsection}{0}\relax }\@writefile{toc}{\contentsline {subsection}{\numberline {2.8.1}Ereignisgesteuerte Architektur}{10}{subsection.2.8.1}\protected@file@percent }
\newlabel{subsec:Ereignisgesteuerte_Architketur}{{2.8.1}{10}{Ereignisgesteuerte Architektur}{subsection.2.8.1}{}}
\newlabel{subsec:Ereignisgesteuerte_Architketur@cref}{{[subsection][1][2,8]2.8.1}{[1][10][]10}}
\@writefile{toc}{\defcounter {refsection}{0}\relax }\@writefile{toc}{\contentsline {subsection}{\numberline {2.8.2}Publisher- und Subscriber-Systeme}{10}{subsection.2.8.2}\protected@file@percent }
\newlabel{subsec:Publish_Subscribe}{{2.8.2}{10}{Publisher- und Subscriber-Systeme}{subsection.2.8.2}{}}
\newlabel{subsec:Publish_Subscribe@cref}{{[subsection][2][2,8]2.8.2}{[1][10][]10}}
\@writefile{lot}{\defcounter {refsection}{0}\relax }\@writefile{lot}{\contentsline {table}{\numberline {2.1}{\ignorespaces Kurzbeschreibung von Events, Benachrichtigungen und Nachrichten\relax }}{11}{table.caption.10}\protected@file@percent }
\newlabel{table:economicSchools2}{{2.1}{11}{Kurzbeschreibung von Events, Benachrichtigungen und Nachrichten\relax }{table.caption.10}{}}
\newlabel{table:economicSchools2@cref}{{[table][1][2]2.1}{[1][11][]11}}
\@writefile{lof}{\defcounter {refsection}{0}\relax }\@writefile{lof}{\contentsline {figure}{\numberline {2.3}{\ignorespaces Publisher/Subscriber-System\relax }}{12}{figure.caption.11}\protected@file@percent }
\newlabel{fig:Notification_service}{{2.3}{12}{Publisher/Subscriber-System\relax }{figure.caption.11}{}}
\newlabel{fig:Notification_service@cref}{{[figure][3][2]2.3}{[1][11][]12}}
\@writefile{toc}{\defcounter {refsection}{0}\relax }\@writefile{toc}{\contentsline {subsection}{\numberline {2.8.3}Benachrichtigungsarten}{12}{subsection.2.8.3}\protected@file@percent }
\@setckpt{sections/einleitung/Grundlagen}{
\setcounter{page}{13}
\setcounter{equation}{0}
\setcounter{enumi}{4}
\setcounter{enumii}{0}
\setcounter{enumiii}{0}
\setcounter{enumiv}{0}
\setcounter{footnote}{0}
\setcounter{mpfootnote}{0}
\setcounter{part}{0}
\setcounter{chapter}{2}
\setcounter{section}{8}
\setcounter{subsection}{3}
\setcounter{subsubsection}{0}
\setcounter{paragraph}{0}
\setcounter{subparagraph}{0}
\setcounter{figure}{3}
\setcounter{table}{1}
\setcounter{tabx@nest}{0}
\setcounter{listtotal}{0}
\setcounter{listcount}{0}
\setcounter{liststart}{0}
\setcounter{liststop}{0}
\setcounter{citecount}{0}
\setcounter{citetotal}{0}
\setcounter{multicitecount}{0}
\setcounter{multicitetotal}{0}
\setcounter{instcount}{20}
\setcounter{maxnames}{2}
\setcounter{minnames}{1}
\setcounter{maxitems}{3}
\setcounter{minitems}{1}
\setcounter{citecounter}{0}
\setcounter{maxcitecounter}{0}
\setcounter{savedcitecounter}{0}
\setcounter{uniquelist}{0}
\setcounter{uniquename}{0}
\setcounter{refsection}{0}
\setcounter{refsegment}{0}
\setcounter{maxextratitle}{0}
\setcounter{maxextratitleyear}{0}
\setcounter{maxextraname}{0}
\setcounter{maxextradate}{0}
\setcounter{maxextraalpha}{0}
\setcounter{abbrvpenalty}{50}
\setcounter{highnamepenalty}{50}
\setcounter{lownamepenalty}{25}
\setcounter{maxparens}{3}
\setcounter{parenlevel}{0}
\setcounter{mincomprange}{10}
\setcounter{maxcomprange}{100000}
\setcounter{mincompwidth}{1}
\setcounter{afterword}{0}
\setcounter{savedafterword}{0}
\setcounter{annotator}{0}
\setcounter{savedannotator}{0}
\setcounter{author}{0}
\setcounter{savedauthor}{0}
\setcounter{bookauthor}{0}
\setcounter{savedbookauthor}{0}
\setcounter{commentator}{0}
\setcounter{savedcommentator}{0}
\setcounter{editor}{0}
\setcounter{savededitor}{0}
\setcounter{editora}{0}
\setcounter{savededitora}{0}
\setcounter{editorb}{0}
\setcounter{savededitorb}{0}
\setcounter{editorc}{0}
\setcounter{savededitorc}{0}
\setcounter{foreword}{0}
\setcounter{savedforeword}{0}
\setcounter{holder}{0}
\setcounter{savedholder}{0}
\setcounter{introduction}{0}
\setcounter{savedintroduction}{0}
\setcounter{namea}{0}
\setcounter{savednamea}{0}
\setcounter{nameb}{0}
\setcounter{savednameb}{0}
\setcounter{namec}{0}
\setcounter{savednamec}{0}
\setcounter{translator}{0}
\setcounter{savedtranslator}{0}
\setcounter{shortauthor}{0}
\setcounter{savedshortauthor}{0}
\setcounter{shorteditor}{0}
\setcounter{savedshorteditor}{0}
\setcounter{labelname}{0}
\setcounter{savedlabelname}{0}
\setcounter{institution}{0}
\setcounter{savedinstitution}{0}
\setcounter{lista}{0}
\setcounter{savedlista}{0}
\setcounter{listb}{0}
\setcounter{savedlistb}{0}
\setcounter{listc}{0}
\setcounter{savedlistc}{0}
\setcounter{listd}{0}
\setcounter{savedlistd}{0}
\setcounter{liste}{0}
\setcounter{savedliste}{0}
\setcounter{listf}{0}
\setcounter{savedlistf}{0}
\setcounter{location}{0}
\setcounter{savedlocation}{0}
\setcounter{organization}{0}
\setcounter{savedorganization}{0}
\setcounter{origlocation}{0}
\setcounter{savedoriglocation}{0}
\setcounter{origpublisher}{0}
\setcounter{savedorigpublisher}{0}
\setcounter{publisher}{0}
\setcounter{savedpublisher}{0}
\setcounter{language}{0}
\setcounter{savedlanguage}{0}
\setcounter{origlanguage}{0}
\setcounter{savedoriglanguage}{0}
\setcounter{pageref}{0}
\setcounter{savedpageref}{0}
\setcounter{textcitecount}{0}
\setcounter{textcitetotal}{0}
\setcounter{textcitemaxnames}{0}
\setcounter{biburlbigbreakpenalty}{100}
\setcounter{biburlbreakpenalty}{200}
\setcounter{biburlnumpenalty}{0}
\setcounter{biburlucpenalty}{0}
\setcounter{biburllcpenalty}{0}
\setcounter{smartand}{1}
\setcounter{bbx:relatedcount}{0}
\setcounter{bbx:relatedtotal}{0}
\setcounter{FancyVerbLine}{0}
\setcounter{linenumber}{1}
\setcounter{LN@truepage}{23}
\setcounter{FV@TrueTabGroupLevel}{0}
\setcounter{FV@TrueTabCounter}{0}
\setcounter{FV@HighlightLinesStart}{0}
\setcounter{FV@HighlightLinesStop}{0}
\setcounter{FancyVerbLineBreakLast}{0}
\setcounter{float@type}{16}
\setcounter{minted@FancyVerbLineTemp}{0}
\setcounter{minted@pygmentizecounter}{0}
\setcounter{listing}{0}
\setcounter{blindtext}{1}
\setcounter{Blindtext}{5}
\setcounter{blind@countparstart}{0}
\setcounter{blindlist}{0}
\setcounter{blindlistlevel}{0}
\setcounter{blindlist@level}{0}
\setcounter{blind@listcount}{0}
\setcounter{blind@levelcount}{0}
\setcounter{blind@randomcount}{0}
\setcounter{blind@randommax}{0}
\setcounter{blind@pangramcount}{0}
\setcounter{blind@pangrammax}{0}
\setcounter{Item}{9}
\setcounter{Hfootnote}{0}
\setcounter{bookmark@seq@number}{36}
\setcounter{caption@flags}{2}
\setcounter{continuedfloat}{0}
\setcounter{lstnumber}{8}
\setcounter{section@level}{0}
\setcounter{lstlisting}{3}
}
