\relax 
\providecommand\hyper@newdestlabel[2]{}
\providecommand\babel@aux[2]{}
\@nameuse{bbl@beforestart}
\catcode `"\active 
\@writefile{toc}{\boolfalse {citerequest}\boolfalse {citetracker}\boolfalse {pagetracker}\boolfalse {backtracker}\relax }
\@writefile{lof}{\boolfalse {citerequest}\boolfalse {citetracker}\boolfalse {pagetracker}\boolfalse {backtracker}\relax }
\@writefile{lot}{\boolfalse {citerequest}\boolfalse {citetracker}\boolfalse {pagetracker}\boolfalse {backtracker}\relax }
\bibstyle{biblatex}
\bibdata{main-blx,bibliography}
\citation{biblatex-control}
\abx@aux@refcontext{none/global//global/global}
\AC@reset@newl@bel
\providecommand\HyperFirstAtBeginDocument{\AtBeginDocument}
\HyperFirstAtBeginDocument{\ifx\hyper@anchor\@undefined
\global\let\oldcontentsline\contentsline
\gdef\contentsline#1#2#3#4{\oldcontentsline{#1}{#2}{#3}}
\global\let\oldnewlabel\newlabel
\gdef\newlabel#1#2{\newlabelxx{#1}#2}
\gdef\newlabelxx#1#2#3#4#5#6{\oldnewlabel{#1}{{#2}{#3}}}
\AtEndDocument{\ifx\hyper@anchor\@undefined
\let\contentsline\oldcontentsline
\let\newlabel\oldnewlabel
\fi}
\fi}
\global\let\hyper@last\relax 
\gdef\HyperFirstAtBeginDocument#1{#1}
\providecommand\HyField@AuxAddToFields[1]{}
\providecommand\HyField@AuxAddToCoFields[2]{}
\babel@aux{ngerman}{}
\@writefile{toc}{\defcounter {refsection}{0}\relax }\@writefile{toc}{\contentsline {chapter}{Ehrenwörtliche Erklärung}{i}{chapter*.1}\protected@file@percent }
\@writefile{toc}{\defcounter {refsection}{0}\relax }\@writefile{toc}{\contentsline {chapter}{Zusammenfassung}{ii}{chapter*.2}\protected@file@percent }
\@writefile{toc}{\defcounter {refsection}{0}\relax }\@writefile{toc}{\contentsline {chapter}{Abbildungsverzeichnis}{vii}{chapter*.4}\protected@file@percent }
\@writefile{toc}{\defcounter {refsection}{0}\relax }\@writefile{toc}{\contentsline {chapter}{Tabellenverzeichnis}{viii}{chapter*.5}\protected@file@percent }
\@writefile{toc}{\defcounter {refsection}{0}\relax }\@writefile{toc}{\contentsline {chapter}{Abkürzungsverzeichnis}{ix}{chapter*.6}\protected@file@percent }
\newacro{eu}[\AC@hyperlink{eu}{EU}]{European Union}
\newacro{knmi}[\AC@hyperlink{knmi}{KNMI}]{Koninklijk Nederlands Meteorologisch Instituut}
\newacro{long}[\AC@hyperlink{long}{SOMELONG}]{This is a long word}
\@writefile{toc}{\defcounter {refsection}{0}\relax }\@writefile{toc}{\contentsline {chapter}{Codeverzeichnis}{x}{chapter*.7}\protected@file@percent }
\@input{sections/einleitung/Einleitung.aux}
\@input{sections/einleitung/Grundlagen.aux}
\citation{Heinecke.2012}
\abx@aux@cite{Heinecke.2012}
\abx@aux@segm{0}{0}{Heinecke.2012}
\citation{Tremp.2021}
\abx@aux@cite{Tremp.2021}
\abx@aux@segm{0}{0}{Tremp.2021}
\citation{Tremp.2021}
\abx@aux@cite{Tremp.2021}
\abx@aux@segm{0}{0}{Tremp.2021}
\abx@aux@page{1}{2}
\abx@aux@page{2}{2}
\citation{Hegner.2003}
\abx@aux@cite{Hegner.2003}
\abx@aux@segm{0}{0}{Hegner.2003}
\citation{mindworksGmbHSoftwareentwicklung.2017}
\abx@aux@cite{mindworksGmbHSoftwareentwicklung.2017}
\abx@aux@segm{0}{0}{mindworksGmbHSoftwareentwicklung.2017}
\citation{mindworksGmbHSoftwareentwicklung.2017}
\abx@aux@cite{mindworksGmbHSoftwareentwicklung.2017}
\abx@aux@segm{0}{0}{mindworksGmbHSoftwareentwicklung.2017}
\abx@aux@page{3}{3}
\abx@aux@page{4}{3}
\abx@aux@page{5}{3}
\citation{Tremp.2021}
\abx@aux@cite{Tremp.2021}
\abx@aux@segm{0}{0}{Tremp.2021}
\abx@aux@page{6}{4}
\abx@aux@page{7}{4}
\citation{Tremp.2021}
\abx@aux@cite{Tremp.2021}
\abx@aux@segm{0}{0}{Tremp.2021}
\citation{V.2015}
\abx@aux@cite{V.2015}
\abx@aux@segm{0}{0}{V.2015}
\abx@aux@page{8}{5}
\abx@aux@page{9}{5}
\citation{kreITiv.2018}
\abx@aux@cite{kreITiv.2018}
\abx@aux@segm{0}{0}{kreITiv.2018}
\citation{kreITiv.2018}
\abx@aux@cite{kreITiv.2018}
\abx@aux@segm{0}{0}{kreITiv.2018}
\abx@aux@page{10}{7}
\citation{.12.04.2022}
\abx@aux@cite{.12.04.2022}
\abx@aux@segm{0}{0}{.12.04.2022}
\citation{.12.04.2022}
\abx@aux@cite{.12.04.2022}
\abx@aux@segm{0}{0}{.12.04.2022}
\citation{Meyer.2018}
\abx@aux@cite{Meyer.2018}
\abx@aux@segm{0}{0}{Meyer.2018}
\abx@aux@page{11}{8}
\abx@aux@page{12}{8}
\abx@aux@page{13}{8}
\citation{Meyer.2018}
\abx@aux@cite{Meyer.2018}
\abx@aux@segm{0}{0}{Meyer.2018}
\citation{Meyer.2018}
\abx@aux@cite{Meyer.2018}
\abx@aux@segm{0}{0}{Meyer.2018}
\abx@aux@page{14}{9}
\abx@aux@page{15}{9}
\abx@aux@page{16}{9}
\citation{AmazonWebServicesInc..29.04.2022}
\abx@aux@cite{AmazonWebServicesInc..29.04.2022}
\abx@aux@segm{0}{0}{AmazonWebServicesInc..29.04.2022}
\citation{ZeidlerAndreas.2004}
\abx@aux@cite{ZeidlerAndreas.2004}
\abx@aux@segm{0}{0}{ZeidlerAndreas.2004}
\abx@aux@page{17}{10}
\abx@aux@page{18}{10}
\citation{ZeidlerAndreas.2004}
\abx@aux@cite{ZeidlerAndreas.2004}
\abx@aux@segm{0}{0}{ZeidlerAndreas.2004}
\abx@aux@page{19}{11}
\citation{ElGazzar.2010}
\abx@aux@cite{ElGazzar.2010}
\abx@aux@segm{0}{0}{ElGazzar.2010}
\abx@aux@page{20}{12}
\@input{sections/einleitung/Methodische_Grundlagen.aux}
\citation{Schallmo.2020}
\abx@aux@cite{Schallmo.2020}
\abx@aux@segm{0}{0}{Schallmo.2020}
\citation{Schallmo.2020}
\abx@aux@cite{Schallmo.2020}
\abx@aux@segm{0}{0}{Schallmo.2020}
\abx@aux@page{21}{13}
\abx@aux@page{22}{13}
\@input{sections/einleitung/Ausgangsbasis_im_Unternehmen.aux}
\@input{sections/hauptteil/Konzeption.aux}
\citation{Meyer.2018}
\abx@aux@cite{Meyer.2018}
\abx@aux@segm{0}{0}{Meyer.2018}
\abx@aux@page{23}{22}
\citation{BMI.04.05.2022}
\abx@aux@cite{BMI.04.05.2022}
\abx@aux@segm{0}{0}{BMI.04.05.2022}
\abx@aux@page{24}{25}
\citation{Leimeister.2020}
\abx@aux@cite{Leimeister.2020}
\abx@aux@segm{0}{0}{Leimeister.2020}
\abx@aux@page{25}{26}
\@input{sections/hauptteil/Implementierung.aux}
\@input{sections/schluss/Ausblick.aux}
\abx@aux@read@bbl@mdfivesum{0E849FC1AB1CF9257BF3479975926A04}
\abx@aux@refcontextdefaultsdone
\abx@aux@defaultrefcontext{0}{Heinecke.2012}{none/global//global/global}
\abx@aux@defaultrefcontext{0}{Tremp.2021}{none/global//global/global}
\abx@aux@defaultrefcontext{0}{Hegner.2003}{none/global//global/global}
\abx@aux@defaultrefcontext{0}{mindworksGmbHSoftwareentwicklung.2017}{none/global//global/global}
\abx@aux@defaultrefcontext{0}{V.2015}{none/global//global/global}
\abx@aux@defaultrefcontext{0}{kreITiv.2018}{none/global//global/global}
\abx@aux@defaultrefcontext{0}{.12.04.2022}{none/global//global/global}
\abx@aux@defaultrefcontext{0}{Meyer.2018}{none/global//global/global}
\abx@aux@defaultrefcontext{0}{AmazonWebServicesInc..29.04.2022}{none/global//global/global}
\abx@aux@defaultrefcontext{0}{ZeidlerAndreas.2004}{none/global//global/global}
\abx@aux@defaultrefcontext{0}{ElGazzar.2010}{none/global//global/global}
\abx@aux@defaultrefcontext{0}{Schallmo.2020}{none/global//global/global}
\abx@aux@defaultrefcontext{0}{BMI.04.05.2022}{none/global//global/global}
\abx@aux@defaultrefcontext{0}{Leimeister.2020}{none/global//global/global}
\abx@aux@defaultlabelprefix{0}{Heinecke.2012}{}
\abx@aux@defaultlabelprefix{0}{Tremp.2021}{}
\abx@aux@defaultlabelprefix{0}{Hegner.2003}{}
\abx@aux@defaultlabelprefix{0}{mindworksGmbHSoftwareentwicklung.2017}{}
\abx@aux@defaultlabelprefix{0}{V.2015}{}
\abx@aux@defaultlabelprefix{0}{kreITiv.2018}{}
\abx@aux@defaultlabelprefix{0}{.12.04.2022}{}
\abx@aux@defaultlabelprefix{0}{Meyer.2018}{}
\abx@aux@defaultlabelprefix{0}{AmazonWebServicesInc..29.04.2022}{}
\abx@aux@defaultlabelprefix{0}{ZeidlerAndreas.2004}{}
\abx@aux@defaultlabelprefix{0}{ElGazzar.2010}{}
\abx@aux@defaultlabelprefix{0}{Schallmo.2020}{}
\abx@aux@defaultlabelprefix{0}{BMI.04.05.2022}{}
\abx@aux@defaultlabelprefix{0}{Leimeister.2020}{}
\abx@aux@page{26}{33}
\abx@aux@page{27}{33}
\abx@aux@page{28}{33}
\abx@aux@page{29}{33}
\abx@aux@page{30}{33}
\abx@aux@page{31}{33}
\abx@aux@page{32}{33}
\abx@aux@page{33}{33}
\abx@aux@page{34}{33}
\abx@aux@page{35}{33}
\abx@aux@page{36}{33}
\abx@aux@page{37}{33}
\abx@aux@page{38}{33}
\abx@aux@page{39}{33}
\gdef \@abspage@last{44}
