/usr/bin/time -v ./kwip -t 30 -k hash.kern -d hash.dist hashes/*.ct.gz
wrote to: hashes/GCF_902705295.1_Combinated_assembly_ONT-Illumina_genomic.fna.gz.ct.gz.info
        Command being timed: "./create_hashes.sh"
        User time (seconds): 9222.90
        System time (seconds): 580.40
        Percent of CPU this job got: 135%
        Elapsed (wall clock) time (h:mm:ss or m:ss): 2:00:16
        Average shared text size (kbytes): 0
        Average unshared data size (kbytes): 0
        Average stack size (kbytes): 0
        Average total size (kbytes): 0
        Maximum resident set size (kbytes): 1002504
        Average resident set size (kbytes): 0
        Major (requiring I/O) page faults: 0
        Minor (reclaiming a frame) page faults: 258116257
        Voluntary context switches: 486561
        Involuntary context switches: 31150
        Swaps: 0
        File system inputs: 72
        File system outputs: 24623680
        Socket messages sent: 0
        Socket messages received: 0
        Signals delivered: 0
        Page size (bytes): 4096
        Exit status: 0
