feature	metadata	value	coef	stderr	N	N.not.0	pval	qval
Eubacterium	timepoint_fact	T14	-0.132250770500546	0.079963659564844	70	70	0.107355596898559	0.904358891109683
Faecalibacterium	timepoint_fact	T14	0.129095719023023	0.106802039397263	70	70	0.235102709312085	0.904358891109683
Faecalicatena	timepoint_fact	T14	-0.132239352333869	0.101628876698335	70	70	0.20193953771873	0.904358891109683
Hungatella	timepoint_fact	T14	-0.0689824246624742	0.060012914813282	70	70	0.258388254602767	0.904358891109683
Blautia	timepoint_fact	T14	0.0417380945387567	0.0735779303719519	70	70	0.574261612074163	0.907564821586693
Dysosmobacter	timepoint_fact	T14	0.0453980757474507	0.0944397037028402	70	70	0.633801793782298	0.907564821586693
Enterocloster	timepoint_fact	T14	-0.0619713177426115	0.0855043121480464	70	70	0.473549234050827	0.907564821586693
Lachnoclostridium	timepoint_fact	T14	0.0418720051506142	0.0698397473970922	70	70	0.552784864206124	0.907564821586693
Lacrimispora	timepoint_fact	T14	-0.0312714094076195	0.084688346720021	70	70	0.713086645532402	0.907564821586693
Mediterraneibacter	timepoint_fact	T14	-0.0742315686921032	0.105624385963021	70	70	0.486972173192322	0.907564821586693
Oscillibacter	timepoint_fact	T14	0.0453106662845213	0.105608494157944	70	70	0.670597801704227	0.907564821586693
Butyricicoccus	timepoint_fact	T14	-0.0239491205329703	0.10438352877998	70	70	0.819906328382114	0.925086941801801
Roseburia	timepoint_fact	T14	0.0232213555137361	0.129736775556663	70	70	0.859009303101672	0.925086941801801
Laceyella	timepoint_fact	T14	0.000614734657785578	0.0141475771981725	70	70	0.965468899248257	0.965468899248257
