tax_id	abundance	species	genus	family	order	class	phylum	clade	superkingdom	subspecies	species subgroup	species group
626940	0.013416017246273709	Phascolarctobacterium succinatutens	Phascolarctobacterium	Acidaminococcaceae	Acidaminococcales	Negativicutes	Firmicutes	Terrabacteria group	Bacteria			
2109691	0.10795111052694804	Lachnospiraceae bacterium GAM79		Lachnospiraceae	Clostridiales	Clostridia	Firmicutes	Terrabacteria group	Bacteria			
40519	0.02246227283285557	Ruminococcus callidus	Ruminococcus	Ruminococcaceae	Clostridiales	Clostridia	Firmicutes	Terrabacteria group	Bacteria			
1161942	0.009576750230019138	Ruminococcus champanellensis	Ruminococcus	Ruminococcaceae	Clostridiales	Clostridia	Firmicutes	Terrabacteria group	Bacteria			
1265	0.0002040554783997103	Ruminococcus flavefaciens	Ruminococcus	Ruminococcaceae	Clostridiales	Clostridia	Firmicutes	Terrabacteria group	Bacteria			
418240	0.005827113629628236	Blautia wexlerae	Blautia	Lachnospiraceae	Clostridiales	Clostridia	Firmicutes	Terrabacteria group	Bacteria			
89014	0.021629356695053323	Blautia luti	Blautia	Lachnospiraceae	Clostridiales	Clostridia	Firmicutes	Terrabacteria group	Bacteria			
536633	0.0031620179030628086	Blautia glucerasea	Blautia	Lachnospiraceae	Clostridiales	Clostridia	Firmicutes	Terrabacteria group	Bacteria			
33035	0.0046701603320652525	Blautia producta	Blautia	Lachnospiraceae	Clostridiales	Clostridia	Firmicutes	Terrabacteria group	Bacteria			
1544	0.00263685723118548	Faecalicatena orotica	Faecalicatena	Lachnospiraceae	Clostridiales	Clostridia	Firmicutes	Terrabacteria group	Bacteria			
1532	9.224843871031936e-05	Blautia coccoides	Blautia	Lachnospiraceae	Clostridiales	Clostridia	Firmicutes	Terrabacteria group	Bacteria			
2025493	0.0009318082718665492	Blautia hominis	Blautia	Lachnospiraceae	Clostridiales	Clostridia	Firmicutes	Terrabacteria group	Bacteria			
290055	0.005777824749971722	Faecalicatena fissicatena	Faecalicatena	Lachnospiraceae	Clostridiales	Clostridia	Firmicutes	Terrabacteria group	Bacteria			
1796616	0.0006357264771295008	Blautia sp. YL58	Blautia	Lachnospiraceae	Clostridiales	Clostridia	Firmicutes	Terrabacteria group	Bacteria			
39482	0.0036133378975321713	Faecalicatena contorta	Faecalicatena	Lachnospiraceae	Clostridiales	Clostridia	Firmicutes	Terrabacteria group	Bacteria			
592978	0.008015706157508002	[Ruminococcus] faecis	Mediterraneibacter	Lachnospiraceae	Clostridiales	Clostridia	Firmicutes	Terrabacteria group	Bacteria			
1322	0.00012635136568238088	Blautia hansenii	Blautia	Lachnospiraceae	Clostridiales	Clostridia	Firmicutes	Terrabacteria group	Bacteria			
88431	0.012803656166783257	Dorea longicatena	Dorea	Lachnospiraceae	Clostridiales	Clostridia	Firmicutes	Terrabacteria group	Bacteria			
33038	0.008763141981307907	[Ruminococcus] gnavus	Mediterraneibacter	Lachnospiraceae	Clostridiales	Clostridia	Firmicutes	Terrabacteria group	Bacteria			
1796636	4.6537360584815314e-05	Frisingicoccus caecimuris	Frisingicoccus	Lachnospiraceae	Clostridiales	Clostridia	Firmicutes	Terrabacteria group	Bacteria			
94868	0.00025381830120309215	Lacrimispora algidixylanolytica	Lacrimispora	Lachnospiraceae	Clostridiales	Clostridia	Firmicutes	Terrabacteria group	Bacteria			
46228	0.00011649793169779405	[Ruminococcus] lactaris	Mediterraneibacter	Lachnospiraceae	Clostridiales	Clostridia	Firmicutes	Terrabacteria group	Bacteria			
706562	0.0035444495753892947	Lactobacillus rogosae	Lactobacillus	Lactobacillaceae	Lactobacillales	Bacilli	Firmicutes	Terrabacteria group	Bacteria			
165179	0.014444310176563962	Prevotella copri	Prevotella	Prevotellaceae	Bacteroidales	Bacteroidia	Bacteroidetes	FCB group	Bacteria			
208479	0.005574699302177006	Enterocloster bolteae	Enterocloster	Lachnospiraceae	Clostridiales	Clostridia	Firmicutes	Terrabacteria group	Bacteria			
69825	0.0013669583034702619	Lacrimispora indolis	Lacrimispora	Lachnospiraceae	Clostridiales	Clostridia	Firmicutes	Terrabacteria group	Bacteria			
154046	0.0049861778185600145	Hungatella hathewayi	Hungatella	Clostridiaceae	Clostridiales	Clostridia	Firmicutes	Terrabacteria group	Bacteria			
84030	0.004948902201500854	Lacrimispora saccharolytica	Lacrimispora	Lachnospiraceae	Clostridiales	Clostridia	Firmicutes	Terrabacteria group	Bacteria			
29370	0.000888675495023063	Lacrimispora sphenoides	Lacrimispora	Lachnospiraceae	Clostridiales	Clostridia	Firmicutes	Terrabacteria group	Bacteria			
871664	4.351669039559245e-05	Blautia stercoris	Blautia	Lachnospiraceae	Clostridiales	Clostridia	Firmicutes	Terrabacteria group	Bacteria			
29375	0.0001208265092572851	Lacrimispora xylanolytica	Lacrimispora	Lachnospiraceae	Clostridiales	Clostridia	Firmicutes	Terrabacteria group	Bacteria			
36832	0.00010404265714067174	Lacrimispora aerotolerans	Lacrimispora	Lachnospiraceae	Clostridiales	Clostridia	Firmicutes	Terrabacteria group	Bacteria			
384636	0.0007307781620683835	Hungatella xylanolytica	Hungatella	Clostridiaceae	Clostridiales	Clostridia	Firmicutes	Terrabacteria group	Bacteria			
28051	0.00047863744544629017	Lachnospira multipara	Lachnospira	Lachnospiraceae	Clostridiales	Clostridia	Firmicutes	Terrabacteria group	Bacteria			
39485	0.05195702503555178	Lachnospira eligens	Lachnospira	Lachnospiraceae	Clostridiales	Clostridia	Firmicutes	Terrabacteria group	Bacteria			
1469948	0.0011137069932718076	Kineothrix alysoides	Kineothrix	Lachnospiraceae	Clostridiales	Clostridia	Firmicutes	Terrabacteria group	Bacteria			
39491	0.019592686452683944	[Eubacterium] rectale		Lachnospiraceae	Clostridiales	Clostridia	Firmicutes	Terrabacteria group	Bacteria			
907	0.009112009455731786	Megasphaera elsdenii	Megasphaera	Veillonellaceae	Veillonellales	Negativicutes	Firmicutes	Terrabacteria group	Bacteria			
879612	0.006778172954156455	Megasphaera indica	Megasphaera	Veillonellaceae	Veillonellales	Negativicutes	Firmicutes	Terrabacteria group	Bacteria			
2479767	0.030736638649367223	Blautia sp. SC05B48	Blautia	Lachnospiraceae	Clostridiales	Clostridia	Firmicutes	Terrabacteria group	Bacteria			
745368	0.0854536197920867	Gemmiger formicilis	Gemmiger	Ruminococcaceae	Clostridiales	Clostridia	Firmicutes	Terrabacteria group	Bacteria			
214851	0.0047229231091165495	Subdoligranulum variabile	Subdoligranulum	Ruminococcaceae	Clostridiales	Clostridia	Firmicutes	Terrabacteria group	Bacteria			
2610895	0.005061828380358665	Flintibacter sp. KGMB00164	Flintibacter		Clostridiales	Clostridia	Firmicutes	Terrabacteria group	Bacteria			
853	0.1272878344165893	Faecalibacterium prausnitzii	Faecalibacterium	Ruminococcaceae	Clostridiales	Clostridia	Firmicutes	Terrabacteria group	Bacteria			
106588	0.0007103306262350244	Pseudoflavonifractor capillosus	Pseudoflavonifractor	Ruminococcaceae	Clostridiales	Clostridia	Firmicutes	Terrabacteria group	Bacteria			
363265	0.011064203153124395	Prevotella stercorea	Prevotella	Prevotellaceae	Bacteroidales	Bacteroidia	Bacteroidetes	FCB group	Bacteria			
253257	0.0025443118645363857	Lacrimispora amygdalina	Lacrimispora	Lachnospiraceae	Clostridiales	Clostridia	Firmicutes	Terrabacteria group	Bacteria			
166486	0.0032102796810853287	Roseburia intestinalis	Roseburia	Lachnospiraceae	Clostridiales	Clostridia	Firmicutes	Terrabacteria group	Bacteria			
180332	0.0005953332666624609	Robinsoniella peoriensis	Robinsoniella	Lachnospiraceae	Clostridiales	Clostridia	Firmicutes	Terrabacteria group	Bacteria			
301301	0.003901469178562391	Roseburia hominis	Roseburia	Lachnospiraceae	Clostridiales	Clostridia	Firmicutes	Terrabacteria group	Bacteria			
1912855	0.004538171615115811	Faecalimonas umbilicata	Faecalimonas	Lachnospiraceae	Clostridiales	Clostridia	Firmicutes	Terrabacteria group	Bacteria			
1732	0.0015668035774906506	Eubacterium oxidoreducens	Eubacterium	Eubacteriaceae	Clostridiales	Clostridia	Firmicutes	Terrabacteria group	Bacteria			
301302	0.004858460140851984	Roseburia faecis	Roseburia	Lachnospiraceae	Clostridiales	Clostridia	Firmicutes	Terrabacteria group	Bacteria			
2109690	0.000850036343384217	Lachnospiraceae bacterium Choco86		Lachnospiraceae	Clostridiales	Clostridia	Firmicutes	Terrabacteria group	Bacteria			
649756	0.004795955883784384	Anaerostipes hadrus	Anaerostipes	Lachnospiraceae	Clostridiales	Clostridia	Firmicutes	Terrabacteria group	Bacteria			
487173	0.038890777215000914	Dialister succinatiphilus	Dialister	Veillonellaceae	Veillonellales	Negativicutes	Firmicutes	Terrabacteria group	Bacteria			
2161821	0.0022936261431390228	Dialister massiliensis	Dialister	Veillonellaceae	Veillonellales	Negativicutes	Firmicutes	Terrabacteria group	Bacteria			
2582419	0.007214974082653736	Dialister hominis	Dialister	Veillonellaceae	Veillonellales	Negativicutes	Firmicutes	Terrabacteria group	Bacteria			
290054	0.015088997143227128	Eubacterium coprostanoligenes	Eubacterium	Eubacteriaceae	Clostridiales	Clostridia	Firmicutes	Terrabacteria group	Bacteria			
1673717	0.0026574492629847187	Anaeromassilibacillus senegalensis	Anaeromassilibacillus	Ruminococcaceae	Clostridiales	Clostridia	Firmicutes	Terrabacteria group	Bacteria			
2564099	0.0008248548488697949	Ruminococcus sp. JE7A12	Ruminococcus	Ruminococcaceae	Clostridiales	Clostridia	Firmicutes	Terrabacteria group	Bacteria			
351091	0.016352232036416888	Oscillibacter valericigenes	Oscillibacter	Oscillospiraceae	Clostridiales	Clostridia	Firmicutes	Terrabacteria group	Bacteria			
2109688	0.0011097177002648514	Clostridiales bacterium CCNA10			Clostridiales	Clostridia	Firmicutes	Terrabacteria group	Bacteria			
292800	0.001840405473860314	Flavonifractor plautii	Flavonifractor	Ruminococcaceae	Clostridiales	Clostridia	Firmicutes	Terrabacteria group	Bacteria			
1870988	0.00047435983977157714	Pseudoflavonifractor phocaeensis	Pseudoflavonifractor	Ruminococcaceae	Clostridiales	Clostridia	Firmicutes	Terrabacteria group	Bacteria			
44749	0.0015459632958159727	Sporobacter termitidis	Sporobacter	Ruminococcaceae	Clostridiales	Clostridia	Firmicutes	Terrabacteria group	Bacteria			
1337094	7.776950539315828e-05	Ercella succinigenes	Ercella	Hungateiclostridiaceae	Clostridiales	Clostridia	Firmicutes	Terrabacteria group	Bacteria			
218538	0.0001888820931753791	Dialister invisus	Dialister	Veillonellaceae	Veillonellales	Negativicutes	Firmicutes	Terrabacteria group	Bacteria			
187979	0.04446425276560314	Mitsuokella jalaludinii	Mitsuokella	Selenomonadaceae	Selenomonadales	Negativicutes	Firmicutes	Terrabacteria group	Bacteria			
416586	4.622743375367839e-05	Selenomonas bovis	Selenomonas	Selenomonadaceae	Selenomonadales	Negativicutes	Firmicutes	Terrabacteria group	Bacteria			
847	0.00016468065934783268	Oxalobacter formigenes	Oxalobacter	Oxalobacteraceae	Burkholderiales	Betaproteobacteria	Proteobacteria		Bacteria			
1628085	0.0023644991496421567	Agathobaculum butyriciproducens	Agathobaculum	Ruminococcaceae	Clostridiales	Clostridia	Firmicutes	Terrabacteria group	Bacteria			
1712515	0.007355456758549571	Butyricicoccus faecihominis	Butyricicoccus	Clostridiaceae	Clostridiales	Clostridia	Firmicutes	Terrabacteria group	Bacteria			
2086585	0.0063370348617930545	Christensenella sp. Marseille-P3954	Christensenella	Christensenellaceae	Clostridiales	Clostridia	Firmicutes	Terrabacteria group	Bacteria			
209880	0.003844945992207739	Allisonella histaminiformans	Allisonella	Veillonellaceae	Veillonellales	Negativicutes	Firmicutes	Terrabacteria group	Bacteria			
410072	0.009611340396682624	Coprococcus comes	Coprococcus	Lachnospiraceae	Clostridiales	Clostridia	Firmicutes	Terrabacteria group	Bacteria			
290052	0.00014298514790293902	Acetivibrio ethanolgignens	Acetivibrio	Ruminococcaceae	Clostridiales	Clostridia	Firmicutes	Terrabacteria group	Bacteria			
342942	0.0005820375125814469	Mediterraneibacter glycyrrhizinilyticus	Mediterraneibacter	Lachnospiraceae	Clostridiales	Clostridia	Firmicutes	Terrabacteria group	Bacteria			
2093857	0.01451070307548733	Dysosmobacter welbionis	Dysosmobacter	Oscillospiraceae	Clostridiales	Clostridia	Firmicutes	Terrabacteria group	Bacteria			
2109687	0.0021046691000920687	Oscillibacter sp. PEA192	Oscillibacter	Oscillospiraceae	Clostridiales	Clostridia	Firmicutes	Terrabacteria group	Bacteria			
1297424	0.0014903814484763976	Anaerobacterium chartisolvens	Anaerobacterium	Hungateiclostridiaceae	Clostridiales	Clostridia	Firmicutes	Terrabacteria group	Bacteria			
84026	0.001216109140668828	[Clostridium] methylpentosum		Ruminococcaceae	Clostridiales	Clostridia	Firmicutes	Terrabacteria group	Bacteria			
29353	0.002714676001401074	Hungateiclostridium aldrichii	Hungateiclostridium	Hungateiclostridiaceae	Clostridiales	Clostridia	Firmicutes	Terrabacteria group	Bacteria			
320502	0.0003697962571797971	Hungateiclostridium alkalicellulosi	Hungateiclostridium	Hungateiclostridiaceae	Clostridiales	Clostridia	Firmicutes	Terrabacteria group	Bacteria			
35830	0.0010222511382854665	Hungateiclostridium cellulolyticum	Hungateiclostridium	Hungateiclostridiaceae	Clostridiales	Clostridia	Firmicutes	Terrabacteria group	Bacteria			
2164149	0.0003674047533892622	Tepidibaculum saccharolyticum	Tepidibaculum	Ruminococcaceae	Clostridiales	Clostridia	Firmicutes	Terrabacteria group	Bacteria			
53443	0.0003639909311378299	Blautia hydrogenotrophica	Blautia	Lachnospiraceae	Clostridiales	Clostridia	Firmicutes	Terrabacteria group	Bacteria			
40520	0.0017925511714758447	Blautia obeum	Blautia	Lachnospiraceae	Clostridiales	Clostridia	Firmicutes	Terrabacteria group	Bacteria			
1432052	0.00022440074968393495	Eisenbergiella tayi	Eisenbergiella	Lachnospiraceae	Clostridiales	Clostridia	Firmicutes	Terrabacteria group	Bacteria			
1527	6.309097541369654e-05	Anaerocolumna aminovalerica	Anaerocolumna	Lachnospiraceae	Clostridiales	Clostridia	Firmicutes	Terrabacteria group	Bacteria			
433286	0.000507071918835171	Anaerocolumna cellulosilytica	Anaerocolumna	Lachnospiraceae	Clostridiales	Clostridia	Firmicutes	Terrabacteria group	Bacteria			
1834196	0.0016882664577765932	Lachnoclostridium sp. YL32	Lachnoclostridium	Lachnospiraceae	Clostridiales	Clostridia	Firmicutes	Terrabacteria group	Bacteria			
1720294	0.0008722733206437729	Eisenbergiella massiliensis	Eisenbergiella	Lachnospiraceae	Clostridiales	Clostridia	Firmicutes	Terrabacteria group	Bacteria			
1917870	0.0005802308247741103	Lachnoclostridium pacaense	Lachnoclostridium	Lachnospiraceae	Clostridiales	Clostridia	Firmicutes	Terrabacteria group	Bacteria			
100134	4.372909635677724e-05	Anaerocolumna xylanovorans	Anaerocolumna	Lachnospiraceae	Clostridiales	Clostridia	Firmicutes	Terrabacteria group	Bacteria			
460384	6.304418368718742e-05	Enterocloster lavalensis	Enterocloster	Lachnospiraceae	Clostridiales	Clostridia	Firmicutes	Terrabacteria group	Bacteria			
404403	0.0005999236245654067	Howardella ureilytica	Howardella		Clostridiales	Clostridia	Firmicutes	Terrabacteria group	Bacteria			
1264	0.0002816271028079863	Ruminococcus albus	Ruminococcus	Ruminococcaceae	Clostridiales	Clostridia	Firmicutes	Terrabacteria group	Bacteria			
1720200	0.002758247026666968	Anaerotruncus rubiinfantis	Anaerotruncus	Ruminococcaceae	Clostridiales	Clostridia	Firmicutes	Terrabacteria group	Bacteria			
51515	0.00020983858577274203	Dehalobacterium formicoaceticum	Dehalobacterium	Peptococcaceae	Clostridiales	Clostridia	Firmicutes	Terrabacteria group	Bacteria			
169435	0.0001403037186670652	Anaerotruncus colihominis	Anaerotruncus	Ruminococcaceae	Clostridiales	Clostridia	Firmicutes	Terrabacteria group	Bacteria			
39492	0.002864445444648351	[Eubacterium] siraeum		Ruminococcaceae	Clostridiales	Clostridia	Firmicutes	Terrabacteria group	Bacteria			
755731	0.0005510769390286156	Clostridium sp. BNL1100	Clostridium	Clostridiaceae	Clostridiales	Clostridia	Firmicutes	Terrabacteria group	Bacteria			
29355	0.00014548736120123762	Ruminiclostridium cellobioparum	Ruminiclostridium	Hungateiclostridiaceae	Clostridiales	Clostridia	Firmicutes	Terrabacteria group	Bacteria			
1521	3.6470184094586534e-05	Ruminiclostridium cellulolyticum	Ruminiclostridium	Hungateiclostridiaceae	Clostridiales	Clostridia	Firmicutes	Terrabacteria group	Bacteria			
1499	9.289186684802136e-05	Ruminiclostridium josui	Ruminiclostridium	Hungateiclostridiaceae	Clostridiales	Clostridia	Firmicutes	Terrabacteria group	Bacteria			
84032	0.0007921567562211191	Pseudoclostridium thermosuccinogenes	Pseudoclostridium	Hungateiclostridiaceae	Clostridiales	Clostridia	Firmicutes	Terrabacteria group	Bacteria			
39488	0.009899643748888255	Anaerobutyricum hallii	Anaerobutyricum	Lachnospiraceae	Clostridiales	Clostridia	Firmicutes	Terrabacteria group	Bacteria			
45851	0.006064332742482046	Butyrivibrio crossotus	Butyrivibrio	Lachnospiraceae	Clostridiales	Clostridia	Firmicutes	Terrabacteria group	Bacteria			
1852370	0.0024516003237374296	Prevotellamassilia timonensis	Prevotellamassilia	Prevotellaceae	Bacteroidales	Bacteroidia	Bacteroidetes	FCB group	Bacteria			
1263547	0.00015494126593021182	Oscillibacter ruminantium	Oscillibacter	Oscillospiraceae	Clostridiales	Clostridia	Firmicutes	Terrabacteria group	Bacteria			
33043	0.008568302378655421	Coprococcus eutactus	Coprococcus	Lachnospiraceae	Clostridiales	Clostridia	Firmicutes	Terrabacteria group	Bacteria			
39484	0.0003383093118685145	Agathobaculum desmolans	Agathobaculum	Ruminococcaceae	Clostridiales	Clostridia	Firmicutes	Terrabacteria group	Bacteria			
1871035	0.005162787674853901	Negativibacillus massiliensis	Negativibacillus	Ruminococcaceae	Clostridiales	Clostridia	Firmicutes	Terrabacteria group	Bacteria			
42322	0.0013084633805098584	Eubacterium ruminantium	Eubacterium	Eubacteriaceae	Clostridiales	Clostridia	Firmicutes	Terrabacteria group	Bacteria			
185007	0.00035631623573700004	Pseudobutyrivibrio xylanivorans	Pseudobutyrivibrio	Lachnospiraceae	Clostridiales	Clostridia	Firmicutes	Terrabacteria group	Bacteria			
360807	0.01708721263058624	Roseburia inulinivorans	Roseburia	Lachnospiraceae	Clostridiales	Clostridia	Firmicutes	Terrabacteria group	Bacteria			
1776382	0.0016116773984936434	Neglecta timonensis	Neglecta	Ruminococcaceae	Clostridiales	Clostridia	Firmicutes	Terrabacteria group	Bacteria			
642589	0.00074908214824867	Caproiciproducens galactitolivorans	Caproiciproducens	Ruminococcaceae	Clostridiales	Clostridia	Firmicutes	Terrabacteria group	Bacteria			
905	0.0060119160134504196	Acidaminococcus fermentans	Acidaminococcus	Acidaminococcaceae	Acidaminococcales	Negativicutes	Firmicutes	Terrabacteria group	Bacteria			
1870986	0.0005481326282803483	Colidextribacter massiliensis	Colidextribacter		Clostridiales	Clostridia	Firmicutes	Terrabacteria group	Bacteria			
357276	0.0012945403053832968	Phocaeicola dorei	Phocaeicola		Bacteroidales	Bacteroidia	Bacteroidetes	FCB group	Bacteria			
821	0.0017192728876193142	Phocaeicola vulgatus	Phocaeicola		Bacteroidales	Bacteroidia	Bacteroidetes	FCB group	Bacteria			
1745713	0.00047226622975642265	Bariatricus massiliensis	Bariatricus	Lachnospiraceae	Clostridiales	Clostridia	Firmicutes	Terrabacteria group	Bacteria			
1572656	0.0002350301495050815	Ruminococcaceae bacterium CPB6		Ruminococcaceae	Clostridiales	Clostridia	Firmicutes	Terrabacteria group	Bacteria			
1042156	0.00013636292048360902	Clostridium sp. SY8519	Clostridium	Clostridiaceae	Clostridiales	Clostridia	Firmicutes	Terrabacteria group	Bacteria			
39490	0.0007437371998610028	Eubacterium ramulus	Eubacterium	Eubacteriaceae	Clostridiales	Clostridia	Firmicutes	Terrabacteria group	Bacteria			
140626	4.012907135769427e-05	Lachnobacterium bovis	Lachnobacterium	Lachnospiraceae	Clostridiales	Clostridia	Firmicutes	Terrabacteria group	Bacteria			
1337051	0.00014981586619492945	Murimonas intestini	Murimonas	Lachnospiraceae	Clostridiales	Clostridia	Firmicutes	Terrabacteria group	Bacteria			
40518	0.0006157232182252883	Ruminococcus bromii	Ruminococcus	Ruminococcaceae	Clostridiales	Clostridia	Firmicutes	Terrabacteria group	Bacteria			
187327	8.061976703418639e-05	Acidaminococcus intestini	Acidaminococcus	Acidaminococcaceae	Acidaminococcales	Negativicutes	Firmicutes	Terrabacteria group	Bacteria			
47246	0.0007265209455664534	[Clostridium] viride		Ruminococcaceae	Clostridiales	Clostridia	Firmicutes	Terrabacteria group	Bacteria			
1898207	0.00012393993473928185	Clostridiales bacterium			Clostridiales	Clostridia	Firmicutes	Terrabacteria group	Bacteria			
1297617	0.0059413813358093395	Intestinimonas butyriciproducens	Intestinimonas		Clostridiales	Clostridia	Firmicutes	Terrabacteria group	Bacteria			
645466	0.00017696044619901023	Anaerostipes butyraticus	Anaerostipes	Lachnospiraceae	Clostridiales	Clostridia	Firmicutes	Terrabacteria group	Bacteria			
1229621	0.0001393153781522098	Anaerostipes rhamnosivorans	Anaerostipes	Lachnospiraceae	Clostridiales	Clostridia	Firmicutes	Terrabacteria group	Bacteria			
1512	0.00047195960574116414	[Clostridium] symbiosum	Lachnoclostridium	Lachnospiraceae	Clostridiales	Clostridia	Firmicutes	Terrabacteria group	Bacteria			
1510	4.4295750436522536e-05	Thermoclostridium stercorarium	Thermoclostridium	Hungateiclostridiaceae	Clostridiales	Clostridia	Firmicutes	Terrabacteria group	Bacteria			
699281	5.4737249598340166e-05	Caldicoprobacter algeriensis	Caldicoprobacter	Caldicoprobacteraceae	Clostridiales	Clostridia	Firmicutes	Terrabacteria group	Bacteria			
1816678	0.0006616355421918498	Christensenella timonensis	Christensenella	Christensenellaceae	Clostridiales	Clostridia	Firmicutes	Terrabacteria group	Bacteria			
626937	0.0012341183249687737	Christensenella minuta	Christensenella	Christensenellaceae	Clostridiales	Clostridia	Firmicutes	Terrabacteria group	Bacteria			
1805714	0.0027750632023347604	Christensenella massiliensis	Christensenella	Christensenellaceae	Clostridiales	Clostridia	Firmicutes	Terrabacteria group	Bacteria			
270498	0.00040203579132699587	Catabacter hongkongensis	Catabacter	Catabacteriaceae	Clostridiales	Clostridia	Firmicutes	Terrabacteria group	Bacteria			
252966	7.289787184213832e-05	Mahella australiensis	Mahella	Thermoanaerobacterales Family IV. Incertae Sedis	Thermoanaerobacterales	Clostridia	Firmicutes	Terrabacteria group	Bacteria			
433279	0.0007805749263184141	Falcatimonas natans	Falcatimonas	Clostridiaceae	Clostridiales	Clostridia	Firmicutes	Terrabacteria group	Bacteria			
130788	0.00013129958371006653	Sedimentibacter saalensis	Sedimentibacter			Tissierellia	Firmicutes	Terrabacteria group	Bacteria			
1736	6.93048656791755e-05	Eubacterium limosum	Eubacterium	Eubacteriaceae	Clostridiales	Clostridia	Firmicutes	Terrabacteria group	Bacteria			
180311	0.0005385809912681027	Hespellia stercorisuis	Hespellia	Lachnospiraceae	Clostridiales	Clostridia	Firmicutes	Terrabacteria group	Bacteria			
1712665	5.194148072624714e-05	Agathobacter ruminis	Agathobacter	Lachnospiraceae	Clostridiales	Clostridia	Firmicutes	Terrabacteria group	Bacteria			
1981510	0.002195305103425854	Monoglobus pectinilyticus	Monoglobus		Clostridiales	Clostridia	Firmicutes	Terrabacteria group	Bacteria			
253314	0.0008870407762999664	Hungateiclostridium straminisolvens	Hungateiclostridium	Hungateiclostridiaceae	Clostridiales	Clostridia	Firmicutes	Terrabacteria group	Bacteria			
100176	0.0020578719537871076	Papillibacter cinnamivorans	Papillibacter	Ruminococcaceae	Clostridiales	Clostridia	Firmicutes	Terrabacteria group	Bacteria			
319644	0.00018584399137326594	Saccharofermentans acetigenes	Saccharofermentans	Hungateiclostridiaceae	Clostridiales	Clostridia	Firmicutes	Terrabacteria group	Bacteria			
501571	0.000995930508625377	Butyricicoccus pullicaecorum	Butyricicoccus	Clostridiaceae	Clostridiales	Clostridia	Firmicutes	Terrabacteria group	Bacteria			
1834198	0.0003318171144039964	Hungateiclostridiaceae bacterium KB18		Hungateiclostridiaceae	Clostridiales	Clostridia	Firmicutes	Terrabacteria group	Bacteria			
1796620	0.0005101032731119785	Acutalibacter muris	Acutalibacter	Ruminococcaceae	Clostridiales	Clostridia	Firmicutes	Terrabacteria group	Bacteria			
29343	0.0020821890446087025	[Clostridium] cellulosi		Ruminococcaceae	Clostridiales	Clostridia	Firmicutes	Terrabacteria group	Bacteria			
1535	9.794845780028538e-05	[Clostridium] leptum		Ruminococcaceae	Clostridiales	Clostridia	Firmicutes	Terrabacteria group	Bacteria			
258515	0.0002476122036323694	Acetanaerobacterium elongatum	Acetanaerobacterium	Ruminococcaceae	Clostridiales	Clostridia	Firmicutes	Terrabacteria group	Bacteria			
1650663	0.0004951715795565431	Fournierella massiliensis	Fournierella	Ruminococcaceae	Clostridiales	Clostridia	Firmicutes	Terrabacteria group	Bacteria			
1550024	0.000678706349045959	Ruthenibacterium lactatiformans	Ruthenibacterium	Ruminococcaceae	Clostridiales	Clostridia	Firmicutes	Terrabacteria group	Bacteria			
29361	0.00013256287123168792	Tyzzerella nexilis	Tyzzerella	Lachnospiraceae	Clostridiales	Clostridia	Firmicutes	Terrabacteria group	Bacteria			
39486	0.012393807306575936	Dorea formicigenerans	Dorea	Lachnospiraceae	Clostridiales	Clostridia	Firmicutes	Terrabacteria group	Bacteria			
1871021	3.5834954789258205e-05	Lachnoclostridium phocaeense	Lachnoclostridium	Lachnospiraceae	Clostridiales	Clostridia	Firmicutes	Terrabacteria group	Bacteria			
99656	6.146729170894301e-05	[Clostridium] fimetarium	Lachnoclostridium	Lachnospiraceae	Clostridiales	Clostridia	Firmicutes	Terrabacteria group	Bacteria			
168384	6.329926516548797e-05	Marvinbryantia formatexigens	Marvinbryantia	Lachnospiraceae	Clostridiales	Clostridia	Firmicutes	Terrabacteria group	Bacteria			
29347	0.00014955514788051326	[Clostridium] scindens	Lachnoclostridium	Lachnospiraceae	Clostridiales	Clostridia	Firmicutes	Terrabacteria group	Bacteria			
114527	0.001727363720365675	Mogibacterium diversum	Mogibacterium	Clostridiales Family XIII. Incertae Sedis	Clostridiales	Clostridia	Firmicutes	Terrabacteria group	Bacteria			
114528	8.174894336333193e-05	Mogibacterium neglectum	Mogibacterium	Clostridiales Family XIII. Incertae Sedis	Clostridiales	Clostridia	Firmicutes	Terrabacteria group	Bacteria			
1816687	0.0007117937881109953	Massiliprevotella massiliensis	Massiliprevotella	Prevotellaceae	Bacteroidales	Bacteroidia	Bacteroidetes	FCB group	Bacteria			
1150298	0.003096030690177655	Fusicatenibacter saccharivorans	Fusicatenibacter	Lachnospiraceae	Clostridiales	Clostridia	Firmicutes	Terrabacteria group	Bacteria			
871665	0.0012710084196551753	Blautia faecis	Blautia	Lachnospiraceae	Clostridiales	Clostridia	Firmicutes	Terrabacteria group	Bacteria			
33039	0.0002008710544537609	[Ruminococcus] torques	Mediterraneibacter	Lachnospiraceae	Clostridiales	Clostridia	Firmicutes	Terrabacteria group	Bacteria			
1679721	5.626790095577274e-05	Herbinix luporum	Herbinix	Lachnospiraceae	Clostridiales	Clostridia	Firmicutes	Terrabacteria group	Bacteria			
1871029	0.0001257165896641961	Intestinibacillus massiliensis	Intestinibacillus	Eubacteriaceae	Clostridiales	Clostridia	Firmicutes	Terrabacteria group	Bacteria			
884684	7.448455683063804e-05	Mageeibacillus indolicus	Mageeibacillus	Hungateiclostridiaceae	Clostridiales	Clostridia	Firmicutes	Terrabacteria group	Bacteria			
52226	0.00023002055324210214	Mitsuokella multacida	Mitsuokella	Selenomonadaceae	Selenomonadales	Negativicutes	Firmicutes	Terrabacteria group	Bacteria			
1958780	0.0006950291145481837	Clostridium merdae	Clostridium	Clostridiaceae	Clostridiales	Clostridia	Firmicutes	Terrabacteria group	Bacteria			
132932	7.889499697878797e-05	Acetobacterium tundrae	Acetobacterium	Eubacteriaceae	Clostridiales	Clostridia	Firmicutes	Terrabacteria group	Bacteria			
979619	9.539510127251132e-05	Salimesophilobacter vulgaris	Salimesophilobacter	Clostridiaceae	Clostridiales	Clostridia	Firmicutes	Terrabacteria group	Bacteria			
1424294	0.00010743045368917013	Geosporobacter ferrireducens	Geosporobacter	Clostridiaceae	Clostridiales	Clostridia	Firmicutes	Terrabacteria group	Bacteria			
2358141	0.008628235477779097	Anaerotignum faecicola	Anaerotignum	Lachnospiraceae	Clostridiales	Clostridia	Firmicutes	Terrabacteria group	Bacteria			
180164	0.00030386097465564133	Blautia schinkii	Blautia	Lachnospiraceae	Clostridiales	Clostridia	Firmicutes	Terrabacteria group	Bacteria			
915180	5.6163314458321345e-05	Caecibacterium sporoformans	Caecibacterium	Lachnospiraceae	Clostridiales	Clostridia	Firmicutes	Terrabacteria group	Bacteria			
1462919	4.8116225340097484e-05	Mobilitalea sibirica	Mobilitalea	Lachnospiraceae	Clostridiales	Clostridia	Firmicutes	Terrabacteria group	Bacteria			
116085	0.0043019911173538	Coprococcus catus	Coprococcus	Lachnospiraceae	Clostridiales	Clostridia	Firmicutes	Terrabacteria group	Bacteria			
1849041	0.000102809107793313	Harryflintia acetispora	Harryflintia	Ruminococcaceae	Clostridiales	Clostridia	Firmicutes	Terrabacteria group	Bacteria			
1841867	0.0008794011589132836	Phocea massiliensis	Phocea	Ruminococcaceae	Clostridiales	Clostridia	Firmicutes	Terrabacteria group	Bacteria			
474960	0.0002559008782834226	Hydrogenoanaerobacterium saccharovorans	Hydrogenoanaerobacterium	Ruminococcaceae	Clostridiales	Clostridia	Firmicutes	Terrabacteria group	Bacteria			
438033	0.0001099312477614068	Ruminococcus gauvreauii	Ruminococcus	Ruminococcaceae	Clostridiales	Clostridia	Firmicutes	Terrabacteria group	Bacteria			
349095	8.94726192270496e-05	Megasphaera paucivorans	Megasphaera	Veillonellaceae	Veillonellales	Negativicutes	Firmicutes	Terrabacteria group	Bacteria			
2144175	6.714036557153763e-05	Megasphaera stantonii	Megasphaera	Veillonellaceae	Veillonellales	Negativicutes	Firmicutes	Terrabacteria group	Bacteria			
253239	0.0005096563315931872	Ethanoligenens harbinense	Ethanoligenens	Ruminococcaceae	Clostridiales	Clostridia	Firmicutes	Terrabacteria group	Bacteria			
971	0.0004676210759190192	Selenomonas ruminantium	Selenomonas	Selenomonadaceae	Selenomonadales	Negativicutes	Firmicutes	Terrabacteria group	Bacteria			
1912897	0.00018676663562543498	Blautia sp. N6H1-15	Blautia	Lachnospiraceae	Clostridiales	Clostridia	Firmicutes	Terrabacteria group	Bacteria			
2211212	7.923472828620445e-05	Paenibacillus sp. DCT19	Paenibacillus	Paenibacillaceae	Bacillales	Bacilli	Firmicutes	Terrabacteria group	Bacteria			
1796618	0.000601250839836976	Cuneatibacter caecimuris	Cuneatibacter	Lachnospiraceae	Clostridiales	Clostridia	Firmicutes	Terrabacteria group	Bacteria			
2507162	0.0003569860902937561	Caproiciproducens sp. NJN-50	Caproiciproducens	Ruminococcaceae	Clostridiales	Clostridia	Firmicutes	Terrabacteria group	Bacteria			
52787	5.349741693664421e-05	Anaerofilum pentosovorans	Anaerofilum	Ruminococcaceae	Clostridiales	Clostridia	Firmicutes	Terrabacteria group	Bacteria			
2038680	0.000275314044065833	Paludicola psychrotolerans	Paludicola	Ruminococcaceae	Clostridiales	Clostridia	Firmicutes	Terrabacteria group	Bacteria			
1160721	0.00012356165805674506	Ruminococcus bicirculans	Ruminococcus	Ruminococcaceae	Clostridiales	Clostridia	Firmicutes	Terrabacteria group	Bacteria			
1531	3.6223425166528817e-05	Enterocloster clostridioformis	Enterocloster	Lachnospiraceae	Clostridiales	Clostridia	Firmicutes	Terrabacteria group	Bacteria			
39496	0.0016759896342266878	Eubacterium ventriosum	Eubacterium	Eubacteriaceae	Clostridiales	Clostridia	Firmicutes	Terrabacteria group	Bacteria			
384638	0.00014017045258203533	[Bacteroides] pectinophilus			Clostridiales	Clostridia	Firmicutes	Terrabacteria group	Bacteria			
433293	0.0007684943488187677	Anaerotaenia torta	Anaerotaenia	Lachnospiraceae	Clostridiales	Clostridia	Firmicutes	Terrabacteria group	Bacteria			
180286	0.00011421273149269016	Hespellia porcina	Hespellia	Lachnospiraceae	Clostridiales	Clostridia	Firmicutes	Terrabacteria group	Bacteria			
89153	0.0004002557400948226	[Clostridium] hylemonae	Lachnoclostridium	Lachnospiraceae	Clostridiales	Clostridia	Firmicutes	Terrabacteria group	Bacteria			
1515	0.00043204286934834016	Hungateiclostridium thermocellum	Hungateiclostridium	Hungateiclostridiaceae	Clostridiales	Clostridia	Firmicutes	Terrabacteria group	Bacteria			
2086584	0.0003106834724122879	Massilistercora timonensis	Massilistercora		Clostridiales	Clostridia	Firmicutes	Terrabacteria group	Bacteria			
1871024	7.345385339998421e-05	Mordavella massiliensis	Mordavella	Clostridiaceae	Clostridiales	Clostridia	Firmicutes	Terrabacteria group	Bacteria			
29364	0.00010570262537955661	[Clostridium] polysaccharolyticum	Lachnoclostridium	Lachnospiraceae	Clostridiales	Clostridia	Firmicutes	Terrabacteria group	Bacteria			
309120	5.432464602759826e-05	Dialister micraerophilus	Dialister	Veillonellaceae	Veillonellales	Negativicutes	Firmicutes	Terrabacteria group	Bacteria			
1232428	4.451492473991376e-05	Megasphaera massiliensis	Megasphaera	Veillonellaceae	Veillonellales	Negativicutes	Firmicutes	Terrabacteria group	Bacteria			
454154	0.0005876012378934858	Paraprevotella clara	Paraprevotella	Prevotellaceae	Bacteroidales	Bacteroidia	Bacteroidetes	FCB group	Bacteria			
51365	0.0001617276873724185	Mycoplasma yeatsii	Mycoplasma	Mycoplasmataceae	Mycoplasmatales	Mollicutes	Tenericutes	Terrabacteria group	Bacteria			
1406	9.700857689693092e-05	Paenibacillus polymyxa	Paenibacillus	Paenibacillaceae	Bacillales	Bacilli	Firmicutes	Terrabacteria group	Bacteria			
66219	5.4813268385720574e-05	Lachnoclostridium phytofermentans	Lachnoclostridium	Lachnospiraceae	Clostridiales	Clostridia	Firmicutes	Terrabacteria group	Bacteria			
1414721	3.830396582064282e-05	Clostridium jeddahense	Clostridium	Clostridiaceae	Clostridiales	Clostridia	Firmicutes	Terrabacteria group	Bacteria			
28038	6.472273186463847e-05	Lactobacillus curvatus	Lactobacillus	Lactobacillaceae	Lactobacillales	Bacilli	Firmicutes	Terrabacteria group	Bacteria			
100886	0.0005991236716986582	Catenibacterium mitsuokai	Catenibacterium	Erysipelotrichaceae	Erysipelotrichales	Erysipelotrichia	Firmicutes	Terrabacteria group	Bacteria			
86332	9.794434912556478e-05	Mogibacterium pumilum	Mogibacterium	Clostridiales Family XIII. Incertae Sedis	Clostridiales	Clostridia	Firmicutes	Terrabacteria group	Bacteria			
2741	0.0002470589118266303	Peptococcus niger	Peptococcus	Peptococcaceae	Clostridiales	Clostridia	Firmicutes	Terrabacteria group	Bacteria			
1643805	6.064375417517004e-05	Peptococcus simiae	Peptococcus	Peptococcaceae	Clostridiales	Clostridia	Firmicutes	Terrabacteria group	Bacteria			
1677857	6.534658417635895e-05	Hungateiclostridium saccincola	Hungateiclostridium	Hungateiclostridiaceae	Clostridiales	Clostridia	Firmicutes	Terrabacteria group	Bacteria			
288966	0.0001160181014591486	Lutispora thermophila	Lutispora	Clostridiaceae	Clostridiales	Clostridia	Firmicutes	Terrabacteria group	Bacteria			
37482	0.0011871317379250537	Laceyella sacchari	Laceyella	Thermoactinomycetaceae	Bacillales	Bacilli	Firmicutes	Terrabacteria group	Bacteria			
76853	6.636017468690201e-05	Solibacillus silvestris	Solibacillus	Planococcaceae	Bacillales	Bacilli	Firmicutes	Terrabacteria group	Bacteria			
2594789	0.00010315418540196293	Lachnospiraceae bacterium KGMB03038		Lachnospiraceae	Clostridiales	Clostridia	Firmicutes	Terrabacteria group	Bacteria			
2109692	0.00013050165575161253	Erysipelotrichaceae bacterium GAM147		Erysipelotrichaceae	Erysipelotrichales	Erysipelotrichia	Firmicutes	Terrabacteria group	Bacteria			
1335	0.00010429815487237184	Streptococcus equinus	Streptococcus	Streptococcaceae	Lactobacillales	Bacilli	Firmicutes	Terrabacteria group	Bacteria			
1304	0.0005124380523293565	Streptococcus salivarius	Streptococcus	Streptococcaceae	Lactobacillales	Bacilli	Firmicutes	Terrabacteria group	Bacteria			
1308	0.0001026202423472396	Streptococcus thermophilus	Streptococcus	Streptococcaceae	Lactobacillales	Bacilli	Firmicutes	Terrabacteria group	Bacteria			
1796619	4.619976244170035e-05	Irregularibacter muris	Irregularibacter	Eubacteriaceae	Clostridiales	Clostridia	Firmicutes	Terrabacteria group	Bacteria			
65403	6.317899187368716e-05	Acidaminobacter hydrogenoformans	Acidaminobacter	Clostridiales Family XII. Incertae Sedis	Clostridiales	Clostridia	Firmicutes	Terrabacteria group	Bacteria			
1776384	0.00017803733262460449	Emergencia timonensis	Emergencia	Clostridiales Family XIII. Incertae Sedis	Clostridiales	Clostridia	Firmicutes	Terrabacteria group	Bacteria			
1177574	0.00012306732678567594	Prevotella jejuni	Prevotella	Prevotellaceae	Bacteroidales	Bacteroidia	Bacteroidetes	FCB group	Bacteria			
28132	6.720532213387118e-05	Prevotella melaninogenica	Prevotella	Prevotellaceae	Bacteroidales	Bacteroidia	Bacteroidetes	FCB group	Bacteria			
28135	7.723635926665645e-05	Prevotella oris	Prevotella	Prevotellaceae	Bacteroidales	Bacteroidia	Bacteroidetes	FCB group	Bacteria			
423605	0.00038839778147187236	Elusimicrobium minutum	Elusimicrobium	Elusimicrobiaceae	Elusimicrobiales	Elusimicrobia	Elusimicrobia		Bacteria			
28116	5.239733896165724e-05	Bacteroides ovatus	Bacteroides	Bacteroidaceae	Bacteroidales	Bacteroidia	Bacteroidetes	FCB group	Bacteria			
371601	7.949641280292468e-05	Bacteroides xylanisolvens	Bacteroides	Bacteroidaceae	Bacteroidales	Bacteroidia	Bacteroidetes	FCB group	Bacteria			
818	4.790678103800926e-05	Bacteroides thetaiotaomicron	Bacteroides	Bacteroidaceae	Bacteroidales	Bacteroidia	Bacteroidetes	FCB group	Bacteria			
682400	6.0580065881734285e-05	Natranaerovirga pectinivora	Natranaerovirga		Clostridiales	Clostridia	Firmicutes	Terrabacteria group	Bacteria			
937334	0.00010370347834444448	Caldicoprobacter faecalis	Caldicoprobacter	Caldicoprobacteraceae	Clostridiales	Clostridia	Firmicutes	Terrabacteria group	Bacteria			
433287	0.00013221644335933286	Anaerotignum aminivorans	Anaerotignum	Lachnospiraceae	Clostridiales	Clostridia	Firmicutes	Terrabacteria group	Bacteria			
265178	7.780226050151937e-05	Breznakia pachnodae	Breznakia	Erysipelotrichaceae	Erysipelotrichales	Erysipelotrichia	Firmicutes	Terrabacteria group	Bacteria			
1834207	0.0001298032708338497	Erysipelotrichaceae bacterium I46		Erysipelotrichaceae	Erysipelotrichales	Erysipelotrichia	Firmicutes	Terrabacteria group	Bacteria			
160404	7.462719901617381e-05	Anaerotignum lactatifermentans	Anaerotignum	Lachnospiraceae	Clostridiales	Clostridia	Firmicutes	Terrabacteria group	Bacteria			
562	0.00022993454751774105	Escherichia coli	Escherichia	Enterobacteriaceae	Enterobacterales	Gammaproteobacteria	Proteobacteria		Bacteria			
46609	6.195276212770378e-05	Clostridium pascui	Clostridium	Clostridiaceae	Clostridiales	Clostridia	Firmicutes	Terrabacteria group	Bacteria			
1735	0.0007557513626251358	Holdemanella biformis	Holdemanella	Erysipelotrichaceae	Erysipelotrichales	Erysipelotrichia	Firmicutes	Terrabacteria group	Bacteria			
39497	0.0001300060024343311	Eubacterium xylanophilum	Eubacterium	Eubacteriaceae	Clostridiales	Clostridia	Firmicutes	Terrabacteria group	Bacteria			
86957	0.00012680663142930802	Selenomonas lacticifex	Selenomonas	Selenomonadaceae	Selenomonadales	Negativicutes	Firmicutes	Terrabacteria group	Bacteria			
308994	3.187985028185841e-05	Dialister propionicifaciens	Dialister	Veillonellaceae	Veillonellales	Negativicutes	Firmicutes	Terrabacteria group	Bacteria			
1852367	0.000694237541869128	Ihubacter massiliensis	Ihubacter	Clostridiales Family XIII. Incertae Sedis	Clostridiales	Clostridia	Firmicutes	Terrabacteria group	Bacteria			
52689	5.566833339546905e-05	Acetobacterium bakii	Acetobacterium	Eubacteriaceae	Clostridiales	Clostridia	Firmicutes	Terrabacteria group	Bacteria			
143393	5.188454733654745e-05	[Eubacterium] sulci		Clostridiales Family XIII. Incertae Sedis	Clostridiales	Clostridia	Firmicutes	Terrabacteria group	Bacteria			
1776391	0.00014603756583342302	Romboutsia timonensis	Romboutsia	Peptostreptococcaceae	Clostridiales	Clostridia	Firmicutes	Terrabacteria group	Bacteria			
433296	0.00031015224427734744	Aminipila butyrica	Aminipila	Clostridiales Family XIII. Incertae Sedis	Clostridiales	Clostridia	Firmicutes	Terrabacteria group	Bacteria			
109327	0.00017712925736118455	Anaerovorax odorimutans	Anaerovorax	Clostridiales Family XIII. Incertae Sedis	Clostridiales	Clostridia	Firmicutes	Terrabacteria group	Bacteria			
2507160	0.00023888162363987485	Aminipila sp. JN-18	Aminipila	Clostridiales Family XIII. Incertae Sedis	Clostridiales	Clostridia	Firmicutes	Terrabacteria group	Bacteria			
35517	3.2386003256514786e-05	[Eubacterium] brachy		Clostridiales Family XIII. Incertae Sedis	Clostridiales	Clostridia	Firmicutes	Terrabacteria group	Bacteria			
2094242	0.0005051729236367129	Victivallales bacterium CCUG 44730			Victivallales	Lentisphaeria	Lentisphaerae	PVC group	Bacteria			
172901	0.00011940703216684782	Victivallis vadensis	Victivallis	Victivallaceae	Victivallales	Lentisphaeria	Lentisphaerae	PVC group	Bacteria			
938278	3.6171434710201467e-05	Casaltella massiliensis	Casaltella	Clostridiales Family XIII. Incertae Sedis	Clostridiales	Clostridia	Firmicutes	Terrabacteria group	Bacteria			
820	0.00023311709166181355	Bacteroides uniformis	Bacteroides	Bacteroidaceae	Bacteroidales	Bacteroidia	Bacteroidetes	FCB group	Bacteria			
1816689	0.0006090077304593069	Sutterella massiliensis	Sutterella	Sutterellaceae	Burkholderiales	Betaproteobacteria	Proteobacteria		Bacteria			
1623	0.0002922567598832352	Lactobacillus ruminis	Lactobacillus	Lactobacillaceae	Lactobacillales	Bacilli	Firmicutes	Terrabacteria group	Bacteria			
46503	7.197589115316428e-05	Parabacteroides merdae	Parabacteroides	Tannerellaceae	Bacteroidales	Bacteroidia	Bacteroidetes	FCB group	Bacteria			
387661	7.09910611767167e-05	Parabacteroides johnsonii	Parabacteroides	Tannerellaceae	Bacteroidales	Bacteroidia	Bacteroidetes	FCB group	Bacteria			
328813	6.293459075231827e-05	Alistipes onderdonkii	Alistipes	Rikenellaceae	Bacteroidales	Bacteroidia	Bacteroidetes	FCB group	Bacteria			
328814	0.00015348308913920515	Alistipes shahii	Alistipes	Rikenellaceae	Bacteroidales	Bacteroidia	Bacteroidetes	FCB group	Bacteria			
2610896	0.00018649181104765325	Streptococcus sp. LPB0220	Streptococcus	Streptococcaceae	Lactobacillales	Bacilli	Firmicutes	Terrabacteria group	Bacteria			
1759399	0.0001281074230801919	Streptococcus sp. A12	Streptococcus	Streptococcaceae	Lactobacillales	Bacilli	Firmicutes	Terrabacteria group	Bacteria			
1318	7.270309640373909e-05	Streptococcus parasanguinis	Streptococcus	Streptococcaceae	Lactobacillales	Bacilli	Firmicutes	Terrabacteria group	Bacteria			
823	0.00014815409542673634	Parabacteroides distasonis	Parabacteroides	Tannerellaceae	Bacteroidales	Bacteroidia	Bacteroidetes	FCB group	Bacteria			
291645	4.3500551428998506e-05	Bacteroides nordii	Bacteroides	Bacteroidaceae	Bacteroidales	Bacteroidia	Bacteroidetes	FCB group	Bacteria			
901	0.00021127448413288196	Desulfovibrio piger	Desulfovibrio	Desulfovibrionaceae	Desulfovibrionales	Deltaproteobacteria	Proteobacteria		Bacteria			
28118	0.0002268791576200389	Odoribacter splanchnicus	Odoribacter	Odoribacteraceae	Bacteroidales	Bacteroidia	Bacteroidetes	FCB group	Bacteria			
28127	7.13907974132126e-05	Prevotella buccalis	Prevotella	Prevotellaceae	Bacteroidales	Bacteroidia	Bacteroidetes	FCB group	Bacteria			
1302	6.953367646713444e-05	Streptococcus gordonii	Streptococcus	Streptococcaceae	Lactobacillales	Bacilli	Firmicutes	Terrabacteria group	Bacteria			
185293	0.00022856022008576718	Prevotella oryzae	Prevotella	Prevotellaceae	Bacteroidales	Bacteroidia	Bacteroidetes	FCB group	Bacteria			
46506	5.9036462271913926e-05	Bacteroides stercoris	Bacteroides	Bacteroidaceae	Bacteroidales	Bacteroidia	Bacteroidetes	FCB group	Bacteria			
1852381	9.942983205679929e-05	Duodenibacillus massiliensis	Duodenibacillus	Sutterellaceae	Burkholderiales	Betaproteobacteria	Proteobacteria		Bacteria			
47678	4.7529411992082965e-05	Bacteroides caccae	Bacteroides	Bacteroidaceae	Bacteroidales	Bacteroidia	Bacteroidetes	FCB group	Bacteria			
2093856	8.38939207979244e-05	Butyricimonas faecalis	Butyricimonas	Odoribacteraceae	Bacteroidales	Bacteroidia	Bacteroidetes	FCB group	Bacteria			
74426	6.835800953909719e-05	Collinsella aerofaciens	Collinsella	Coriobacteriaceae	Coriobacteriales	Coriobacteriia	Actinobacteria	Terrabacteria group	Bacteria			
29466	0.00011499218785736675	Veillonella parvula	Veillonella	Veillonellaceae	Veillonellales	Negativicutes	Firmicutes	Terrabacteria group	Bacteria			
39778	0.00014835954081381493	Veillonella dispar	Veillonella	Veillonellaceae	Veillonellales	Negativicutes	Firmicutes	Terrabacteria group	Bacteria			
729	0.00019885966411359857	Haemophilus parainfluenzae	Haemophilus	Pasteurellaceae	Pasteurellales	Gammaproteobacteria	Proteobacteria		Bacteria			
28117	4.309458534335558e-05	Alistipes putredinis	Alistipes	Rikenellaceae	Bacteroidales	Bacteroidia	Bacteroidetes	FCB group	Bacteria			
214856	7.60634179568186e-05	Alistipes finegoldii	Alistipes	Rikenellaceae	Bacteroidales	Bacteroidia	Bacteroidetes	FCB group	Bacteria			
83771	3.7286187021299734e-05	Succinivibrio dextrinosolvens	Succinivibrio	Succinivibrionaceae	Aeromonadales	Gammaproteobacteria	Proteobacteria		Bacteria			
