	shannon	age_cat-covid
r10_b1	5.451653784394346	mid-COVID
r10_b10	4.3993394726186015	mid-Control
r10_b11	5.692734442012134	young-COVID
r10_b12	5.087041433874771	young-COVID
r10_b13	4.811488790665726	young-COVID
r10_b14	5.224853855725127	young-COVID
r10_b15	5.3866304705303225	young-COVID
r10_b16	4.380302641332882	young-COVID
r10_b17	5.377987105434265	young-Control
r10_b19	5.678040208666274	young-COVID
r10_b2	5.327404469425192	mid-COVID
r10_b20	5.419988369211675	young-COVID
r10_b21	4.446522582431348	young-COVID
r10_b22	5.580103993628189	young-COVID
r10_b23	6.240713997129879	young-Control
r10_b24	5.209921059202358	young-Control
r10_b3	5.7414780145306565	mid-COVID
r10_b4	5.206883271509894	mid-COVID
r10_b5	3.7899493435274154	mid-COVID
r10_b6	3.2452249881319353	mid-COVID
r10_b8	3.5818358560476615	mid-COVID
r11_b1	5.168761042187993	old-Control
r11_b10	5.232632095550773	young-COVID
r11_b13	5.73190576660787	young-COVID
r11_b14	4.794386302129344	young-COVID
r11_b15	4.784960520125357	young-COVID
r11_b16	4.526566272075035	young-COVID
r11_b17	5.563352810651996	young-COVID
r11_b18	5.822478119369902	young-COVID
r11_b19	4.878027408414349	young-COVID
r11_b2	5.047370455224685	mid-Control
r11_b20	2.575771118856085	young-COVID
r11_b21	2.2317174106455826	young-COVID
r11_b22	5.045625166342318	young-COVID
r11_b23	4.4252778696316595	young-COVID
r11_b24	4.8299740940439655	young-COVID
r11_b3	5.435210449179083	mid-Control
r11_b4	5.394938302807549	young-COVID
r11_b5	4.783019591154382	young-COVID
r11_b7	4.1794419529052735	young-COVID
r11_b8	4.654486007256193	young-COVID
r11_b9	5.395631467695965	young-COVID
r12_b1	5.279574563054823	young-COVID
r12_b10	4.0797608242308545	young-COVID
r12_b11	5.485411390929061	young-COVID
r12_b12	4.887708915750505	young-COVID
r12_b13	3.6350196596404962	young-COVID
r12_b14	5.8297628048863075	young-COVID
r12_b16	5.469935935741073	young-COVID
r12_b17	4.983173555989471	young-COVID
r12_b18	4.6044529274625505	young-COVID
r12_b19	5.3638327610632865	young-COVID
r12_b2	5.48273367618699	young-COVID
r12_b20	4.91723087067159	young-COVID
r12_b22	5.887442062381408	old-Control
r12_b23	5.3845581269408145	old-Control
r12_b24	5.180682917971885	mid-Control
r12_b3	5.099043174455414	young-COVID
r12_b4	4.994282656288714	young-COVID
r12_b5	4.418869742946074	young-COVID
r12_b6	4.559368928885401	young-COVID
r12_b7	4.776073200461309	young-COVID
r12_b8	4.0938481685641674	young-COVID
r12_b9	4.923385935007454	young-COVID
r13_b12	4.332151412778165	young-COVID
r13_b16	5.164883345822577	old-COVID
r1_b1	5.2599833212160245	old-COVID
r1_b10	5.453369601747628	old-COVID
r1_b11	4.829917672019962	old-COVID
r1_b12	5.112109817016359	old-COVID
r1_b13	5.660919378168158	old-COVID
r1_b14	6.007464906448484	old-COVID
r1_b15	5.491494074950027	old-COVID
r1_b16	3.6186210894705684	old-COVID
r1_b18	5.7530862466301	old-COVID
r1_b19	5.640564854940599	old-COVID
r1_b2	4.322363470176201	old-COVID
r1_b20	5.756934819845838	old-COVID
r1_b21	5.351622547535829	old-COVID
r1_b22	5.764231349576428	old-COVID
r1_b23	4.223257206816529	old-COVID
r1_b24	4.6071319401314215	old-COVID
r1_b3	5.080961721288102	old-COVID
r1_b4	5.341414343470652	old-COVID
r1_b5	4.874161952804089	old-COVID
r1_b8	4.258211571154912	old-COVID
r1_b9	4.987607738686871	old-COVID
r2_b1	4.939883850576163	old-COVID
r2_b10	4.096067437180394	old-COVID
r2_b11	4.802462930414147	old-COVID
r2_b12	5.293317517067622	old-COVID
r2_b13	5.02804566351801	old-COVID
r2_b14	5.4698942802225305	old-COVID
r2_b15	6.046675816266097	old-COVID
r2_b16	4.703739021237954	old-COVID
r2_b17	5.168050256238165	old-COVID
r2_b18	6.2234054332763264	old-COVID
r2_b2	5.084854959313258	old-Control
r2_b21	4.825264080933612	old-COVID
r2_b22	5.548825773373107	old-COVID
r2_b3	5.389032675899954	old-COVID
r2_b4	5.321390909129275	old-COVID
r2_b5	4.692915552369267	old-COVID
r2_b6	4.697996927910333	old-COVID
r2_b7	4.557786746132193	old-COVID
r2_b8	3.4415380064585874	old-COVID
r2_b9	3.407748616812435	old-COVID
r3_b1	5.937843928206468	old-COVID
r3_b10	5.345205255883993	old-COVID
r3_b11	3.8199324280070712	old-COVID
r3_b12	5.180904969314255	old-COVID
r3_b13	1.7100090876638192	old-COVID
r3_b14	5.100314362449751	old-COVID
r3_b18	5.042271891846682	old-COVID
r3_b2	4.604807589131811	old-COVID
r3_b20	5.340054924090521	old-COVID
r3_b21	5.631862188382098	old-COVID
r3_b22	5.3341716597167546	old-Control
r3_b23	4.885358488870757	old-Control
r3_b24	5.170514496819006	old-Control
r3_b3	5.807828006870031	old-COVID
r3_b4	4.717866479513519	old-COVID
r3_b5	5.05084577399058	old-COVID
r3_b6	5.2271000531613225	old-COVID
r3_b9	4.527573717864014	old-COVID
r4_b1	5.553056217205307	old-COVID
r4_b14	5.321772008664423	mid-COVID
r4_b15	4.647254949479816	mid-COVID
r4_b17	5.1731306046482395	mid-COVID
r4_b18	5.616751035816263	mid-COVID
r4_b19	5.842238197894937	mid-Control
r4_b2	5.14526131704453	old-COVID
r4_b20	5.693761748403995	mid-Control
r4_b21	5.78623781020633	mid-Control
r4_b22	5.16164381724258	mid-Control
r4_b23	5.397480419223344	mid-COVID
r4_b24	4.20732367726791	mid-COVID
r4_b3	4.7319115446191855	old-COVID
r4_b4	4.673519332120109	old-COVID
r4_b5	5.780977665890593	mid-COVID
r4_b6	3.193508813939347	mid-COVID
r4_b7	4.824841721851967	mid-Control
r5_b1	5.5761625073583305	mid-COVID
r5_b10	5.067776312241362	mid-COVID
r5_b11	5.275126023483389	mid-COVID
r5_b12	4.946315207576345	mid-COVID
r5_b13	5.910951769018901	mid-COVID
r5_b14	5.216410769407957	mid-COVID
r5_b15	4.488645926145847	mid-COVID
r5_b16	4.986849920306811	mid-COVID
r5_b17	5.54920720643391	mid-COVID
r5_b18	4.982478184857001	mid-COVID
r5_b19	2.8305902966814562	mid-COVID
r5_b2	6.070669467176253	mid-COVID
r5_b20	5.541771248485597	mid-COVID
r5_b21	4.327785002045375	mid-COVID
r5_b22	5.292959649673014	mid-Control
r5_b23	6.030287433455587	mid-Control
r5_b24	5.88753263932031	mid-Control
r5_b3	6.203184288076584	mid-COVID
r5_b4	4.688355357044654	mid-Control
r5_b5	5.612734523354851	mid-Control
r5_b6	5.210189781599088	mid-Control
r5_b7	4.560206000240372	mid-Control
r5_b8	5.7287517814379525	mid-COVID
r5_b9	5.272255991708105	mid-COVID
r6_b1	3.904269649608758	mid-COVID
r6_b10	5.971809414298998	mid-COVID
r6_b11	5.597575371036451	mid-COVID
r6_b12	5.587582234456909	mid-COVID
r6_b13	4.443716994779653	mid-COVID
r6_b16	4.249639589541245	mid-COVID
r6_b19	3.0248528405872497	mid-COVID
r6_b2	5.826620788370498	mid-COVID
r6_b20	4.518371722587285	mid-COVID
r6_b22	5.1082146093756915	mid-Control
r6_b23	5.331890946868876	mid-Control
r6_b24	4.805644098180504	mid-Control
r6_b3	5.70906117512236	mid-COVID
r6_b6	6.197284573684509	mid-COVID
r6_b7	4.167000488134258	mid-COVID
r6_b8	5.748967483756616	mid-COVID
r6_b9	5.911122991393337	mid-COVID
r7_b1	4.187726636920178	mid-COVID
r7_b10	5.083985376458357	mid-Control
r7_b11	5.666579984660495	mid-Control
r7_b12	5.799236467794827	mid-Control
r7_b13	2.0611414728241737	mid-COVID
r7_b14	3.7230496367701384	mid-COVID
r7_b16	4.713931681192652	mid-COVID
r7_b17	3.485956756869804	mid-COVID
r7_b18	5.012376103360508	mid-COVID
r7_b19	4.3286485604800315	mid-Control
r7_b2	5.179895426939182	mid-COVID
r7_b20	5.518081120143377	mid-Control
r7_b21	4.043645334460541	mid-Control
r7_b22	4.936402805705241	mid-COVID
r7_b23	5.420667822810481	mid-COVID
r7_b24	4.611703428017205	mid-COVID
r7_b4	3.560875057572204	mid-COVID
r7_b5	5.853262192846772	mid-COVID
r7_b6	4.932241509132876	mid-COVID
r7_b8	5.14718355818714	mid-COVID
r7_b9	5.743370756672538	mid-Control
r8_b1	4.120613452062982	mid-COVID
r8_b10	6.166579558215456	mid-Control
r8_b11	4.697790796237516	mid-COVID
r8_b12	5.721266871897423	mid-COVID
r8_b13	5.570356347783123	mid-COVID
r8_b14	3.9158034749170914	mid-COVID
r8_b15	4.768652839682579	mid-COVID
r8_b16	5.064464603703274	mid-COVID
r8_b17	4.91260481438066	mid-COVID
r8_b18	4.168873877960971	mid-Control
r8_b2	4.713261625539155	mid-COVID
r8_b20	5.091055764578149	mid-COVID
r8_b21	4.909412846667204	mid-COVID
r8_b22	5.19486210331619	mid-Control
r8_b23	4.851279977630256	mid-Control
r8_b3	2.8114593900656595	mid-COVID
r8_b4	4.603316506667231	mid-COVID
r8_b5	3.0089044210419957	mid-COVID
r8_b6	5.849038806436493	mid-Control
r8_b7	5.069185445471415	mid-COVID
r8_b8	5.8263209603461386	mid-Control
r8_b9	5.179496621228508	mid-Control
r9_b11	5.267600209187832	mid-COVID
r9_b12	4.914267887637276	mid-COVID
r9_b13	4.204014778662991	mid-COVID
r9_b14	4.023934159333793	mid-COVID
r9_b15	5.238900680575009	mid-Control
r9_b16	5.2071987167647364	mid-Control
r9_b17	5.531383053995002	mid-Control
r9_b18	5.3083525405256085	mid-COVID
r9_b19	4.71416791728222	mid-COVID
r9_b20	4.989809839184058	mid-COVID
r9_b21	4.761642620917254	mid-Control
r9_b24	5.448072296287427	mid-Control
r9_b4	4.1947991468241765	mid-Control
r9_b5	4.779347282577983	mid-Control
r9_b7	5.880136073769427	mid-Control
r9_b8	5.402163160942907	mid-Control
