	shannon	antibiotic-timepoint
r10_b1	5.451653784394346	Untreated-T0
r10_b11	5.692734442012134	Untreated-T0
r10_b12	5.087041433874771	Untreated-T0
r10_b13	4.811488790665726	Untreated-T14
r10_b14	5.224853855725127	Untreated-T14
r10_b15	5.3866304705303225	Untreated-T0
r10_b16	4.380302641332882	Untreated-T14
r10_b18	5.0501309073866825	Antibiotic-T0
r10_b19	5.678040208666274	Untreated-T0
r10_b2	5.327404469425192	Untreated-T14
r10_b20	5.419988369211675	Untreated-T14
r10_b21	4.446522582431348	Untreated-T0
r10_b22	5.580103993628189	Untreated-T14
r10_b3	5.7414780145306565	Untreated-T0
r10_b4	5.206883271509894	Untreated-T0
r10_b5	3.7899493435274154	Untreated-T14
r10_b6	3.2452249881319353	Untreated-T0
r10_b8	3.5818358560476615	Untreated-T14
r10_b9	5.228715049577529	Antibiotic-T0
r11_b10	5.232632095550773	Untreated-T14
r11_b11	3.0969405116367903	Antibiotic-T0
r11_b12	1.343961215894556	Antibiotic-T14
r11_b13	5.73190576660787	Untreated-T0
r11_b14	4.794386302129344	Untreated-T14
r11_b15	4.784960520125357	Untreated-T0
r11_b16	4.526566272075035	Untreated-T14
r11_b17	5.563352810651996	Untreated-T0
r11_b18	5.822478119369902	Untreated-T14
r11_b19	4.878027408414349	Untreated-T0
r11_b20	2.575771118856085	Untreated-T14
r11_b21	2.2317174106455826	Untreated-T0
r11_b22	5.045625166342318	Untreated-T0
r11_b23	4.4252778696316595	Untreated-T14
r11_b24	4.8299740940439655	Untreated-T14
r11_b4	5.394938302807549	Untreated-T0
r11_b5	4.783019591154382	Untreated-T14
r11_b6	4.556327344921493	Antibiotic-T0
r11_b7	4.1794419529052735	Untreated-T0
r11_b8	4.654486007256193	Untreated-T14
r11_b9	5.395631467695965	Untreated-T0
r12_b1	5.279574563054823	Untreated-T0
r12_b10	4.0797608242308545	Untreated-T14
r12_b11	5.485411390929061	Untreated-T0
r12_b12	4.887708915750505	Untreated-T14
r12_b13	3.6350196596404962	Untreated-T0
r12_b14	5.8297628048863075	Untreated-T14
r12_b16	5.469935935741073	Untreated-T14
r12_b17	4.983173555989471	Untreated-T0
r12_b18	4.6044529274625505	Untreated-T14
r12_b19	5.3638327610632865	Untreated-T0
r12_b2	5.48273367618699	Untreated-T0
r12_b20	4.91723087067159	Untreated-T14
r12_b3	5.099043174455414	Untreated-T14
r12_b4	4.994282656288714	Untreated-T14
r12_b5	4.418869742946074	Untreated-T0
r12_b6	4.559368928885401	Untreated-T14
r12_b7	4.776073200461309	Untreated-T0
r12_b8	4.0938481685641674	Untreated-T0
r12_b9	4.923385935007454	Untreated-T14
r13_b12	4.332151412778165	Untreated-T0
r13_b14	5.627444514235439	Antibiotic-T0
r13_b16	5.164883345822577	Untreated-T0
r1_b1	5.2599833212160245	Untreated-T0
r1_b10	5.453369601747628	Untreated-T0
r1_b11	4.829917672019962	Untreated-T14
r1_b12	5.112109817016359	Untreated-T0
r1_b13	5.660919378168158	Untreated-T14
r1_b14	6.007464906448484	Untreated-T0
r1_b15	5.491494074950027	Untreated-T14
r1_b16	3.6186210894705684	Untreated-T0
r1_b18	5.7530862466301	Untreated-T14
r1_b19	5.640564854940599	Untreated-T0
r1_b2	4.322363470176201	Untreated-T0
r1_b20	5.756934819845838	Untreated-T0
r1_b21	5.351622547535829	Untreated-T14
r1_b22	5.764231349576428	Untreated-T0
r1_b23	4.223257206816529	Untreated-T14
r1_b24	4.6071319401314215	Untreated-T0
r1_b3	5.080961721288102	Untreated-T14
r1_b4	5.341414343470652	Untreated-T0
r1_b5	4.874161952804089	Untreated-T14
r1_b6	4.658452097527197	Antibiotic-T0
r1_b7	3.3397908217604093	Antibiotic-T0
r1_b8	4.258211571154912	Untreated-T0
r1_b9	4.987607738686871	Untreated-T14
r2_b1	4.939883850576163	Untreated-T14
r2_b10	4.096067437180394	Untreated-T0
r2_b11	4.802462930414147	Untreated-T14
r2_b12	5.293317517067622	Untreated-T0
r2_b13	5.02804566351801	Untreated-T14
r2_b14	5.4698942802225305	Untreated-T0
r2_b15	6.046675816266097	Untreated-T14
r2_b16	4.703739021237954	Untreated-T0
r2_b17	5.168050256238165	Untreated-T0
r2_b18	6.2234054332763264	Untreated-T14
r2_b19	0.3782287052686728	Antibiotic-T0
r2_b20	4.473609261874012	Antibiotic-T14
r2_b21	4.825264080933612	Untreated-T0
r2_b22	5.548825773373107	Untreated-T14
r2_b23	4.554486216473307	Antibiotic-T0
r2_b3	5.389032675899954	Untreated-T0
r2_b4	5.321390909129275	Untreated-T0
r2_b5	4.692915552369267	Untreated-T0
r2_b6	4.697996927910333	Untreated-T14
r2_b7	4.557786746132193	Untreated-T14
r2_b8	3.4415380064585874	Untreated-T0
r2_b9	3.407748616812435	Untreated-T14
r3_b1	5.937843928206468	Untreated-T0
r3_b10	5.345205255883993	Untreated-T0
r3_b11	3.8199324280070712	Untreated-T0
r3_b12	5.180904969314255	Untreated-T14
r3_b13	1.7100090876638192	Untreated-T0
r3_b14	5.100314362449751	Untreated-T14
r3_b15	4.943208127533679	Antibiotic-T0
r3_b16	5.419438069399323	Antibiotic-T14
r3_b18	5.042271891846682	Untreated-T14
r3_b19	5.103454999185446	Antibiotic-T0
r3_b2	4.604807589131811	Untreated-T0
r3_b20	5.340054924090521	Untreated-T0
r3_b21	5.631862188382098	Untreated-T14
r3_b3	5.807828006870031	Untreated-T14
r3_b4	4.717866479513519	Untreated-T0
r3_b5	5.05084577399058	Untreated-T14
r3_b6	5.2271000531613225	Untreated-T0
r3_b7	5.105274044264199	Antibiotic-T0
r3_b8	2.9449166286721673	Antibiotic-T14
r3_b9	4.527573717864014	Untreated-T0
r4_b1	5.553056217205307	Untreated-T0
r4_b10	5.165570866986579	Antibiotic-T0
r4_b11	1.2172401482750286	Antibiotic-T14
r4_b12	4.6213249629374324	Antibiotic-T14
r4_b13	3.3678417006319616	Antibiotic-T0
r4_b14	5.321772008664423	Untreated-T0
r4_b15	4.647254949479816	Untreated-T0
r4_b16	4.0144274809837075	Antibiotic-T14
r4_b17	5.1731306046482395	Untreated-T14
r4_b18	5.616751035816263	Untreated-T14
r4_b2	5.14526131704453	Untreated-T14
r4_b23	5.397480419223344	Untreated-T0
r4_b24	4.20732367726791	Untreated-T0
r4_b3	4.7319115446191855	Untreated-T0
r4_b4	4.673519332120109	Untreated-T14
r4_b5	5.780977665890593	Untreated-T0
r4_b6	3.193508813939347	Untreated-T14
r4_b8	5.76367628153185	Antibiotic-T0
r4_b9	4.975875450573919	Antibiotic-T0
r5_b1	5.5761625073583305	Untreated-T14
r5_b10	5.067776312241362	Untreated-T14
r5_b11	5.275126023483389	Untreated-T0
r5_b12	4.946315207576345	Untreated-T14
r5_b13	5.910951769018901	Untreated-T14
r5_b14	5.216410769407957	Untreated-T0
r5_b15	4.488645926145847	Untreated-T0
r5_b16	4.986849920306811	Untreated-T14
r5_b17	5.54920720643391	Untreated-T14
r5_b18	4.982478184857001	Untreated-T0
r5_b19	2.8305902966814562	Untreated-T14
r5_b2	6.070669467176253	Untreated-T0
r5_b20	5.541771248485597	Untreated-T0
r5_b21	4.327785002045375	Untreated-T14
r5_b3	6.203184288076584	Untreated-T14
r5_b8	5.7287517814379525	Untreated-T0
r5_b9	5.272255991708105	Untreated-T0
r6_b1	3.904269649608758	Untreated-T0
r6_b10	5.971809414298998	Untreated-T0
r6_b11	5.597575371036451	Untreated-T14
r6_b12	5.587582234456909	Untreated-T0
r6_b13	4.443716994779653	Untreated-T14
r6_b14	4.736368265946043	Antibiotic-T0
r6_b15	5.203299504381709	Antibiotic-T14
r6_b16	4.249639589541245	Untreated-T0
r6_b17	6.0946061589536225	Antibiotic-T0
r6_b18	3.8532121117417177	Antibiotic-T14
r6_b19	3.0248528405872497	Untreated-T0
r6_b2	5.826620788370498	Untreated-T14
r6_b20	4.518371722587285	Untreated-T0
r6_b3	5.70906117512236	Untreated-T0
r6_b4	3.200300717940461	Antibiotic-T0
r6_b5	2.9543169760972963	Antibiotic-T14
r6_b6	6.197284573684509	Untreated-T14
r6_b7	4.167000488134258	Untreated-T0
r6_b8	5.748967483756616	Untreated-T0
r6_b9	5.911122991393337	Untreated-T14
r7_b1	4.187726636920178	Untreated-T0
r7_b13	2.0611414728241737	Untreated-T0
r7_b14	3.7230496367701384	Untreated-T14
r7_b15	3.751950234885208	Antibiotic-T0
r7_b16	4.713931681192652	Untreated-T0
r7_b17	3.485956756869804	Untreated-T0
r7_b18	5.012376103360508	Untreated-T14
r7_b2	5.179895426939182	Untreated-T14
r7_b22	4.936402805705241	Untreated-T0
r7_b23	5.420667822810481	Untreated-T0
r7_b24	4.611703428017205	Untreated-T0
r7_b3	3.51314918537573	Antibiotic-T0
r7_b4	3.560875057572204	Untreated-T0
r7_b5	5.853262192846772	Untreated-T0
r7_b6	4.932241509132876	Untreated-T14
r7_b7	4.7003928780101925	Antibiotic-T14
r7_b8	5.14718355818714	Untreated-T14
r8_b1	4.120613452062982	Untreated-T14
r8_b11	4.697790796237516	Untreated-T0
r8_b12	5.721266871897423	Untreated-T14
r8_b13	5.570356347783123	Untreated-T0
r8_b14	3.915803474917091	Untreated-T0
r8_b15	4.768652839682579	Untreated-T14
r8_b16	5.064464603703274	Untreated-T0
r8_b17	4.91260481438066	Untreated-T14
r8_b19	4.406429785128419	Antibiotic-T0
r8_b2	4.713261625539155	Untreated-T14
r8_b20	5.091055764578149	Untreated-T0
r8_b21	4.909412846667204	Untreated-T14
r8_b24	4.493146541700078	Antibiotic-T0
r8_b3	2.8114593900656595	Untreated-T0
r8_b4	4.603316506667231	Untreated-T14
r8_b5	3.0089044210419957	Untreated-T0
r8_b7	5.069185445471415	Untreated-T14
r9_b1	5.541840961942828	Antibiotic-T0
r9_b10	4.82683415857839	Antibiotic-T14
r9_b11	5.267600209187832	Untreated-T0
r9_b12	4.914267887637276	Untreated-T0
r9_b13	4.204014778662991	Untreated-T14
r9_b14	4.023934159333793	Untreated-T14
r9_b18	5.3083525405256085	Untreated-T0
r9_b19	4.71416791728222	Untreated-T0
r9_b2	3.961086702061245	Antibiotic-T14
r9_b20	4.989809839184058	Untreated-T14
r9_b23	2.2383012111285336	Antibiotic-T14
r9_b3	4.402802001247574	Antibiotic-T0
r9_b6	5.402960105099202	Antibiotic-T14
r9_b9	6.194908657689981	Antibiotic-T0
