	simpson	antibiotic-timepoint
r10_b1	0.9566286154307367	Untreated-T0
r10_b11	0.9560395053242343	Untreated-T0
r10_b12	0.9332098678680065	Untreated-T0
r10_b13	0.9425734343476639	Untreated-T14
r10_b14	0.9231252984858405	Untreated-T14
r10_b15	0.9520754848760382	Untreated-T0
r10_b16	0.8920730023459201	Untreated-T14
r10_b18	0.9477168732854555	Antibiotic-T0
r10_b19	0.9450556079585265	Untreated-T0
r10_b2	0.9474286478397707	Untreated-T14
r10_b20	0.947448637490244	Untreated-T14
r10_b21	0.9025590503654951	Untreated-T0
r10_b22	0.9543252115925089	Untreated-T14
r10_b3	0.9511723195779954	Untreated-T0
r10_b4	0.9489780562260873	Untreated-T0
r10_b5	0.7826708732801707	Untreated-T14
r10_b6	0.8885533878215937	Untreated-T0
r10_b8	0.7424628154778592	Untreated-T14
r10_b9	0.9489956639805254	Antibiotic-T0
r11_b10	0.9362846165572839	Untreated-T14
r11_b11	0.732157740783312	Antibiotic-T0
r11_b12	0.44194277367454293	Antibiotic-T14
r11_b13	0.9657613433358185	Untreated-T0
r11_b14	0.9186124185949439	Untreated-T14
r11_b15	0.9132949601908098	Untreated-T0
r11_b16	0.8924068702051818	Untreated-T14
r11_b17	0.954536381281898	Untreated-T0
r11_b18	0.969068689109629	Untreated-T14
r11_b19	0.9451708330034005	Untreated-T0
r11_b20	0.553511576006895	Untreated-T14
r11_b21	0.49064834355373255	Untreated-T0
r11_b22	0.9484259809152176	Untreated-T0
r11_b23	0.8655880378969003	Untreated-T14
r11_b24	0.9334380379874943	Untreated-T14
r11_b4	0.958730314038832	Untreated-T0
r11_b5	0.9208072426301597	Untreated-T14
r11_b6	0.9186373353751892	Antibiotic-T0
r11_b7	0.8701775950152477	Untreated-T0
r11_b8	0.9184171620937741	Untreated-T14
r11_b9	0.9545960793415298	Untreated-T0
r12_b1	0.9395819993312585	Untreated-T0
r12_b10	0.7696503167818574	Untreated-T14
r12_b11	0.9447197656920029	Untreated-T0
r12_b12	0.910993847069885	Untreated-T14
r12_b13	0.7204396552330687	Untreated-T0
r12_b14	0.9695303224064659	Untreated-T14
r12_b16	0.9510747345515744	Untreated-T14
r12_b17	0.9436819415864497	Untreated-T0
r12_b18	0.9014486470352094	Untreated-T14
r12_b19	0.9343713920173701	Untreated-T0
r12_b2	0.9597528113078033	Untreated-T0
r12_b20	0.9054007323591923	Untreated-T14
r12_b3	0.9311630227002048	Untreated-T14
r12_b4	0.9264981358346261	Untreated-T14
r12_b5	0.8383869530985549	Untreated-T0
r12_b6	0.8989316074044197	Untreated-T14
r12_b7	0.8836551446050849	Untreated-T0
r12_b8	0.8724858790438557	Untreated-T0
r12_b9	0.9041849138743846	Untreated-T14
r13_b12	0.857110794620682	Untreated-T0
r13_b14	0.9574861593759594	Antibiotic-T0
r13_b16	0.9456534646817828	Untreated-T0
r1_b1	0.9452844764731321	Untreated-T0
r1_b10	0.9426984889025639	Untreated-T0
r1_b11	0.898394008589025	Untreated-T14
r1_b12	0.9404067923647801	Untreated-T0
r1_b13	0.9604026965862746	Untreated-T14
r1_b14	0.9718563392723031	Untreated-T0
r1_b15	0.9598381535047994	Untreated-T14
r1_b16	0.7662805597308615	Untreated-T0
r1_b18	0.9582513816741445	Untreated-T14
r1_b19	0.9480195503632376	Untreated-T0
r1_b2	0.8437792821080916	Untreated-T0
r1_b20	0.9604091984561632	Untreated-T0
r1_b21	0.9423552969043418	Untreated-T14
r1_b22	0.9642247902028732	Untreated-T0
r1_b23	0.828011712144306	Untreated-T14
r1_b24	0.8963329127690902	Untreated-T0
r1_b3	0.9389201167696597	Untreated-T14
r1_b4	0.9427686176634551	Untreated-T0
r1_b5	0.8914363642474705	Untreated-T14
r1_b6	0.8557370808409619	Antibiotic-T0
r1_b7	0.7831404868905982	Antibiotic-T0
r1_b8	0.8751052156223035	Untreated-T0
r1_b9	0.9363668064024425	Untreated-T14
r2_b1	0.9254833521575208	Untreated-T14
r2_b10	0.9033857727627119	Untreated-T0
r2_b11	0.894438508593925	Untreated-T14
r2_b12	0.9421832176617297	Untreated-T0
r2_b13	0.924925623758358	Untreated-T14
r2_b14	0.9506740007523702	Untreated-T0
r2_b15	0.9681523695749552	Untreated-T14
r2_b16	0.8787940970824961	Untreated-T0
r2_b17	0.9431015014549298	Untreated-T0
r2_b18	0.9786801017710836	Untreated-T14
r2_b19	0.09354401059125506	Antibiotic-T0
r2_b20	0.8855080202403033	Antibiotic-T14
r2_b21	0.907034816962118	Untreated-T0
r2_b22	0.9628427088321471	Untreated-T14
r2_b23	0.8830211364933126	Antibiotic-T0
r2_b3	0.9502581876822019	Untreated-T0
r2_b4	0.9344448531054095	Untreated-T0
r2_b5	0.8936748471157105	Untreated-T0
r2_b6	0.9013714600782627	Untreated-T14
r2_b7	0.9023426269546919	Untreated-T14
r2_b8	0.695097912133638	Untreated-T0
r2_b9	0.682670396237832	Untreated-T14
r3_b1	0.9724805912129993	Untreated-T0
r3_b10	0.9469780312320124	Untreated-T0
r3_b11	0.7714871262524183	Untreated-T0
r3_b12	0.9386345413511267	Untreated-T14
r3_b13	0.5683744460634168	Untreated-T0
r3_b14	0.9472143584287763	Untreated-T14
r3_b15	0.9178402762993478	Antibiotic-T0
r3_b16	0.9396993716095965	Antibiotic-T14
r3_b18	0.9473080627231962	Untreated-T14
r3_b19	0.9314195401335609	Antibiotic-T0
r3_b2	0.8889714431190769	Untreated-T0
r3_b20	0.9494535186392372	Untreated-T0
r3_b21	0.9577146724703278	Untreated-T14
r3_b3	0.9712622805919082	Untreated-T14
r3_b4	0.9259456424419625	Untreated-T0
r3_b5	0.9182290569140195	Untreated-T14
r3_b6	0.9447650782461772	Untreated-T0
r3_b7	0.9530977462748905	Antibiotic-T0
r3_b8	0.7533917791150574	Antibiotic-T14
r3_b9	0.9183850103945367	Untreated-T0
r4_b1	0.9550514018729443	Untreated-T0
r4_b10	0.9315689362449475	Antibiotic-T0
r4_b11	0.4195948743461154	Antibiotic-T14
r4_b12	0.9127748005681285	Antibiotic-T14
r4_b13	0.7702949011311477	Antibiotic-T0
r4_b14	0.9648757612080128	Untreated-T0
r4_b15	0.8612114043205484	Untreated-T0
r4_b16	0.7938336092159385	Antibiotic-T14
r4_b17	0.9514914722011919	Untreated-T14
r4_b18	0.9480651348645386	Untreated-T14
r4_b2	0.933728718107337	Untreated-T14
r4_b23	0.9344004144520588	Untreated-T0
r4_b24	0.8410500853427147	Untreated-T0
r4_b3	0.9001274605834444	Untreated-T0
r4_b4	0.9274794340748551	Untreated-T14
r4_b5	0.968204667015768	Untreated-T0
r4_b6	0.7679458389070403	Untreated-T14
r4_b8	0.96225482118517	Antibiotic-T0
r4_b9	0.9498499302907035	Antibiotic-T0
r5_b1	0.9463084076598904	Untreated-T14
r5_b10	0.9260516371235802	Untreated-T14
r5_b11	0.9131445709245736	Untreated-T0
r5_b12	0.9074835423370493	Untreated-T14
r5_b13	0.9685415519647406	Untreated-T14
r5_b14	0.9182562663831202	Untreated-T0
r5_b15	0.9109563060895287	Untreated-T0
r5_b16	0.9042854418378551	Untreated-T14
r5_b17	0.9525567291914572	Untreated-T14
r5_b18	0.93265834717526	Untreated-T0
r5_b19	0.6198662571370618	Untreated-T14
r5_b2	0.9653628709546151	Untreated-T0
r5_b20	0.9591417910294956	Untreated-T0
r5_b21	0.8851150605293099	Untreated-T14
r5_b3	0.9725111353959437	Untreated-T14
r5_b8	0.960984620368485	Untreated-T0
r5_b9	0.9449509900019308	Untreated-T0
r6_b1	0.7457757561194344	Untreated-T0
r6_b10	0.9666947582247145	Untreated-T0
r6_b11	0.9494785213992648	Untreated-T14
r6_b12	0.949748166159329	Untreated-T0
r6_b13	0.8827747806695431	Untreated-T14
r6_b14	0.9114583632648982	Antibiotic-T0
r6_b15	0.906039279281202	Antibiotic-T14
r6_b16	0.8972975964449792	Untreated-T0
r6_b17	0.9685346506767905	Antibiotic-T0
r6_b18	0.8193550600480783	Antibiotic-T14
r6_b19	0.6550220906080206	Untreated-T0
r6_b2	0.9373306449224286	Untreated-T14
r6_b20	0.8867754077511172	Untreated-T0
r6_b3	0.9642961610627399	Untreated-T0
r6_b4	0.8358579383428719	Antibiotic-T0
r6_b5	0.7500397593863699	Antibiotic-T14
r6_b6	0.973842197057254	Untreated-T14
r6_b7	0.8073868493842916	Untreated-T0
r6_b8	0.9445743957454417	Untreated-T0
r6_b9	0.9630914122364973	Untreated-T14
r7_b1	0.8409431911276775	Untreated-T0
r7_b13	0.607488966060729	Untreated-T0
r7_b14	0.8697059484774755	Untreated-T14
r7_b15	0.8535373025947373	Antibiotic-T0
r7_b16	0.9393889440283276	Untreated-T0
r7_b17	0.756743833216146	Untreated-T0
r7_b18	0.9497082501361082	Untreated-T14
r7_b2	0.9460589200411121	Untreated-T14
r7_b22	0.8924490983860849	Untreated-T0
r7_b23	0.9339052436293315	Untreated-T0
r7_b24	0.9237980825194804	Untreated-T0
r7_b3	0.810158258570479	Antibiotic-T0
r7_b4	0.8323427251736444	Untreated-T0
r7_b5	0.9688685931427685	Untreated-T0
r7_b6	0.9216117545712618	Untreated-T14
r7_b7	0.9217523897792298	Antibiotic-T14
r7_b8	0.9386913794295093	Untreated-T14
r8_b1	0.8802302641878392	Untreated-T14
r8_b11	0.8063189448547556	Untreated-T0
r8_b12	0.9589647636424494	Untreated-T14
r8_b13	0.955988737823419	Untreated-T0
r8_b14	0.8372035589849168	Untreated-T0
r8_b15	0.9291890923981031	Untreated-T14
r8_b16	0.9441016704803195	Untreated-T0
r8_b17	0.9377850225887551	Untreated-T14
r8_b19	0.910730399707994	Antibiotic-T0
r8_b2	0.900057958930683	Untreated-T14
r8_b20	0.9444519314434493	Untreated-T0
r8_b21	0.9410827097975897	Untreated-T14
r8_b24	0.9008263630572206	Antibiotic-T0
r8_b3	0.6024477948227669	Untreated-T0
r8_b4	0.8656845074962908	Untreated-T14
r8_b5	0.5791759084608109	Untreated-T0
r8_b7	0.9435254198521889	Untreated-T14
r9_b1	0.9458474613021863	Antibiotic-T0
r9_b10	0.9118463838920525	Antibiotic-T14
r9_b11	0.9343013288133448	Untreated-T0
r9_b12	0.8994007485894424	Untreated-T0
r9_b13	0.8267976983975621	Untreated-T14
r9_b14	0.7960894157676713	Untreated-T14
r9_b18	0.9449463934333577	Untreated-T0
r9_b19	0.850793143141064	Untreated-T0
r9_b2	0.8420713215523439	Antibiotic-T14
r9_b20	0.9224257533644366	Untreated-T14
r9_b23	0.6217585326351194	Antibiotic-T14
r9_b3	0.8473014049326381	Antibiotic-T0
r9_b6	0.9538389782547896	Antibiotic-T14
r9_b9	0.9681351105427728	Antibiotic-T0
