feature	metadata	value	coef	stderr	N	N.not.0	pval	qval
Faecalibacterium.prausnitzii	severity_fact	Moderate	-0.329844935974031	0.126146724417401	138	138	0.00995129683571791	0.0746347262678843
Faecalicatena.contorta	severity_fact	Mild	-0.196140853759336	0.0749156171906974	138	138	0.00985796508439189	0.0746347262678843
