tax_id	abundance	species	genus	family	order	class	phylum	clade	superkingdom	subspecies	species subgroup	species group
1816678	0.07549935841952034	Christensenella timonensis	Christensenella	Christensenellaceae	Clostridiales	Clostridia	Firmicutes	Terrabacteria group	Bacteria			
626937	0.10443245006319586	Christensenella minuta	Christensenella	Christensenellaceae	Clostridiales	Clostridia	Firmicutes	Terrabacteria group	Bacteria			
270498	0.014799808734143141	Catabacter hongkongensis	Catabacter	Catabacteriaceae	Clostridiales	Clostridia	Firmicutes	Terrabacteria group	Bacteria			
1805714	0.1890271520140283	Christensenella massiliensis	Christensenella	Christensenellaceae	Clostridiales	Clostridia	Firmicutes	Terrabacteria group	Bacteria			
1537567	0.0005534784429067905	Fusibacter fontis	Fusibacter	Clostridiales Family XII. Incertae Sedis	Clostridiales	Clostridia	Firmicutes	Terrabacteria group	Bacteria			
130788	0.032484499963754625	Sedimentibacter saalensis	Sedimentibacter			Tissierellia	Firmicutes	Terrabacteria group	Bacteria			
319644	0.008031799246909216	Saccharofermentans acetigenes	Saccharofermentans	Hungateiclostridiaceae	Clostridiales	Clostridia	Firmicutes	Terrabacteria group	Bacteria			
52693	0.0007568008111763656	Acetobacterium paludosum	Acetobacterium	Eubacteriaceae	Clostridiales	Clostridia	Firmicutes	Terrabacteria group	Bacteria			
132932	0.01702200608671978	Acetobacterium tundrae	Acetobacterium	Eubacteriaceae	Clostridiales	Clostridia	Firmicutes	Terrabacteria group	Bacteria			
52692	0.002545328390749547	Acetobacterium malicum	Acetobacterium	Eubacteriaceae	Clostridiales	Clostridia	Firmicutes	Terrabacteria group	Bacteria			
52691	3.216209905351616e-05	Acetobacterium fimetarium	Acetobacterium	Eubacteriaceae	Clostridiales	Clostridia	Firmicutes	Terrabacteria group	Bacteria			
52694	0.0005787247789074451	Acetobacterium wieringae	Acetobacterium	Eubacteriaceae	Clostridiales	Clostridia	Firmicutes	Terrabacteria group	Bacteria			
52690	0.001185193392259662	Acetobacterium carbinolicum	Acetobacterium	Eubacteriaceae	Clostridiales	Clostridia	Firmicutes	Terrabacteria group	Bacteria			
33952	0.0009139077344010257	Acetobacterium woodii	Acetobacterium	Eubacteriaceae	Clostridiales	Clostridia	Firmicutes	Terrabacteria group	Bacteria			
1736	0.0005868705668138727	Eubacterium limosum	Eubacterium	Eubacteriaceae	Clostridiales	Clostridia	Firmicutes	Terrabacteria group	Bacteria			
2041044	0.0005107543300430534	Eubacterium maltosivorans	Eubacterium	Eubacteriaceae	Clostridiales	Clostridia	Firmicutes	Terrabacteria group	Bacteria			
53442	0.00025184973097138727	Eubacterium callanderi	Eubacterium	Eubacteriaceae	Clostridiales	Clostridia	Firmicutes	Terrabacteria group	Bacteria			
1528	0.00015277250407058773	Eubacterium barkeri	Eubacterium	Eubacteriaceae	Clostridiales	Clostridia	Firmicutes	Terrabacteria group	Bacteria			
28446	0.0007811035153418351	Anaerotignum propionicum	Anaerotignum	Lachnospiraceae	Clostridiales	Clostridia	Firmicutes	Terrabacteria group	Bacteria			
2358141	0.0008800255778733749	Anaerotignum faecicola	Anaerotignum	Lachnospiraceae	Clostridiales	Clostridia	Firmicutes	Terrabacteria group	Bacteria			
160404	0.00033626407661224754	Anaerotignum lactatifermentans	Anaerotignum	Lachnospiraceae	Clostridiales	Clostridia	Firmicutes	Terrabacteria group	Bacteria			
433279	0.008754217646563495	Falcatimonas natans	Falcatimonas	Clostridiaceae	Clostridiales	Clostridia	Firmicutes	Terrabacteria group	Bacteria			
358743	3.861786192858619e-05	Enterocloster citroniae	Enterocloster	Lachnospiraceae	Clostridiales	Clostridia	Firmicutes	Terrabacteria group	Bacteria			
208479	0.003805895631638263	Enterocloster bolteae	Enterocloster	Lachnospiraceae	Clostridiales	Clostridia	Firmicutes	Terrabacteria group	Bacteria			
180311	0.0056404694327094225	Hespellia stercorisuis	Hespellia	Lachnospiraceae	Clostridiales	Clostridia	Firmicutes	Terrabacteria group	Bacteria			
1096246	0.0014075399323208576	Hungatella effluvii	Hungatella	Clostridiaceae	Clostridiales	Clostridia	Firmicutes	Terrabacteria group	Bacteria			
69825	0.0008422941302663104	Lacrimispora indolis	Lacrimispora	Lachnospiraceae	Clostridiales	Clostridia	Firmicutes	Terrabacteria group	Bacteria			
1834196	0.0008094899980488282	Lachnoclostridium sp. YL32	Lachnoclostridium	Lachnospiraceae	Clostridiales	Clostridia	Firmicutes	Terrabacteria group	Bacteria			
1531	3.191806622020018e-05	Enterocloster clostridioformis	Enterocloster	Lachnospiraceae	Clostridiales	Clostridia	Firmicutes	Terrabacteria group	Bacteria			
29354	2.718346878527532e-05	Lacrimispora celerecrescens	Lacrimispora	Lachnospiraceae	Clostridiales	Clostridia	Firmicutes	Terrabacteria group	Bacteria			
915180	0.0001549616506896095	Caecibacterium sporoformans	Caecibacterium	Lachnospiraceae	Clostridiales	Clostridia	Firmicutes	Terrabacteria group	Bacteria			
84030	0.003859050328595723	Lacrimispora saccharolytica	Lacrimispora	Lachnospiraceae	Clostridiales	Clostridia	Firmicutes	Terrabacteria group	Bacteria			
29370	0.001440000527005603	Lacrimispora sphenoides	Lacrimispora	Lachnospiraceae	Clostridiales	Clostridia	Firmicutes	Terrabacteria group	Bacteria			
29375	0.00012326919328013958	Lacrimispora xylanolytica	Lacrimispora	Lachnospiraceae	Clostridiales	Clostridia	Firmicutes	Terrabacteria group	Bacteria			
36832	0.00015804424465382035	Lacrimispora aerotolerans	Lacrimispora	Lachnospiraceae	Clostridiales	Clostridia	Firmicutes	Terrabacteria group	Bacteria			
384636	0.0009060995711638777	Hungatella xylanolytica	Hungatella	Clostridiaceae	Clostridiales	Clostridia	Firmicutes	Terrabacteria group	Bacteria			
655338	0.00012335899889956783	Fervidicella metallireducens	Fervidicella	Clostridiaceae	Clostridiales	Clostridia	Firmicutes	Terrabacteria group	Bacteria			
433296	0.00042277344263508303	Aminipila butyrica	Aminipila	Clostridiales Family XIII. Incertae Sedis	Clostridiales	Clostridia	Firmicutes	Terrabacteria group	Bacteria			
938278	3.3224020998695925e-05	Casaltella massiliensis	Casaltella	Clostridiales Family XIII. Incertae Sedis	Clostridiales	Clostridia	Firmicutes	Terrabacteria group	Bacteria			
178338	0.00028608587702003157	Sedimentibacter hongkongensis	Sedimentibacter			Tissierellia	Firmicutes	Terrabacteria group	Bacteria			
116090	0.0003364628601124513	Caloranaerobacter azorensis	Caloranaerobacter	Clostridiaceae	Clostridiales	Clostridia	Firmicutes	Terrabacteria group	Bacteria			
166485	4.730660787936661e-05	Caminicella sporogenes	Caminicella	Clostridiaceae	Clostridiales	Clostridia	Firmicutes	Terrabacteria group	Bacteria			
241555	0.0008184714492733399	Helcococcus sueciensis	Helcococcus	Peptoniphilaceae	Tissierellales	Tissierellia	Firmicutes	Terrabacteria group	Bacteria			
1556	0.0008524573194326242	Gottschalkia acidurici	Gottschalkia	Gottschalkiaceae	Tissierellales	Tissierellia	Firmicutes	Terrabacteria group	Bacteria			
52689	0.0203026540375007	Acetobacterium bakii	Acetobacterium	Eubacteriaceae	Clostridiales	Clostridia	Firmicutes	Terrabacteria group	Bacteria			
2507160	0.00015437817866269834	Aminipila sp. JN-18	Aminipila	Clostridiales Family XIII. Incertae Sedis	Clostridiales	Clostridia	Firmicutes	Terrabacteria group	Bacteria			
109327	0.0001787368541947874	Anaerovorax odorimutans	Anaerovorax	Clostridiales Family XIII. Incertae Sedis	Clostridiales	Clostridia	Firmicutes	Terrabacteria group	Bacteria			
1441821	6.886130170510306e-05	Helcococcus seattlensis	Helcococcus	Peptoniphilaceae	Tissierellales	Tissierellia	Firmicutes	Terrabacteria group	Bacteria			
33033	0.000482806692328918	Parvimonas micra	Parvimonas	Peptoniphilaceae	Tissierellales	Tissierellia	Firmicutes	Terrabacteria group	Bacteria			
1323370	0.00014759681409942936	Caloranaerobacter ferrireducens	Caloranaerobacter	Clostridiaceae	Clostridiales	Clostridia	Firmicutes	Terrabacteria group	Bacteria			
1503	0.0001544115849105558	Gottschalkia purinilytica	Gottschalkia	Gottschalkiaceae	Tissierellales	Tissierellia	Firmicutes	Terrabacteria group	Bacteria			
1852367	0.000508549039449021	Ihubacter massiliensis	Ihubacter	Clostridiales Family XIII. Incertae Sedis	Clostridiales	Clostridia	Firmicutes	Terrabacteria group	Bacteria			
755172	5.286872186592247e-05	Peptoniphilus coxii	Peptoniphilus	Peptoniphilaceae	Tissierellales	Tissierellia	Firmicutes	Terrabacteria group	Bacteria			
879970	4.438366008554401e-05	Defluviitalea saccharophila	Defluviitalea	Defluviitaleaceae	Clostridiales	Clostridia	Firmicutes	Terrabacteria group	Bacteria			
1517	0.0006550007936498307	Thermoanaerobacterium thermosaccharolyticum	Thermoanaerobacterium	Thermoanaerobacterales Family III. Incertae Sedis	Thermoanaerobacterales	Clostridia	Firmicutes	Terrabacteria group	Bacteria			
65403	0.00016578194768743758	Acidaminobacter hydrogenoformans	Acidaminobacter	Clostridiales Family XII. Incertae Sedis	Clostridiales	Clostridia	Firmicutes	Terrabacteria group	Bacteria			
113287	4.889686029584237e-05	Pseudoramibacter alactolyticus	Pseudoramibacter	Eubacteriaceae	Clostridiales	Clostridia	Firmicutes	Terrabacteria group	Bacteria			
332095	9.639253289999667e-05	Dethiosulfatibacter aminovorans	Dethiosulfatibacter			Tissierellia	Firmicutes	Terrabacteria group	Bacteria			
1261	4.05371858140281e-05	Peptostreptococcus anaerobius	Peptostreptococcus	Peptostreptococcaceae	Clostridiales	Clostridia	Firmicutes	Terrabacteria group	Bacteria			
1264	0.00039188822244013696	Ruminococcus albus	Ruminococcus	Ruminococcaceae	Clostridiales	Clostridia	Firmicutes	Terrabacteria group	Bacteria			
1776384	0.0003174168825607665	Emergencia timonensis	Emergencia	Clostridiales Family XIII. Incertae Sedis	Clostridiales	Clostridia	Firmicutes	Terrabacteria group	Bacteria			
33038	0.0008902975629242809	[Ruminococcus] gnavus	Mediterraneibacter	Lachnospiraceae	Clostridiales	Clostridia	Firmicutes	Terrabacteria group	Bacteria			
1720294	8.690580635288683e-05	Eisenbergiella massiliensis	Eisenbergiella	Lachnospiraceae	Clostridiales	Clostridia	Firmicutes	Terrabacteria group	Bacteria			
645887	0.00017507609934958062	Alkalibaculum bacchi	Alkalibaculum	Eubacteriaceae	Clostridiales	Clostridia	Firmicutes	Terrabacteria group	Bacteria			
51665	0.0006841969253127789	Aerococcus urinaeequi	Aerococcus	Aerococcaceae	Lactobacillales	Bacilli	Firmicutes	Terrabacteria group	Bacteria			
1377	3.0165408950899196e-05	Aerococcus viridans	Aerococcus	Aerococcaceae	Lactobacillales	Bacilli	Firmicutes	Terrabacteria group	Bacteria			
28896	4.122346053212394e-05	Thermoanaerobacterium saccharolyticum	Thermoanaerobacterium	Thermoanaerobacterales Family III. Incertae Sedis	Thermoanaerobacterales	Clostridia	Firmicutes	Terrabacteria group	Bacteria			
520762	0.0006026218788104432	Thermotalea metallivorans	Thermotalea	Clostridiaceae	Clostridiales	Clostridia	Firmicutes	Terrabacteria group	Bacteria			
1557	5.63910601370475e-05	Peptoclostridium litorale	Peptoclostridium	Peptostreptococcaceae	Clostridiales	Clostridia	Firmicutes	Terrabacteria group	Bacteria			
1424294	0.022572440575185475	Geosporobacter ferrireducens	Geosporobacter	Clostridiaceae	Clostridiales	Clostridia	Firmicutes	Terrabacteria group	Bacteria			
1454184	6.550920738851851e-05	Alkaliphilus namsaraevii	Alkaliphilus	Clostridiaceae	Clostridiales	Clostridia	Firmicutes	Terrabacteria group	Bacteria			
390806	0.00011080945861135527	Geosporobacter subterraneus	Geosporobacter	Clostridiaceae	Clostridiales	Clostridia	Firmicutes	Terrabacteria group	Bacteria			
1731	0.00012168959291084932	Peptoclostridium acidaminophilum	Peptoclostridium	Peptostreptococcaceae	Clostridiales	Clostridia	Firmicutes	Terrabacteria group	Bacteria			
426129	4.2145863707753346e-05	Alkaliphilus peptidifermentans	Alkaliphilus	Clostridiaceae	Clostridiales	Clostridia	Firmicutes	Terrabacteria group	Bacteria			
1297617	0.0038546743101535077	Intestinimonas butyriciproducens	Intestinimonas		Clostridiales	Clostridia	Firmicutes	Terrabacteria group	Bacteria			
1898207	0.00018466786857051153	Clostridiales bacterium			Clostridiales	Clostridia	Firmicutes	Terrabacteria group	Bacteria			
351091	0.022735708009608335	Oscillibacter valericigenes	Oscillibacter	Oscillospiraceae	Clostridiales	Clostridia	Firmicutes	Terrabacteria group	Bacteria			
2093857	0.015796185928966314	Dysosmobacter welbionis	Dysosmobacter	Oscillospiraceae	Clostridiales	Clostridia	Firmicutes	Terrabacteria group	Bacteria			
2109687	0.005468653502823703	Oscillibacter sp. PEA192	Oscillibacter	Oscillospiraceae	Clostridiales	Clostridia	Firmicutes	Terrabacteria group	Bacteria			
1870988	0.001925587133360141	Pseudoflavonifractor phocaeensis	Pseudoflavonifractor	Ruminococcaceae	Clostridiales	Clostridia	Firmicutes	Terrabacteria group	Bacteria			
292800	0.000778126888581015	Flavonifractor plautii	Flavonifractor	Ruminococcaceae	Clostridiales	Clostridia	Firmicutes	Terrabacteria group	Bacteria			
2610895	0.003372434950372079	Flintibacter sp. KGMB00164	Flintibacter		Clostridiales	Clostridia	Firmicutes	Terrabacteria group	Bacteria			
47246	0.00039572755513496975	[Clostridium] viride		Ruminococcaceae	Clostridiales	Clostridia	Firmicutes	Terrabacteria group	Bacteria			
2109688	0.0011410520865350526	Clostridiales bacterium CCNA10			Clostridiales	Clostridia	Firmicutes	Terrabacteria group	Bacteria			
1263547	0.0002484846975502416	Oscillibacter ruminantium	Oscillibacter	Oscillospiraceae	Clostridiales	Clostridia	Firmicutes	Terrabacteria group	Bacteria			
1715347	0.003196429318179328	Rhabdanaerobium thermarum	Rhabdanaerobium	Eubacteriaceae	Clostridiales	Clostridia	Firmicutes	Terrabacteria group	Bacteria			
1352	0.054335843794621544	Enterococcus faecium	Enterococcus	Enterococcaceae	Lactobacillales	Bacilli	Firmicutes	Terrabacteria group	Bacteria			
1776391	0.0007976312029181653	Romboutsia timonensis	Romboutsia	Peptostreptococcaceae	Clostridiales	Clostridia	Firmicutes	Terrabacteria group	Bacteria			
1115758	2.8760664551407697e-05	Romboutsia ilealis	Romboutsia	Peptostreptococcaceae	Clostridiales	Clostridia	Firmicutes	Terrabacteria group	Bacteria			
2479767	0.003957145035818655	Blautia sp. SC05B48	Blautia	Lachnospiraceae	Clostridiales	Clostridia	Firmicutes	Terrabacteria group	Bacteria			
536633	0.0004520525928195596	Blautia glucerasea	Blautia	Lachnospiraceae	Clostridiales	Clostridia	Firmicutes	Terrabacteria group	Bacteria			
89014	0.0016633736171844733	Blautia luti	Blautia	Lachnospiraceae	Clostridiales	Clostridia	Firmicutes	Terrabacteria group	Bacteria			
40520	0.0009994860197027103	Blautia obeum	Blautia	Lachnospiraceae	Clostridiales	Clostridia	Firmicutes	Terrabacteria group	Bacteria			
39491	0.0002361531990420164	[Eubacterium] rectale		Lachnospiraceae	Clostridiales	Clostridia	Firmicutes	Terrabacteria group	Bacteria			
180164	3.828245783359548e-05	Blautia schinkii	Blautia	Lachnospiraceae	Clostridiales	Clostridia	Firmicutes	Terrabacteria group	Bacteria			
1732	0.0012070130968831756	Eubacterium oxidoreducens	Eubacterium	Eubacteriaceae	Clostridiales	Clostridia	Firmicutes	Terrabacteria group	Bacteria			
39485	0.006852418476945945	Lachnospira eligens	Lachnospira	Lachnospiraceae	Clostridiales	Clostridia	Firmicutes	Terrabacteria group	Bacteria			
45851	0.002097507798786621	Butyrivibrio crossotus	Butyrivibrio	Lachnospiraceae	Clostridiales	Clostridia	Firmicutes	Terrabacteria group	Bacteria			
154046	0.0033696438474533764	Hungatella hathewayi	Hungatella	Clostridiaceae	Clostridiales	Clostridia	Firmicutes	Terrabacteria group	Bacteria			
2109690	0.001560735987767653	Lachnospiraceae bacterium Choco86		Lachnospiraceae	Clostridiales	Clostridia	Firmicutes	Terrabacteria group	Bacteria			
418240	0.0006633744302183681	Blautia wexlerae	Blautia	Lachnospiraceae	Clostridiales	Clostridia	Firmicutes	Terrabacteria group	Bacteria			
39486	0.002638298383774023	Dorea formicigenerans	Dorea	Lachnospiraceae	Clostridiales	Clostridia	Firmicutes	Terrabacteria group	Bacteria			
433286	0.00013361892367651872	Anaerocolumna cellulosilytica	Anaerocolumna	Lachnospiraceae	Clostridiales	Clostridia	Firmicutes	Terrabacteria group	Bacteria			
404403	9.360790862740774e-05	Howardella ureilytica	Howardella		Clostridiales	Clostridia	Firmicutes	Terrabacteria group	Bacteria			
1761012	9.060973953368033e-05	Peptococcaceae bacterium DCMF		Peptococcaceae	Clostridiales	Clostridia	Firmicutes	Terrabacteria group	Bacteria			
51515	0.00020189570451946136	Dehalobacterium formicoaceticum	Dehalobacterium	Peptococcaceae	Clostridiales	Clostridia	Firmicutes	Terrabacteria group	Bacteria			
29360	6.906396637075033e-05	Cellulosilyticum lentocellum	Cellulosilyticum	Lachnospiraceae	Clostridiales	Clostridia	Firmicutes	Terrabacteria group	Bacteria			
253257	0.0008647027066615897	Lacrimispora amygdalina	Lacrimispora	Lachnospiraceae	Clostridiales	Clostridia	Firmicutes	Terrabacteria group	Bacteria			
290052	5.4955707544775913e-05	Acetivibrio ethanolgignens	Acetivibrio	Ruminococcaceae	Clostridiales	Clostridia	Firmicutes	Terrabacteria group	Bacteria			
1912855	0.0006077142201321607	Faecalimonas umbilicata	Faecalimonas	Lachnospiraceae	Clostridiales	Clostridia	Firmicutes	Terrabacteria group	Bacteria			
290055	0.001282089688425537	Faecalicatena fissicatena	Faecalicatena	Lachnospiraceae	Clostridiales	Clostridia	Firmicutes	Terrabacteria group	Bacteria			
94868	0.0004829259072642635	Lacrimispora algidixylanolytica	Lacrimispora	Lachnospiraceae	Clostridiales	Clostridia	Firmicutes	Terrabacteria group	Bacteria			
180332	0.00023671404828889335	Robinsoniella peoriensis	Robinsoniella	Lachnospiraceae	Clostridiales	Clostridia	Firmicutes	Terrabacteria group	Bacteria			
1544	0.0005236062661274697	Faecalicatena orotica	Faecalicatena	Lachnospiraceae	Clostridiales	Clostridia	Firmicutes	Terrabacteria group	Bacteria			
39482	0.001127830070385935	Faecalicatena contorta	Faecalicatena	Lachnospiraceae	Clostridiales	Clostridia	Firmicutes	Terrabacteria group	Bacteria			
649756	0.0034326696266637606	Anaerostipes hadrus	Anaerostipes	Lachnospiraceae	Clostridiales	Clostridia	Firmicutes	Terrabacteria group	Bacteria			
2109691	0.00633526693953726	Lachnospiraceae bacterium GAM79		Lachnospiraceae	Clostridiales	Clostridia	Firmicutes	Terrabacteria group	Bacteria			
1229621	0.0001162281884685893	Anaerostipes rhamnosivorans	Anaerostipes	Lachnospiraceae	Clostridiales	Clostridia	Firmicutes	Terrabacteria group	Bacteria			
106588	0.0008387310454881885	Pseudoflavonifractor capillosus	Pseudoflavonifractor	Ruminococcaceae	Clostridiales	Clostridia	Firmicutes	Terrabacteria group	Bacteria			
100176	0.00817547969707067	Papillibacter cinnamivorans	Papillibacter	Ruminococcaceae	Clostridiales	Clostridia	Firmicutes	Terrabacteria group	Bacteria			
501571	0.00039074063875792507	Butyricicoccus pullicaecorum	Butyricicoccus	Clostridiaceae	Clostridiales	Clostridia	Firmicutes	Terrabacteria group	Bacteria			
853	0.014574347650584154	Faecalibacterium prausnitzii	Faecalibacterium	Ruminococcaceae	Clostridiales	Clostridia	Firmicutes	Terrabacteria group	Bacteria			
1550024	0.0007765283632052596	Ruthenibacterium lactatiformans	Ruthenibacterium	Ruminococcaceae	Clostridiales	Clostridia	Firmicutes	Terrabacteria group	Bacteria			
745368	0.0023658935584105305	Gemmiger formicilis	Gemmiger	Ruminococcaceae	Clostridiales	Clostridia	Firmicutes	Terrabacteria group	Bacteria			
102134	8.628335991336784e-05	Desulfallas gibsoniae	Desulfallas	Peptococcaceae	Clostridiales	Clostridia	Firmicutes	Terrabacteria group	Bacteria			
214851	9.17306879962314e-05	Subdoligranulum variabile	Subdoligranulum	Ruminococcaceae	Clostridiales	Clostridia	Firmicutes	Terrabacteria group	Bacteria			
415015	0.00013808795241176676	Proteiniborus ethanoligenes	Proteiniborus		Clostridiales	Clostridia	Firmicutes	Terrabacteria group	Bacteria			
700500	8.246155432198989e-05	Catenisphaera adipataccumulans	Catenisphaera	Erysipelotrichaceae	Erysipelotrichales	Erysipelotrichia	Firmicutes	Terrabacteria group	Bacteria			
83771	0.06465655395352687	Succinivibrio dextrinosolvens	Succinivibrio	Succinivibrionaceae	Aeromonadales	Gammaproteobacteria	Proteobacteria		Bacteria			
235931	0.00010985970336736489	Alkalibacter saccharofermentans	Alkalibacter	Eubacteriaceae	Clostridiales	Clostridia	Firmicutes	Terrabacteria group	Bacteria			
1796619	0.0014308312567069131	Irregularibacter muris	Irregularibacter	Eubacteriaceae	Clostridiales	Clostridia	Firmicutes	Terrabacteria group	Bacteria			
66219	0.0003895836113668944	Lachnoclostridium phytofermentans	Lachnoclostridium	Lachnospiraceae	Clostridiales	Clostridia	Firmicutes	Terrabacteria group	Bacteria			
2086585	0.005395518946868964	Christensenella sp. Marseille-P3954	Christensenella	Christensenellaceae	Clostridiales	Clostridia	Firmicutes	Terrabacteria group	Bacteria			
74426	4.436728408665889e-05	Collinsella aerofaciens	Collinsella	Coriobacteriaceae	Coriobacteriales	Coriobacteriia	Actinobacteria	Terrabacteria group	Bacteria			
36849	0.00011534052453218624	Oxobacter pfennigii	Oxobacter	Clostridiaceae	Clostridiales	Clostridia	Firmicutes	Terrabacteria group	Bacteria			
342666	0.0009861142532224976	Gracilibacter thermotolerans	Gracilibacter	Gracilibacteraceae	Clostridiales	Clostridia	Firmicutes	Terrabacteria group	Bacteria			
655607	2.6794064324825534e-05	Tepidibacter mesophilus	Tepidibacter	Peptostreptococcaceae	Clostridiales	Clostridia	Firmicutes	Terrabacteria group	Bacteria			
2599308	0.00015790384489187812	Crassaminicella sp. SY095	Crassaminicella	Clostridiaceae	Clostridiales	Clostridia	Firmicutes	Terrabacteria group	Bacteria			
979619	0.001498318782003087	Salimesophilobacter vulgaris	Salimesophilobacter	Clostridiaceae	Clostridiales	Clostridia	Firmicutes	Terrabacteria group	Bacteria			
1008308	7.039346029210059e-05	Fusibacter tunisiensis	Fusibacter	Clostridiales Family XII. Incertae Sedis	Clostridiales	Clostridia	Firmicutes	Terrabacteria group	Bacteria			
341225	0.00012746247429414444	[Clostridium] saccharogumia	Erysipelatoclostridium	Erysipelotrichaceae	Erysipelotrichales	Erysipelotrichia	Firmicutes	Terrabacteria group	Bacteria			
1547	4.8562524826570536e-05	Erysipelatoclostridium ramosum	Erysipelatoclostridium	Erysipelotrichaceae	Erysipelotrichales	Erysipelotrichia	Firmicutes	Terrabacteria group	Bacteria			
29348	0.00011830665831892889	[Clostridium] spiroforme	Erysipelatoclostridium	Erysipelotrichaceae	Erysipelotrichales	Erysipelotrichia	Firmicutes	Terrabacteria group	Bacteria			
1712675	0.00018582945330996255	Turicibacter sp. H121	Turicibacter	Erysipelotrichaceae	Erysipelotrichales	Erysipelotrichia	Firmicutes	Terrabacteria group	Bacteria			
154288	0.00014419125202374056	Turicibacter sanguinis	Turicibacter	Erysipelotrichaceae	Erysipelotrichales	Erysipelotrichia	Firmicutes	Terrabacteria group	Bacteria			
2485784	2.899066008595427e-05	Erysipelothrix piscisicarius	Erysipelothrix	Erysipelotrichaceae	Erysipelotrichales	Erysipelotrichia	Firmicutes	Terrabacteria group	Bacteria			
225084	9.651133735418942e-05	Erysipelothrix inopinata	Erysipelothrix	Erysipelotrichaceae	Erysipelotrichales	Erysipelotrichia	Firmicutes	Terrabacteria group	Bacteria			
1796628	8.396607226999826e-05	Longibaculum muris	Longibaculum	Erysipelotrichaceae	Erysipelotrichales	Erysipelotrichia	Firmicutes	Terrabacteria group	Bacteria			
118748	0.00011059378950537636	Bulleidia extructa	Bulleidia	Erysipelotrichaceae	Erysipelotrichales	Erysipelotrichia	Firmicutes	Terrabacteria group	Bacteria			
1491	0.000583116939900234	Clostridium botulinum	Clostridium	Clostridiaceae	Clostridiales	Clostridia	Firmicutes	Terrabacteria group	Bacteria			
1735	0.0006321729049623526	Holdemanella biformis	Holdemanella	Erysipelotrichaceae	Erysipelotrichales	Erysipelotrichia	Firmicutes	Terrabacteria group	Bacteria			
76009	0.00015871658510964348	Fusibacter paucivorans	Fusibacter	Clostridiales Family XII. Incertae Sedis	Clostridiales	Clostridia	Firmicutes	Terrabacteria group	Bacteria			
84022	0.00011868648611295997	Clostridium aceticum	Clostridium	Clostridiaceae	Clostridiales	Clostridia	Firmicutes	Terrabacteria group	Bacteria			
228924	0.00010502368495952958	Guggenheimella bovis	Guggenheimella	Clostridiales Family XII. Incertae Sedis	Clostridiales	Clostridia	Firmicutes	Terrabacteria group	Bacteria			
645466	0.0003440667673221647	Anaerostipes butyraticus	Anaerostipes	Lachnospiraceae	Clostridiales	Clostridia	Firmicutes	Terrabacteria group	Bacteria			
165813	0.00025606313515776985	Sporanaerobacter acetigenes	Sporanaerobacter	Tissierellaceae	Tissierellales	Tissierellia	Firmicutes	Terrabacteria group	Bacteria			
42448	7.076466087364696e-05	Anaerobranca horikoshii	Anaerobranca	Proteinivoraceae	Clostridiales	Clostridia	Firmicutes	Terrabacteria group	Bacteria			
1543	0.0010016126662535459	Clostridium oceanicum	Clostridium	Clostridiaceae	Clostridiales	Clostridia	Firmicutes	Terrabacteria group	Bacteria			
349933	0.0001389673575748653	Clostridium hydrogeniformans	Clostridium	Clostridiaceae	Clostridiales	Clostridia	Firmicutes	Terrabacteria group	Bacteria			
84698	8.065501687860484e-05	Clostridium frigidicarnis	Clostridium	Clostridiaceae	Clostridiales	Clostridia	Firmicutes	Terrabacteria group	Bacteria			
349931	0.00019224146141817844	Clostridium cavendishii	Clostridium	Clostridiaceae	Clostridiales	Clostridia	Firmicutes	Terrabacteria group	Bacteria			
99675	0.0007639897186160001	Clostridium putrefaciens	Clostridium	Clostridiaceae	Clostridiales	Clostridia	Firmicutes	Terrabacteria group	Bacteria			
1539	0.000529846566926607	Clostridium malenominatum	Clostridium	Clostridiaceae	Clostridiales	Clostridia	Firmicutes	Terrabacteria group	Bacteria			
29357	2.735365792000551e-05	Clostridium collagenovorans	Clostridium	Clostridiaceae	Clostridiales	Clostridia	Firmicutes	Terrabacteria group	Bacteria			
305719	4.2879626004622265e-05	Prevotella baroniae	Prevotella	Prevotellaceae	Bacteroidales	Bacteroidia	Bacteroidetes	FCB group	Bacteria			
454155	7.726301638590218e-05	Paraprevotella xylaniphila	Paraprevotella	Prevotellaceae	Bacteroidales	Bacteroidia	Bacteroidetes	FCB group	Bacteria			
1472417	0.00018592576157870703	Butyricimonas paravirosa	Butyricimonas	Odoribacteraceae	Bacteroidales	Bacteroidia	Bacteroidetes	FCB group	Bacteria			
544645	0.00044110173452736954	Butyricimonas virosa	Butyricimonas	Odoribacteraceae	Bacteroidales	Bacteroidia	Bacteroidetes	FCB group	Bacteria			
2093856	9.800732454180977e-05	Butyricimonas faecalis	Butyricimonas	Odoribacteraceae	Bacteroidales	Bacteroidia	Bacteroidetes	FCB group	Bacteria			
1472416	0.00016147733023792326	Butyricimonas faecihominis	Butyricimonas	Odoribacteraceae	Bacteroidales	Bacteroidia	Bacteroidetes	FCB group	Bacteria			
487174	8.211948577506483e-05	Barnesiella intestinihominis	Barnesiella	Barnesiellaceae	Bacteroidales	Bacteroidia	Bacteroidetes	FCB group	Bacteria			
252966	0.0057379005752162815	Mahella australiensis	Mahella	Thermoanaerobacterales Family IV. Incertae Sedis	Thermoanaerobacterales	Clostridia	Firmicutes	Terrabacteria group	Bacteria			
617123	0.00018040132903553174	Lachnoanaerobaculum umeaense	Lachnoanaerobaculum	Lachnospiraceae	Clostridiales	Clostridia	Firmicutes	Terrabacteria group	Bacteria			
2490855	0.0006925623192604189	Lachnoanaerobaculum gingivalis	Lachnoanaerobaculum	Lachnospiraceae	Clostridiales	Clostridia	Firmicutes	Terrabacteria group	Bacteria			
712991	0.00387365670762234	Lachnospiraceae bacterium oral taxon 500		Lachnospiraceae	Clostridiales	Clostridia	Firmicutes	Terrabacteria group	Bacteria			
1469948	6.935051375985258e-05	Kineothrix alysoides	Kineothrix	Lachnospiraceae	Clostridiales	Clostridia	Firmicutes	Terrabacteria group	Bacteria			
2038680	0.00029311270811422616	Paludicola psychrotolerans	Paludicola	Ruminococcaceae	Clostridiales	Clostridia	Firmicutes	Terrabacteria group	Bacteria			
286803	5.5476186048840154e-05	Sporacetigenium mesophilum	Sporacetigenium	Peptostreptococcaceae	Clostridiales	Clostridia	Firmicutes	Terrabacteria group	Bacteria			
37734	9.19733458174026e-05	Enterococcus casseliflavus	Enterococcus	Enterococcaceae	Lactobacillales	Bacilli	Firmicutes	Terrabacteria group	Bacteria			
1353	0.0005813463175719246	Enterococcus gallinarum	Enterococcus	Enterococcaceae	Lactobacillales	Bacilli	Firmicutes	Terrabacteria group	Bacteria			
2060307	0.00010413267381909396	Enterococcus sp. FDAARGOS_375	Enterococcus	Enterococcaceae	Lactobacillales	Bacilli	Firmicutes	Terrabacteria group	Bacteria			
53443	5.0732339080909585e-05	Blautia hydrogenotrophica	Blautia	Lachnospiraceae	Clostridiales	Clostridia	Firmicutes	Terrabacteria group	Bacteria			
474960	0.000200310580526441	Hydrogenoanaerobacterium saccharovorans	Hydrogenoanaerobacterium	Ruminococcaceae	Clostridiales	Clostridia	Firmicutes	Terrabacteria group	Bacteria			
1870986	0.0008004000360579259	Colidextribacter massiliensis	Colidextribacter		Clostridiales	Clostridia	Firmicutes	Terrabacteria group	Bacteria			
1871035	0.0017261039095675874	Negativibacillus massiliensis	Negativibacillus	Ruminococcaceae	Clostridiales	Clostridia	Firmicutes	Terrabacteria group	Bacteria			
1796616	0.00015781387308209485	Blautia sp. YL58	Blautia	Lachnospiraceae	Clostridiales	Clostridia	Firmicutes	Terrabacteria group	Bacteria			
1548	2.878197170776249e-05	Clostridium scatologenes	Clostridium	Clostridiaceae	Clostridiales	Clostridia	Firmicutes	Terrabacteria group	Bacteria			
332101	9.705711930898357e-05	Clostridium drakei	Clostridium	Clostridiaceae	Clostridiales	Clostridia	Firmicutes	Terrabacteria group	Bacteria			
217159	3.974039400906796e-05	Clostridium carboxidivorans	Clostridium	Clostridiaceae	Clostridiales	Clostridia	Firmicutes	Terrabacteria group	Bacteria			
1519	2.525326473707607e-05	Clostridium tyrobutyricum	Clostridium	Clostridiaceae	Clostridiales	Clostridia	Firmicutes	Terrabacteria group	Bacteria			
2507159	0.001454279762656705	Clostridium sp. JN-9	Clostridium	Clostridiaceae	Clostridiales	Clostridia	Firmicutes	Terrabacteria group	Bacteria			
2068654	0.00012617770710037784	Clostridium sp. JN500901	Clostridium	Clostridiaceae	Clostridiales	Clostridia	Firmicutes	Terrabacteria group	Bacteria			
1849278	8.015668078131977e-05	Clostridium pabulibutyricum	Clostridium	Clostridiaceae	Clostridiales	Clostridia	Firmicutes	Terrabacteria group	Bacteria			
147709	4.4493619159281966e-05	Carnobacterium inhibens	Carnobacterium	Carnobacteriaceae	Lactobacillales	Bacilli	Firmicutes	Terrabacteria group	Bacteria			
760260	0.005507098976337409	Oligosphaera ethanolica	Oligosphaera	Oligosphaeraceae	Oligosphaerales	Oligosphaeria	Lentisphaerae	PVC group	Bacteria			
288966	0.00259659771908945	Lutispora thermophila	Lutispora	Clostridiaceae	Clostridiales	Clostridia	Firmicutes	Terrabacteria group	Bacteria			
253256	0.0003108282058595823	Soehngenia saccharolytica	Soehngenia	Tissierellaceae	Tissierellales	Tissierellia	Firmicutes	Terrabacteria group	Bacteria			
817	0.0065153057031615115	Bacteroides fragilis	Bacteroides	Bacteroidaceae	Bacteroidales	Bacteroidia	Bacteroidetes	FCB group	Bacteria			
29355	0.003943683712190143	Ruminiclostridium cellobioparum	Ruminiclostridium	Hungateiclostridiaceae	Clostridiales	Clostridia	Firmicutes	Terrabacteria group	Bacteria			
1499	0.0002907834451861156	Ruminiclostridium josui	Ruminiclostridium	Hungateiclostridiaceae	Clostridiales	Clostridia	Firmicutes	Terrabacteria group	Bacteria			
35830	0.0013773859684475514	Hungateiclostridium cellulolyticum	Hungateiclostridium	Hungateiclostridiaceae	Clostridiales	Clostridia	Firmicutes	Terrabacteria group	Bacteria			
1559	0.0025425135149937383	Clostridium tertium	Clostridium	Clostridiaceae	Clostridiales	Clostridia	Firmicutes	Terrabacteria group	Bacteria			
46867	0.0006365066640998211	Clostridium chauvoei	Clostridium	Clostridiaceae	Clostridiales	Clostridia	Firmicutes	Terrabacteria group	Bacteria			
84031	4.965507933736412e-05	Clostridium sartagoforme	Clostridium	Clostridiaceae	Clostridiales	Clostridia	Firmicutes	Terrabacteria group	Bacteria			
182773	0.00020616228517022665	Clostridium isatidis	Clostridium	Clostridiaceae	Clostridiales	Clostridia	Firmicutes	Terrabacteria group	Bacteria			
1414720	8.103825831065424e-05	Clostridium saudiense	Clostridium	Clostridiaceae	Clostridiales	Clostridia	Firmicutes	Terrabacteria group	Bacteria			
102148	0.00019054149397388848	Solobacterium moorei	Solobacterium	Erysipelotrichaceae	Erysipelotrichales	Erysipelotrichia	Firmicutes	Terrabacteria group	Bacteria			
1512	0.00017844672958755312	[Clostridium] symbiosum	Lachnoclostridium	Lachnospiraceae	Clostridiales	Clostridia	Firmicutes	Terrabacteria group	Bacteria			
907224	0.0008371337363846804	Peptoniphilus methioninivorax	Peptoniphilus	Peptoniphilaceae	Tissierellales	Tissierellia	Firmicutes	Terrabacteria group	Bacteria			
29345	0.002383193526824754	Sedimentibacter hydroxybenzoicus	Sedimentibacter			Tissierellia	Firmicutes	Terrabacteria group	Bacteria			
2507161	0.00014455505600841824	Tissierellia sp. JN-28	Tissierella	Tissierellaceae	Tissierellales	Tissierellia	Firmicutes	Terrabacteria group	Bacteria			
44749	0.0041787332519663085	Sporobacter termitidis	Sporobacter	Ruminococcaceae	Clostridiales	Clostridia	Firmicutes	Terrabacteria group	Bacteria			
592978	0.013739856473217887	[Ruminococcus] faecis	Mediterraneibacter	Lachnospiraceae	Clostridiales	Clostridia	Firmicutes	Terrabacteria group	Bacteria			
2173034	0.00019629504523001464	Petrocella atlantisensis	Petrocella	Vallitaleaceae	Clostridiales	Clostridia	Firmicutes	Terrabacteria group	Bacteria			
1363	0.01827520487991212	Lactococcus garvieae	Lactococcus	Streptococcaceae	Lactobacillales	Bacilli	Firmicutes	Terrabacteria group	Bacteria			
365349	3.332122373862507e-05	Pelosinus fermentans	Pelosinus	Sporomusaceae	Selenomonadales	Negativicutes	Firmicutes	Terrabacteria group	Bacteria			
380084	4.068088337257778e-05	Pelosinus propionicus	Pelosinus	Sporomusaceae	Selenomonadales	Negativicutes	Firmicutes	Terrabacteria group	Bacteria			
484770	0.00019999744037773923	Pelosinus sp. UFO1	Pelosinus	Sporomusaceae	Selenomonadales	Negativicutes	Firmicutes	Terrabacteria group	Bacteria			
54006	4.626530681027795e-05	Peptoniphilus ivorii	Peptoniphilus	Peptoniphilaceae	Tissierellales	Tissierellia	Firmicutes	Terrabacteria group	Bacteria			
1534	0.00035736437823843833	Clostridium kluyveri	Clostridium	Clostridiaceae	Clostridiales	Clostridia	Firmicutes	Terrabacteria group	Bacteria			
1852374	2.8030627330732013e-05	Ezakiella massiliensis	Ezakiella			Tissierellia	Firmicutes	Terrabacteria group	Bacteria			
33030	4.012193215868727e-05	Peptoniphilus indolicus	Peptoniphilus	Peptoniphilaceae	Tissierellales	Tissierellia	Firmicutes	Terrabacteria group	Bacteria			
1258	8.867791192452947e-05	Peptoniphilus asaccharolyticus	Peptoniphilus	Peptoniphilaceae	Tissierellales	Tissierellia	Firmicutes	Terrabacteria group	Bacteria			
40518	0.005970293340242037	Ruminococcus bromii	Ruminococcus	Ruminococcaceae	Clostridiales	Clostridia	Firmicutes	Terrabacteria group	Bacteria			
2564099	0.00803549051130462	Ruminococcus sp. JE7A12	Ruminococcus	Ruminococcaceae	Clostridiales	Clostridia	Firmicutes	Terrabacteria group	Bacteria			
871665	0.00016344593825645925	Blautia faecis	Blautia	Lachnospiraceae	Clostridiales	Clostridia	Firmicutes	Terrabacteria group	Bacteria			
208226	0.0001594734586327892	Alkaliphilus metalliredigens	Alkaliphilus	Clostridiaceae	Clostridiales	Clostridia	Firmicutes	Terrabacteria group	Bacteria			
1720200	0.0032590634841141047	Anaerotruncus rubiinfantis	Anaerotruncus	Ruminococcaceae	Clostridiales	Clostridia	Firmicutes	Terrabacteria group	Bacteria			
258515	0.00035919277227152964	Acetanaerobacterium elongatum	Acetanaerobacterium	Ruminococcaceae	Clostridiales	Clostridia	Firmicutes	Terrabacteria group	Bacteria			
39493	0.002040205102745148	Clostridium tarantellae	Clostridium	Clostridiaceae	Clostridiales	Clostridia	Firmicutes	Terrabacteria group	Bacteria			
1267	4.733844657536989e-05	Clostridium ventriculi	Clostridium	Clostridiaceae	Clostridiales	Clostridia	Firmicutes	Terrabacteria group	Bacteria			
40575	0.000671579515198729	Clostridium grantii	Clostridium	Clostridiaceae	Clostridiales	Clostridia	Firmicutes	Terrabacteria group	Bacteria			
1281486	0.00024775107414969517	Lactococcus formosensis	Lactococcus	Streptococcaceae	Lactobacillales	Bacilli	Firmicutes	Terrabacteria group	Bacteria			
433287	7.479143885024092e-05	Anaerotignum aminivorans	Anaerotignum	Lachnospiraceae	Clostridiales	Clostridia	Firmicutes	Terrabacteria group	Bacteria			
33043	0.00198494486872005	Coprococcus eutactus	Coprococcus	Lachnospiraceae	Clostridiales	Clostridia	Firmicutes	Terrabacteria group	Bacteria			
706562	0.0016400135511082507	Lactobacillus rogosae	Lactobacillus	Lactobacillaceae	Lactobacillales	Bacilli	Firmicutes	Terrabacteria group	Bacteria			
410072	0.002762001809815884	Coprococcus comes	Coprococcus	Lachnospiraceae	Clostridiales	Clostridia	Firmicutes	Terrabacteria group	Bacteria			
438033	4.269338199982012e-05	Ruminococcus gauvreauii	Ruminococcus	Ruminococcaceae	Clostridiales	Clostridia	Firmicutes	Terrabacteria group	Bacteria			
88431	0.0015343275979300664	Dorea longicatena	Dorea	Lachnospiraceae	Clostridiales	Clostridia	Firmicutes	Terrabacteria group	Bacteria			
1337051	4.1211230413688714e-05	Murimonas intestini	Murimonas	Lachnospiraceae	Clostridiales	Clostridia	Firmicutes	Terrabacteria group	Bacteria			
39490	8.743934521180863e-05	Eubacterium ramulus	Eubacterium	Eubacteriaceae	Clostridiales	Clostridia	Firmicutes	Terrabacteria group	Bacteria			
1917870	0.0003363907613895011	Lachnoclostridium pacaense	Lachnoclostridium	Lachnospiraceae	Clostridiales	Clostridia	Firmicutes	Terrabacteria group	Bacteria			
1400053	0.004026388184332818	Bacteroidales bacterium CF			Bacteroidales	Bacteroidia	Bacteroidetes	FCB group	Bacteria			
28117	2.423865012600733e-05	Alistipes putredinis	Alistipes	Rikenellaceae	Bacteroidales	Bacteroidia	Bacteroidetes	FCB group	Bacteria			
214856	2.9283099182925613e-05	Alistipes finegoldii	Alistipes	Rikenellaceae	Bacteroidales	Bacteroidia	Bacteroidetes	FCB group	Bacteria			
1871003	7.404080292867921e-05	Tidjanibacter massiliensis	Tidjanibacter	Rikenellaceae	Bacteroidales	Bacteroidia	Bacteroidetes	FCB group	Bacteria			
472113	0.00022407881904718766	Geofilum rubicundum	Geofilum	Marinilabiliaceae	Marinilabiliales	Bacteroidia	Bacteroidetes	FCB group	Bacteria			
889453	0.0003835809187034502	Alkalitalea saponilacus	Alkalitalea	Marinilabiliaceae	Marinilabiliales	Bacteroidia	Bacteroidetes	FCB group	Bacteria			
682526	0.00021639026325081346	Natronoflexus pectinivorans	Natronoflexus	Marinilabiliaceae	Marinilabiliales	Bacteroidia	Bacteroidetes	FCB group	Bacteria			
1965019	7.311753100152671e-05	Geofilum rhodophaeum	Geofilum	Marinilabiliaceae	Marinilabiliales	Bacteroidia	Bacteroidetes	FCB group	Bacteria			
544644	5.6899954926696946e-05	Butyricimonas synergistica	Butyricimonas	Odoribacteraceae	Bacteroidales	Bacteroidia	Bacteroidetes	FCB group	Bacteria			
562	0.008305538663545046	Escherichia coli	Escherichia	Enterobacteriaceae	Enterobacterales	Gammaproteobacteria	Proteobacteria		Bacteria			
290054	0.0019858554213383586	Eubacterium coprostanoligenes	Eubacterium	Eubacteriaceae	Clostridiales	Clostridia	Firmicutes	Terrabacteria group	Bacteria			
1776382	0.0016513330321578572	Neglecta timonensis	Neglecta	Ruminococcaceae	Clostridiales	Clostridia	Firmicutes	Terrabacteria group	Bacteria			
1958780	0.00018829112427666488	Clostridium merdae	Clostridium	Clostridiaceae	Clostridiales	Clostridia	Firmicutes	Terrabacteria group	Bacteria			
396504	4.447244145705039e-05	Ruminiclostridium sufflavum	Ruminiclostridium	Hungateiclostridiaceae	Clostridiales	Clostridia	Firmicutes	Terrabacteria group	Bacteria			
755731	0.00019729324349635713	Clostridium sp. BNL1100	Clostridium	Clostridiaceae	Clostridiales	Clostridia	Firmicutes	Terrabacteria group	Bacteria			
1521	0.0014390132911373235	Ruminiclostridium cellulolyticum	Ruminiclostridium	Hungateiclostridiaceae	Clostridiales	Clostridia	Firmicutes	Terrabacteria group	Bacteria			
35825	0.00016381894488489394	Pseudobacteroides cellulosolvens	Pseudobacteroides	Hungateiclostridiaceae	Clostridiales	Clostridia	Firmicutes	Terrabacteria group	Bacteria			
52786	8.481230251588638e-05	Anaerofilum agile	Anaerofilum	Ruminococcaceae	Clostridiales	Clostridia	Firmicutes	Terrabacteria group	Bacteria			
171121	0.00011441941487312288	Sulfurihydrogenibium subterraneum	Sulfurihydrogenibium	Hydrogenothermaceae	Aquificales	Aquificae	Aquificae		Bacteria			
1354	0.0001868138338985646	Enterococcus hirae	Enterococcus	Enterococcaceae	Lactobacillales	Bacilli	Firmicutes	Terrabacteria group	Bacteria			
172901	0.0017823110921783895	Victivallis vadensis	Victivallis	Victivallaceae	Victivallales	Lentisphaeria	Lentisphaerae	PVC group	Bacteria			
1288121	0.00030479762136474193	Alistipes senegalensis	Alistipes	Rikenellaceae	Bacteroidales	Bacteroidia	Bacteroidetes	FCB group	Bacteria			
2364787	5.834634464799808e-05	Alistipes megaguti	Alistipes	Rikenellaceae	Bacteroidales	Bacteroidia	Bacteroidetes	FCB group	Bacteria			
328814	0.00030579365686781926	Alistipes shahii	Alistipes	Rikenellaceae	Bacteroidales	Bacteroidia	Bacteroidetes	FCB group	Bacteria			
328813	0.00010671595260674237	Alistipes onderdonkii	Alistipes	Rikenellaceae	Bacteroidales	Bacteroidia	Bacteroidetes	FCB group	Bacteria			
166486	0.0005087012055749602	Roseburia intestinalis	Roseburia	Lachnospiraceae	Clostridiales	Clostridia	Firmicutes	Terrabacteria group	Bacteria			
360807	0.0007723748203828397	Roseburia inulinivorans	Roseburia	Lachnospiraceae	Clostridiales	Clostridia	Firmicutes	Terrabacteria group	Bacteria			
1628085	0.0005777016248572831	Agathobaculum butyriciproducens	Agathobaculum	Ruminococcaceae	Clostridiales	Clostridia	Firmicutes	Terrabacteria group	Bacteria			
1712515	0.0014965362721201193	Butyricicoccus faecihominis	Butyricicoccus	Clostridiaceae	Clostridiales	Clostridia	Firmicutes	Terrabacteria group	Bacteria			
546367	0.002143698964640182	Hafnia paralvei	Hafnia	Hafniaceae	Enterobacterales	Gammaproteobacteria	Proteobacteria		Bacteria			
622	6.465324793641439e-05	Shigella dysenteriae	Shigella	Enterobacteriaceae	Enterobacterales	Gammaproteobacteria	Proteobacteria		Bacteria			
114528	6.384731156062939e-05	Mogibacterium neglectum	Mogibacterium	Clostridiales Family XIII. Incertae Sedis	Clostridiales	Clostridia	Firmicutes	Terrabacteria group	Bacteria			
114527	0.0008303174240356182	Mogibacterium diversum	Mogibacterium	Clostridiales Family XIII. Incertae Sedis	Clostridiales	Clostridia	Firmicutes	Terrabacteria group	Bacteria			
1482736	8.543127108578593e-05	Acetoanaerobium pronyense	Acetoanaerobium	Peptostreptococcaceae	Clostridiales	Clostridia	Firmicutes	Terrabacteria group	Bacteria			
1496	4.083160828253214e-05	Clostridioides difficile	Clostridioides	Peptostreptococcaceae	Clostridiales	Clostridia	Firmicutes	Terrabacteria group	Bacteria			
1502	0.0005017404670656545	Clostridium perfringens	Clostridium	Clostridiaceae	Clostridiales	Clostridia	Firmicutes	Terrabacteria group	Bacteria			
1482730	5.6640935681033284e-05	Alkaliphilus hydrothermalis	Alkaliphilus	Clostridiaceae	Clostridiales	Clostridia	Firmicutes	Terrabacteria group	Bacteria			
253239	0.0004676009322999988	Ethanoligenens harbinense	Ethanoligenens	Ruminococcaceae	Clostridiales	Clostridia	Firmicutes	Terrabacteria group	Bacteria			
1337094	3.7917996545730915e-05	Ercella succinigenes	Ercella	Hungateiclostridiaceae	Clostridiales	Clostridia	Firmicutes	Terrabacteria group	Bacteria			
884684	0.0014563416948875298	Mageeibacillus indolicus	Mageeibacillus	Hungateiclostridiaceae	Clostridiales	Clostridia	Firmicutes	Terrabacteria group	Bacteria			
52787	6.812321997098472e-05	Anaerofilum pentosovorans	Anaerofilum	Ruminococcaceae	Clostridiales	Clostridia	Firmicutes	Terrabacteria group	Bacteria			
1535	0.0002445412089879747	[Clostridium] leptum		Ruminococcaceae	Clostridiales	Clostridia	Firmicutes	Terrabacteria group	Bacteria			
1871025	0.0002320560226185462	Ndongobacter massiliensis	Ndongobacter				Firmicutes	Terrabacteria group	Bacteria			
43143	5.241503476926124e-05	Tissierella creatinini	Tissierella	Tissierellaceae	Tissierellales	Tissierellia	Firmicutes	Terrabacteria group	Bacteria			
46507	3.0472406765610143e-05	Ezakiella coagulans	Ezakiella			Tissierellia	Firmicutes	Terrabacteria group	Bacteria			
35517	3.0487016072506717e-05	[Eubacterium] brachy		Clostridiales Family XIII. Incertae Sedis	Clostridiales	Clostridia	Firmicutes	Terrabacteria group	Bacteria			
214853	0.00020753082628595208	Anaerofustis stercorihominis	Anaerofustis	Eubacteriaceae	Clostridiales	Clostridia	Firmicutes	Terrabacteria group	Bacteria			
913099	0.0007857603813993148	Sedimentibacter acidaminivorans	Sedimentibacter			Tissierellia	Firmicutes	Terrabacteria group	Bacteria			
28064	0.00019866901776342084	Heliobacillus mobilis	Heliobacillus	Heliobacteriaceae	Clostridiales	Clostridia	Firmicutes	Terrabacteria group	Bacteria			
39492	0.001124263872340181	[Eubacterium] siraeum		Ruminococcaceae	Clostridiales	Clostridia	Firmicutes	Terrabacteria group	Bacteria			
1673717	0.0035876683725740996	Anaeromassilibacillus senegalensis	Anaeromassilibacillus	Ruminococcaceae	Clostridiales	Clostridia	Firmicutes	Terrabacteria group	Bacteria			
35623	0.00015584484990999143	Acholeplasma oculi	Acholeplasma	Acholeplasmataceae	Acholeplasmatales	Mollicutes	Tenericutes	Terrabacteria group	Bacteria			
314200	4.2276732685287766e-05	Giesbergeria voronezhensis	Giesbergeria	Comamonadaceae	Burkholderiales	Betaproteobacteria	Proteobacteria		Bacteria			
363844	3.5181937228490143e-05	Variovorax ginsengisoli	Variovorax	Comamonadaceae	Burkholderiales	Betaproteobacteria	Proteobacteria		Bacteria			
37448	0.00023932244130578278	Polaromonas vacuolata	Polaromonas	Comamonadaceae	Burkholderiales	Betaproteobacteria	Proteobacteria		Bacteria			
2104	0.00011515708024728397	Mycoplasma pneumoniae	Mycoplasma	Mycoplasmataceae	Mycoplasmatales	Mollicutes	Tenericutes	Terrabacteria group	Bacteria			
1852381	0.00011646280466127125	Duodenibacillus massiliensis	Duodenibacillus	Sutterellaceae	Burkholderiales	Betaproteobacteria	Proteobacteria		Bacteria			
416213	0.00011135473143800842	Ferrovum myxofaciens	Ferrovum	Ferrovaceae	Ferrovales	Betaproteobacteria	Proteobacteria		Bacteria			
1297424	0.00013782635557928497	Anaerobacterium chartisolvens	Anaerobacterium	Hungateiclostridiaceae	Clostridiales	Clostridia	Firmicutes	Terrabacteria group	Bacteria			
2164149	0.0003652184848305005	Tepidibaculum saccharolyticum	Tepidibaculum	Ruminococcaceae	Clostridiales	Clostridia	Firmicutes	Terrabacteria group	Bacteria			
1841867	0.0010487774858133068	Phocea massiliensis	Phocea	Ruminococcaceae	Clostridiales	Clostridia	Firmicutes	Terrabacteria group	Bacteria			
84026	0.0001362386424090073	[Clostridium] methylpentosum		Ruminococcaceae	Clostridiales	Clostridia	Firmicutes	Terrabacteria group	Bacteria			
37482	0.002131801834811394	Laceyella sacchari	Laceyella	Thermoactinomycetaceae	Bacillales	Bacilli	Firmicutes	Terrabacteria group	Bacteria			
682400	0.00019428908633410607	Natranaerovirga pectinivora	Natranaerovirga		Clostridiales	Clostridia	Firmicutes	Terrabacteria group	Bacteria			
116085	0.0012450085713219677	Coprococcus catus	Coprococcus	Lachnospiraceae	Clostridiales	Clostridia	Firmicutes	Terrabacteria group	Bacteria			
369958	5.297975214005968e-05	Desulfotomaculum defluvii	Desulfotomaculum	Peptococcaceae	Clostridiales	Clostridia	Firmicutes	Terrabacteria group	Bacteria			
206393	0.00010619214899759126	Pelotomaculum terephthalicicum	Pelotomaculum	Peptococcaceae	Clostridiales	Clostridia	Firmicutes	Terrabacteria group	Bacteria			
348442	0.00035507406362747084	Georgenia ruanii	Georgenia	Bogoriellaceae	Micrococcales	Actinobacteria	Actinobacteria	Terrabacteria group	Bacteria			
152794	8.930609723985284e-05	Corynebacterium efficiens	Corynebacterium	Corynebacteriaceae	Corynebacteriales	Actinobacteria	Actinobacteria	Terrabacteria group	Bacteria			
2025493	0.00021443272074799194	Blautia hominis	Blautia	Lachnospiraceae	Clostridiales	Clostridia	Firmicutes	Terrabacteria group	Bacteria			
33035	0.0004017995260157898	Blautia producta	Blautia	Lachnospiraceae	Clostridiales	Clostridia	Firmicutes	Terrabacteria group	Bacteria			
1871029	0.00012478572932424778	Intestinibacillus massiliensis	Intestinibacillus	Eubacteriaceae	Clostridiales	Clostridia	Firmicutes	Terrabacteria group	Bacteria			
40519	0.00021955038682422057	Ruminococcus callidus	Ruminococcus	Ruminococcaceae	Clostridiales	Clostridia	Firmicutes	Terrabacteria group	Bacteria			
1161942	0.000472540111817232	Ruminococcus champanellensis	Ruminococcus	Ruminococcaceae	Clostridiales	Clostridia	Firmicutes	Terrabacteria group	Bacteria			
143361	0.00044870322322367983	Filifactor alocis	Filifactor	Peptostreptococcaceae	Clostridiales	Clostridia	Firmicutes	Terrabacteria group	Bacteria			
1160721	0.0005527423293541571	Ruminococcus bicirculans	Ruminococcus	Ruminococcaceae	Clostridiales	Clostridia	Firmicutes	Terrabacteria group	Bacteria			
81409	2.3447529396369245e-05	Eubacterium aggregans	Eubacterium	Eubacteriaceae	Clostridiales	Clostridia	Firmicutes	Terrabacteria group	Bacteria			
231053	8.283262428376293e-05	Saccharibacter floricola	Saccharibacter	Acetobacteraceae	Rhodospirillales	Alphaproteobacteria	Proteobacteria		Bacteria			
28901	0.0003363156332467396	Salmonella enterica	Salmonella	Enterobacteriaceae	Enterobacterales	Gammaproteobacteria	Proteobacteria		Bacteria			
61648	4.3084387780341905e-05	Kluyvera intermedia	Kluyvera	Enterobacteriaceae	Enterobacterales	Gammaproteobacteria	Proteobacteria		Bacteria			
580	0.00038840811107418406	Kluyvera cryocrescens	Kluyvera	Enterobacteriaceae	Enterobacterales	Gammaproteobacteria	Proteobacteria		Bacteria			
301302	0.00024372591683766365	Roseburia faecis	Roseburia	Lachnospiraceae	Clostridiales	Clostridia	Firmicutes	Terrabacteria group	Bacteria			
342942	0.0003101435148671713	Mediterraneibacter glycyrrhizinilyticus	Mediterraneibacter	Lachnospiraceae	Clostridiales	Clostridia	Firmicutes	Terrabacteria group	Bacteria			
397865	0.00010085566456449628	Barnesiella viscericola	Barnesiella	Barnesiellaceae	Bacteroidales	Bacteroidia	Bacteroidetes	FCB group	Bacteria			
1871023	0.00011913535893782033	Millionella massiliensis	Millionella	Rikenellaceae	Bacteroidales	Bacteroidia	Bacteroidetes	FCB group	Bacteria			
1686296	6.387757040664984e-05	Gabonia massiliensis	Gabonia	Porphyromonadaceae	Bacteroidales	Bacteroidia	Bacteroidetes	FCB group	Bacteria			
1099853	4.348245290140059e-05	Coprobacter fastidiosus	Coprobacter	Barnesiellaceae	Bacteroidales	Bacteroidia	Bacteroidetes	FCB group	Bacteria			
1166478	7.56446550050558e-05	Carboxylicivirga mesophila	Carboxylicivirga	Marinilabiliaceae	Marinilabiliales	Bacteroidia	Bacteroidetes	FCB group	Bacteria			
1912897	6.606566693170631e-05	Blautia sp. N6H1-15	Blautia	Lachnospiraceae	Clostridiales	Clostridia	Firmicutes	Terrabacteria group	Bacteria			
1322	2.672560351963675e-05	Blautia hansenii	Blautia	Lachnospiraceae	Clostridiales	Clostridia	Firmicutes	Terrabacteria group	Bacteria			
1323230	5.606084997010359e-05	Aerococcus vaginalis	Aerococcus	Aerococcaceae	Lactobacillales	Bacilli	Firmicutes	Terrabacteria group	Bacteria			
1849041	0.00011378221100215626	Harryflintia acetispora	Harryflintia	Ruminococcaceae	Clostridiales	Clostridia	Firmicutes	Terrabacteria group	Bacteria			
33039	7.023662941203765e-05	[Ruminococcus] torques	Mediterraneibacter	Lachnospiraceae	Clostridiales	Clostridia	Firmicutes	Terrabacteria group	Bacteria			
2086584	3.569884808200297e-05	Massilistercora timonensis	Massilistercora		Clostridiales	Clostridia	Firmicutes	Terrabacteria group	Bacteria			
53345	4.027328641641824e-05	Enterococcus durans	Enterococcus	Enterococcaceae	Lactobacillales	Bacilli	Firmicutes	Terrabacteria group	Bacteria			
81424	3.072342315217594e-05	[Clostridium] methoxybenzovorans	Lachnoclostridium	Lachnospiraceae	Clostridiales	Clostridia	Firmicutes	Terrabacteria group	Bacteria			
2081703	3.8375115465143934e-05	Peptostreptococcaceae bacterium oral taxon 929		Peptostreptococcaceae	Clostridiales	Clostridia	Firmicutes	Terrabacteria group	Bacteria			
2212991	0.00011165307358503018	Clostridium sp. AWRP	Clostridium	Clostridiaceae	Clostridiales	Clostridia	Firmicutes	Terrabacteria group	Bacteria			
84023	0.0002832936886632454	Clostridium autoethanogenum	Clostridium	Clostridiaceae	Clostridiales	Clostridia	Firmicutes	Terrabacteria group	Bacteria			
1538	0.00016609924173627394	Clostridium ljungdahlii	Clostridium	Clostridiaceae	Clostridiales	Clostridia	Firmicutes	Terrabacteria group	Bacteria			
1472040	8.336302057218441e-05	Clostridium algifaecis	Clostridium	Clostridiaceae	Clostridiales	Clostridia	Firmicutes	Terrabacteria group	Bacteria			
1504	0.0006931077456181504	Clostridium septicum	Clostridium	Clostridiaceae	Clostridiales	Clostridia	Firmicutes	Terrabacteria group	Bacteria			
623	0.0001762200775802016	Shigella flexneri	Shigella	Enterobacteriaceae	Enterobacterales	Gammaproteobacteria	Proteobacteria		Bacteria			
2094242	0.0034243682369608053	Victivallales bacterium CCUG 44730			Victivallales	Lentisphaeria	Lentisphaerae	PVC group	Bacteria			
571	0.00034676410531398166	Klebsiella oxytoca	Klebsiella	Enterobacteriaceae	Enterobacterales	Gammaproteobacteria	Proteobacteria		Bacteria			
1905288	7.66730604454675e-05	Klebsiella sp. LTGPAF-6F	Klebsiella	Enterobacteriaceae	Enterobacterales	Gammaproteobacteria	Proteobacteria		Bacteria			
1134687	0.00017116944771457907	Klebsiella michiganensis	Klebsiella	Enterobacteriaceae	Enterobacterales	Gammaproteobacteria	Proteobacteria		Bacteria			
2488567	3.603285523493442e-05	Klebsiella sp. FDAARGOS_511	Klebsiella	Enterobacteriaceae	Enterobacterales	Gammaproteobacteria	Proteobacteria		Bacteria			
1542	3.823353641676e-05	Clostridium novyi	Clostridium	Clostridiaceae	Clostridiales	Clostridia	Firmicutes	Terrabacteria group	Bacteria			
29373	2.937540533768439e-05	Clostridium thermopalmarium	Clostridium	Clostridiaceae	Clostridiales	Clostridia	Firmicutes	Terrabacteria group	Bacteria			
79599	4.1718783531243247e-05	Heliorestis daurensis	Heliorestis	Heliobacteriaceae	Clostridiales	Clostridia	Firmicutes	Terrabacteria group	Bacteria			
121726	0.00015661454802249426	Heliorestis baculata	Heliorestis	Heliobacteriaceae	Clostridiales	Clostridia	Firmicutes	Terrabacteria group	Bacteria			
31971	4.835396717073625e-05	Amedibacillus dolichus	Amedibacillus	Erysipelotrichaceae	Erysipelotrichales	Erysipelotrichia	Firmicutes	Terrabacteria group	Bacteria			
99656	0.00013735420526476183	[Clostridium] fimetarium	Lachnoclostridium	Lachnospiraceae	Clostridiales	Clostridia	Firmicutes	Terrabacteria group	Bacteria			
39496	0.003770596362333334	Eubacterium ventriosum	Eubacterium	Eubacteriaceae	Clostridiales	Clostridia	Firmicutes	Terrabacteria group	Bacteria			
1515	0.00018207496092295322	Hungateiclostridium thermocellum	Hungateiclostridium	Hungateiclostridiaceae	Clostridiales	Clostridia	Firmicutes	Terrabacteria group	Bacteria			
33945	0.000332763086897139	Enterococcus avium	Enterococcus	Enterococcaceae	Lactobacillales	Bacilli	Firmicutes	Terrabacteria group	Bacteria			
160453	8.038837909072916e-05	Enterococcus gilvus	Enterococcus	Enterococcaceae	Lactobacillales	Bacilli	Firmicutes	Terrabacteria group	Bacteria			
44007	7.93782423128045e-05	Enterococcus pseudoavium	Enterococcus	Enterococcaceae	Lactobacillales	Bacilli	Firmicutes	Terrabacteria group	Bacteria			
417368	2.993903349942544e-05	Enterococcus thailandicus	Enterococcus	Enterococcaceae	Lactobacillales	Bacilli	Firmicutes	Terrabacteria group	Bacteria			
143393	3.201908583009526e-05	[Eubacterium] sulci		Clostridiales Family XIII. Incertae Sedis	Clostridiales	Clostridia	Firmicutes	Terrabacteria group	Bacteria			
642589	0.0009701466221216617	Caproiciproducens galactitolivorans	Caproiciproducens	Ruminococcaceae	Clostridiales	Clostridia	Firmicutes	Terrabacteria group	Bacteria			
2507162	0.0011051091812410904	Caproiciproducens sp. NJN-50	Caproiciproducens	Ruminococcaceae	Clostridiales	Clostridia	Firmicutes	Terrabacteria group	Bacteria			
1572656	0.00013074722915952275	Ruminococcaceae bacterium CPB6		Ruminococcaceae	Clostridiales	Clostridia	Firmicutes	Terrabacteria group	Bacteria			
12917	4.292158113643719e-05	Acidovorax facilis	Acidovorax	Comamonadaceae	Burkholderiales	Betaproteobacteria	Proteobacteria		Bacteria			
2268087	5.270300889337104e-05	Polaromonas sp. SP1	Polaromonas	Comamonadaceae	Burkholderiales	Betaproteobacteria	Proteobacteria		Bacteria			
66896	3.2010735605767475e-05	Streptacidiphilus griseoplanus	Streptomyces	Streptomycetaceae	Streptomycetales	Actinobacteria	Actinobacteria	Terrabacteria group	Bacteria			
174709	4.696417426796609e-05	Allobaculum stercoricanis	Allobaculum	Erysipelotrichaceae	Erysipelotrichales	Erysipelotrichia	Firmicutes	Terrabacteria group	Bacteria			
1488	0.00020397791721329285	Clostridium acetobutylicum	Clostridium	Clostridiaceae	Clostridiales	Clostridia	Firmicutes	Terrabacteria group	Bacteria			
823	0.00014738815698717877	Parabacteroides distasonis	Parabacteroides	Tannerellaceae	Bacteroidales	Bacteroidia	Bacteroidetes	FCB group	Bacteria			
1433126	3.187194219584981e-05	Mucinivorans hirudinis	Mucinivorans	Rikenellaceae	Bacteroidales	Bacteroidia	Bacteroidetes	FCB group	Bacteria			
2018667	4.724884320773696e-05	Marinisporobacter balticus	Marinisporobacter	Clostridiaceae	Clostridiales	Clostridia	Firmicutes	Terrabacteria group	Bacteria			
1648	2.6644110191489902e-05	Erysipelothrix rhusiopathiae	Erysipelothrix	Erysipelotrichaceae	Erysipelotrichales	Erysipelotrichia	Firmicutes	Terrabacteria group	Bacteria			
1351	0.0018368716352783823	Enterococcus faecalis	Enterococcus	Enterococcaceae	Lactobacillales	Bacilli	Firmicutes	Terrabacteria group	Bacteria			
1541	6.942000455244148e-05	Terrisporobacter mayombei	Terrisporobacter	Peptostreptococcaceae	Clostridiales	Clostridia	Firmicutes	Terrabacteria group	Bacteria			
460384	0.00010633462073990422	Enterocloster lavalensis	Enterocloster	Lachnospiraceae	Clostridiales	Clostridia	Firmicutes	Terrabacteria group	Bacteria			
626932	0.0002069542018336264	Alistipes indistinctus	Alistipes	Rikenellaceae	Bacteroidales	Bacteroidia	Bacteroidetes	FCB group	Bacteria			
28116	3.0119823929786124e-05	Bacteroides ovatus	Bacteroides	Bacteroidaceae	Bacteroidales	Bacteroidia	Bacteroidetes	FCB group	Bacteria			
699281	9.820169458695694e-05	Caldicoprobacter algeriensis	Caldicoprobacter	Caldicoprobacteraceae	Clostridiales	Clostridia	Firmicutes	Terrabacteria group	Bacteria			
1513	0.00014010957853282725	Clostridium tetani	Clostridium	Clostridiaceae	Clostridiales	Clostridia	Firmicutes	Terrabacteria group	Bacteria			
847	0.00028256635447956207	Oxalobacter formigenes	Oxalobacter	Oxalobacteraceae	Burkholderiales	Betaproteobacteria	Proteobacteria		Bacteria			
461876	8.818562758530197e-05	Alkaliphilus oremlandii	Alkaliphilus	Clostridiaceae	Clostridiales	Clostridia	Firmicutes	Terrabacteria group	Bacteria			
29374	0.00016021127032297345	Filifactor villosus	Filifactor	Peptostreptococcaceae	Clostridiales	Clostridia	Firmicutes	Terrabacteria group	Bacteria			
1303	0.00018007794411003535	Streptococcus oralis	Streptococcus	Streptococcaceae	Lactobacillales	Bacilli	Firmicutes	Terrabacteria group	Bacteria			
28037	0.00014092507877016357	Streptococcus mitis	Streptococcus	Streptococcaceae	Lactobacillales	Bacilli	Firmicutes	Terrabacteria group	Bacteria			
1311	4.9060527833119194e-05	Streptococcus agalactiae	Streptococcus	Streptococcaceae	Lactobacillales	Bacilli	Firmicutes	Terrabacteria group	Bacteria			
1462919	2.9250736597408024e-05	Mobilitalea sibirica	Mobilitalea	Lachnospiraceae	Clostridiales	Clostridia	Firmicutes	Terrabacteria group	Bacteria			
796942	2.6057068294735957e-05	Stomatobaculum longum	Stomatobaculum	Lachnospiraceae	Clostridiales	Clostridia	Firmicutes	Terrabacteria group	Bacteria			
57706	0.0003194533656397647	Citrobacter braakii	Citrobacter	Enterobacteriaceae	Enterobacterales	Gammaproteobacteria	Proteobacteria		Bacteria			Citrobacter freundii complex
2077147	3.342425946253978e-05	Citrobacter freundii complex sp. CFNIH3	Citrobacter	Enterobacteriaceae	Enterobacterales	Gammaproteobacteria	Proteobacteria		Bacteria			Citrobacter freundii complex
546	0.0010168011930463776	Citrobacter freundii	Citrobacter	Enterobacteriaceae	Enterobacterales	Gammaproteobacteria	Proteobacteria		Bacteria			Citrobacter freundii complex
133448	0.00015740759848954973	Citrobacter youngae	Citrobacter	Enterobacteriaceae	Enterobacterales	Gammaproteobacteria	Proteobacteria		Bacteria			Citrobacter freundii complex
1639133	0.0004982394558784393	Citrobacter portucalensis	Citrobacter	Enterobacteriaceae	Enterobacterales	Gammaproteobacteria	Proteobacteria		Bacteria			Citrobacter freundii complex
67827	3.3314703696033844e-05	Citrobacter werkmanii	Citrobacter	Enterobacteriaceae	Enterobacterales	Gammaproteobacteria	Proteobacteria		Bacteria			Citrobacter freundii complex
2576307	0.00025597723269918447	Caloramator sp. E03	Caloramator	Clostridiaceae	Clostridiales	Clostridia	Firmicutes	Terrabacteria group	Bacteria			
1082276	0.00027265576396323904	Hydrogenispora ethanolica	Hydrogenispora				Firmicutes	Terrabacteria group	Bacteria			
1150298	0.0009462332486618075	Fusicatenibacter saccharivorans	Fusicatenibacter	Lachnospiraceae	Clostridiales	Clostridia	Firmicutes	Terrabacteria group	Bacteria			
1358	0.0017556494745777959	Lactococcus lactis	Lactococcus	Streptococcaceae	Lactobacillales	Bacilli	Firmicutes	Terrabacteria group	Bacteria			
1981510	0.0006069007782604403	Monoglobus pectinilyticus	Monoglobus		Clostridiales	Clostridia	Firmicutes	Terrabacteria group	Bacteria			
42322	2.8438834370889062e-05	Eubacterium ruminantium	Eubacterium	Eubacteriaceae	Clostridiales	Clostridia	Firmicutes	Terrabacteria group	Bacteria			
185007	4.5937743593062434e-05	Pseudobutyrivibrio xylanivorans	Pseudobutyrivibrio	Lachnospiraceae	Clostridiales	Clostridia	Firmicutes	Terrabacteria group	Bacteria			
29346	3.43951892230218e-05	[Clostridium] paradoxum		Peptostreptococcaceae	Clostridiales	Clostridia	Firmicutes	Terrabacteria group	Bacteria			
626940	0.0014455707867303295	Phascolarctobacterium succinatutens	Phascolarctobacterium	Acidaminococcaceae	Acidaminococcales	Negativicutes	Firmicutes	Terrabacteria group	Bacteria			
1796620	0.0001692047136166857	Acutalibacter muris	Acutalibacter	Ruminococcaceae	Clostridiales	Clostridia	Firmicutes	Terrabacteria group	Bacteria			
1834198	3.7024649906265296e-05	Hungateiclostridiaceae bacterium KB18		Hungateiclostridiaceae	Clostridiales	Clostridia	Firmicutes	Terrabacteria group	Bacteria			
351345	9.762655859032616e-05	Polynucleobacter cosmopolitanus	Polynucleobacter	Burkholderiaceae	Burkholderiales	Betaproteobacteria	Proteobacteria		Bacteria			
1509244	0.0002045656321462258	Candidatus Nucleicultrix amoebiphila	Candidatus Nucleicultrix	Caedimonadaceae	Holosporales	Alphaproteobacteria	Proteobacteria		Bacteria			
576610	0.0005015824626430819	Polynucleobacter necessarius	Polynucleobacter	Burkholderiaceae	Burkholderiales	Betaproteobacteria	Proteobacteria		Bacteria			
1835254	4.54030189775928e-05	Polynucleobacter duraquae	Polynucleobacter	Burkholderiaceae	Burkholderiales	Betaproteobacteria	Proteobacteria		Bacteria			
179995	0.00012161333477759326	Anaerobiospirillum thomasii	Anaerobiospirillum	Succinivibrionaceae	Aeromonadales	Gammaproteobacteria	Proteobacteria		Bacteria			
54291	0.0017503947552861437	Raoultella ornithinolytica	Raoultella	Enterobacteriaceae	Enterobacterales	Gammaproteobacteria	Proteobacteria		Bacteria			
1259973	0.00010309979330416179	Raoultella electrica	Raoultella	Enterobacteriaceae	Enterobacterales	Gammaproteobacteria	Proteobacteria		Bacteria			
937334	0.00016659619594596833	Caldicoprobacter faecalis	Caldicoprobacter	Caldicoprobacteraceae	Clostridiales	Clostridia	Firmicutes	Terrabacteria group	Bacteria			
425254	0.00016867873954315324	Cellulosilyticum ruminicola	Cellulosilyticum	Lachnospiraceae	Clostridiales	Clostridia	Firmicutes	Terrabacteria group	Bacteria			
1650663	0.0002069821289159969	Fournierella massiliensis	Fournierella	Ruminococcaceae	Clostridiales	Clostridia	Firmicutes	Terrabacteria group	Bacteria			
39495	2.823570637376126e-05	Eubacterium uniforme	Eubacterium	Eubacteriaceae	Clostridiales	Clostridia	Firmicutes	Terrabacteria group	Bacteria			
1679721	6.301398698631024e-05	Herbinix luporum	Herbinix	Lachnospiraceae	Clostridiales	Clostridia	Firmicutes	Terrabacteria group	Bacteria			
433293	0.00024133979198320176	Anaerotaenia torta	Anaerotaenia	Lachnospiraceae	Clostridiales	Clostridia	Firmicutes	Terrabacteria group	Bacteria			
39488	0.000240382360559969	Anaerobutyricum hallii	Anaerobutyricum	Lachnospiraceae	Clostridiales	Clostridia	Firmicutes	Terrabacteria group	Bacteria			
1501332	0.00020256415268080736	Oribacterium asaccharolyticum	Oribacterium	Lachnospiraceae	Clostridiales	Clostridia	Firmicutes	Terrabacteria group	Bacteria			
1745713	5.854313089901255e-05	Bariatricus massiliensis	Bariatricus	Lachnospiraceae	Clostridiales	Clostridia	Firmicutes	Terrabacteria group	Bacteria			
29361	5.527061167298174e-05	Tyzzerella nexilis	Tyzzerella	Lachnospiraceae	Clostridiales	Clostridia	Firmicutes	Terrabacteria group	Bacteria			
1313	6.331173561714839e-05	Streptococcus pneumoniae	Streptococcus	Streptococcaceae	Lactobacillales	Bacilli	Firmicutes	Terrabacteria group	Bacteria			
2211212	6.083340882564301e-05	Paenibacillus sp. DCT19	Paenibacillus	Paenibacillaceae	Bacillales	Bacilli	Firmicutes	Terrabacteria group	Bacteria			
100886	0.0007565965652104302	Catenibacterium mitsuokai	Catenibacterium	Erysipelotrichaceae	Erysipelotrichales	Erysipelotrichia	Firmicutes	Terrabacteria group	Bacteria			
573	0.0005817890616628535	Klebsiella pneumoniae	Klebsiella	Enterobacteriaceae	Enterobacterales	Gammaproteobacteria	Proteobacteria		Bacteria			
548	0.0002709492781882859	Klebsiella aerogenes	Klebsiella	Enterobacteriaceae	Enterobacterales	Gammaproteobacteria	Proteobacteria		Bacteria			
253314	0.0006803386971507556	Hungateiclostridium straminisolvens	Hungateiclostridium	Hungateiclostridiaceae	Clostridiales	Clostridia	Firmicutes	Terrabacteria group	Bacteria			
1495	5.346372256062238e-05	Clostridium cylindrosporum	Clostridium	Clostridiaceae	Clostridiales	Clostridia	Firmicutes	Terrabacteria group	Bacteria			
871664	2.4906301847805877e-05	Blautia stercoris	Blautia	Lachnospiraceae	Clostridiales	Clostridia	Firmicutes	Terrabacteria group	Bacteria			
693444	4.432018654893314e-05	Enterobacteriaceae bacterium strain FGI 57		Enterobacteriaceae	Enterobacterales	Gammaproteobacteria	Proteobacteria		Bacteria			
1121298	5.2548889234355007e-05	Clostridium amylolyticum	Clostridium	Clostridiaceae	Clostridiales	Clostridia	Firmicutes	Terrabacteria group	Bacteria			
1494	3.614270411227001e-05	Clostridium cochlearium	Clostridium	Clostridiaceae	Clostridiales	Clostridia	Firmicutes	Terrabacteria group	Bacteria			
110500	4.0142862781581296e-05	Pelotomaculum thermopropionicum	Pelotomaculum	Peptococcaceae	Clostridiales	Clostridia	Firmicutes	Terrabacteria group	Bacteria			
1508388	0.00016723247581465887	Jiella aquimaris	Jiella	Aurantimonadaceae	Rhizobiales	Alphaproteobacteria	Proteobacteria		Bacteria			
1701758	7.972176667323868e-05	Aureimonas populi	Aureimonas	Aurantimonadaceae	Rhizobiales	Alphaproteobacteria	Proteobacteria		Bacteria			
1505	4.526771960931204e-05	Paeniclostridium sordellii	Paeniclostridium	Peptostreptococcaceae	Clostridiales	Clostridia	Firmicutes	Terrabacteria group	Bacteria			
105841	2.5943510806716243e-05	Anaerostipes caccae	Anaerostipes	Lachnospiraceae	Clostridiales	Clostridia	Firmicutes	Terrabacteria group	Bacteria			
1905730	3.7742613058926905e-05	Pectobacterium parmentieri	Pectobacterium	Pectobacteriaceae	Enterobacterales	Gammaproteobacteria	Proteobacteria		Bacteria			
2128	6.071293941193766e-05	Mycoplasma flocculare	Mycoplasma	Mycoplasmataceae	Mycoplasmatales	Mollicutes	Tenericutes	Terrabacteria group	Bacteria			
1528098	0.0002204289794987737	Rickettsiales bacterium Ac37b			Rickettsiales	Alphaproteobacteria	Proteobacteria		Bacteria			
13335	0.00030131187912533906	Anaerobiospirillum succiniciproducens	Anaerobiospirillum	Succinivibrionaceae	Aeromonadales	Gammaproteobacteria	Proteobacteria		Bacteria			
301301	0.0005339337573980458	Roseburia hominis	Roseburia	Lachnospiraceae	Clostridiales	Clostridia	Firmicutes	Terrabacteria group	Bacteria			
384638	3.062810932998515e-05	[Bacteroides] pectinophilus			Clostridiales	Clostridia	Firmicutes	Terrabacteria group	Bacteria			
29364	9.440062505028705e-05	[Clostridium] polysaccharolyticum	Lachnoclostridium	Lachnospiraceae	Clostridiales	Clostridia	Firmicutes	Terrabacteria group	Bacteria			
550	8.477961889815553e-05	Enterobacter cloacae	Enterobacter	Enterobacteriaceae	Enterobacterales	Gammaproteobacteria	Proteobacteria		Bacteria			Enterobacter cloacae complex
1216932	0.00018389811282161747	Clostridium bornimense	Clostridium	Clostridiaceae	Clostridiales	Clostridia	Firmicutes	Terrabacteria group	Bacteria			
1841857	3.22283580878586e-05	Culturomica massiliensis	Culturomica	Odoribacteraceae	Bacteroidales	Bacteroidia	Bacteroidetes	FCB group	Bacteria			
28118	6.703310512098369e-05	Odoribacter splanchnicus	Odoribacter	Odoribacteraceae	Bacteroidales	Bacteroidia	Bacteroidetes	FCB group	Bacteria			
1042156	0.00013289406106462403	Clostridium sp. SY8519	Clostridium	Clostridiaceae	Clostridiales	Clostridia	Firmicutes	Terrabacteria group	Bacteria			
1550	4.245902285093077e-05	Clostridium subterminale	Clostridium	Clostridiaceae	Clostridiales	Clostridia	Firmicutes	Terrabacteria group	Bacteria			
1432052	6.04636076042954e-05	Eisenbergiella tayi	Eisenbergiella	Lachnospiraceae	Clostridiales	Clostridia	Firmicutes	Terrabacteria group	Bacteria			
1510	5.192011954879672e-05	Thermoclostridium stercorarium	Thermoclostridium	Hungateiclostridiaceae	Clostridiales	Clostridia	Firmicutes	Terrabacteria group	Bacteria			
39497	0.00012925738387935327	Eubacterium xylanophilum	Eubacterium	Eubacteriaceae	Clostridiales	Clostridia	Firmicutes	Terrabacteria group	Bacteria			
821	0.0010952741724381404	Phocaeicola vulgatus	Phocaeicola		Bacteroidales	Bacteroidia	Bacteroidetes	FCB group	Bacteria			
357276	3.062076520032338e-05	Phocaeicola dorei	Phocaeicola		Bacteroidales	Bacteroidia	Bacteroidetes	FCB group	Bacteria			
29343	0.0003718989478873989	[Clostridium] cellulosi		Ruminococcaceae	Clostridiales	Clostridia	Firmicutes	Terrabacteria group	Bacteria			
569	0.00012439488829391382	Hafnia alvei	Hafnia	Hafniaceae	Enterobacterales	Gammaproteobacteria	Proteobacteria		Bacteria			
82983	3.390493903708148e-05	Obesumbacterium proteus	Obesumbacterium	Hafniaceae	Enterobacterales	Gammaproteobacteria	Proteobacteria		Bacteria			
415421	3.5144675961455376e-05	Asaia lannensis	Asaia	Acetobacteraceae	Rhodospirillales	Alphaproteobacteria	Proteobacteria		Bacteria			
35701	3.712881107044787e-05	Heliobacterium modesticaldum	Heliobacterium	Heliobacteriaceae	Clostridiales	Clostridia	Firmicutes	Terrabacteria group	Bacteria			
137732	0.00025291305052583456	Granulicatella elegans	Granulicatella	Carnobacteriaceae	Lactobacillales	Bacilli	Firmicutes	Terrabacteria group	Bacteria			
46124	3.076623184134462e-05	Granulicatella adiacens	Granulicatella	Carnobacteriaceae	Lactobacillales	Bacilli	Firmicutes	Terrabacteria group	Bacteria			
1541063	4.0090754231854446e-05	Prolixibacter denitrificans	Prolixibacter	Prolixibacteraceae	Marinilabiliales	Bacteroidia	Bacteroidetes	FCB group	Bacteria			
1497	0.00011157936797362161	Clostridium formicaceticum	Clostridium	Clostridiaceae	Clostridiales	Clostridia	Firmicutes	Terrabacteria group	Bacteria			
150033	7.774298752320556e-05	Enterococcus ratti	Enterococcus	Enterococcaceae	Lactobacillales	Bacilli	Firmicutes	Terrabacteria group	Bacteria			
1675854	5.9900605870425044e-05	Abyssivirga alkaniphila	Abyssivirga	Lachnospiraceae	Clostridiales	Clostridia	Firmicutes	Terrabacteria group	Bacteria			
1520	0.0002581536086162911	Clostridium beijerinckii	Clostridium	Clostridiaceae	Clostridiales	Clostridia	Firmicutes	Terrabacteria group	Bacteria			
729	0.00046020274894553146	Haemophilus parainfluenzae	Haemophilus	Pasteurellaceae	Pasteurellales	Gammaproteobacteria	Proteobacteria		Bacteria			
1501	9.18279657006684e-05	Clostridium pasteurianum	Clostridium	Clostridiaceae	Clostridiales	Clostridia	Firmicutes	Terrabacteria group	Bacteria			
907	0.00011346364312260925	Megasphaera elsdenii	Megasphaera	Veillonellaceae	Veillonellales	Negativicutes	Firmicutes	Terrabacteria group	Bacteria			
158836	0.00018230904509743698	Enterobacter hormaechei	Enterobacter	Enterobacteriaceae	Enterobacterales	Gammaproteobacteria	Proteobacteria		Bacteria			Enterobacter cloacae complex
937251	5.2093675862699476e-05	Youngiibacter multivorans	Youngiibacter	Clostridiaceae	Clostridiales	Clostridia	Firmicutes	Terrabacteria group	Bacteria			
182838	2.838804547885909e-05	Swaminathania salitolerans	Swaminathania	Acetobacteraceae	Rhodospirillales	Alphaproteobacteria	Proteobacteria		Bacteria			
1852370	5.712519531727694e-05	Prevotellamassilia timonensis	Prevotellamassilia	Prevotellaceae	Bacteroidales	Bacteroidia	Bacteroidetes	FCB group	Bacteria			
1492	3.232600417333709e-05	Clostridium butyricum	Clostridium	Clostridiaceae	Clostridiales	Clostridia	Firmicutes	Terrabacteria group	Bacteria			
831	5.124066317838651e-05	Butyrivibrio fibrisolvens	Butyrivibrio	Lachnospiraceae	Clostridiales	Clostridia	Firmicutes	Terrabacteria group	Bacteria			
226665	0.00010814436184107601	Rickettsia heilongjiangensis	Rickettsia	Rickettsiaceae	Rickettsiales	Alphaproteobacteria	Proteobacteria		Bacteria			spotted fever group
341694	0.0007398669006608971	Peptostreptococcus stomatis	Peptostreptococcus	Peptostreptococcaceae	Clostridiales	Clostridia	Firmicutes	Terrabacteria group	Bacteria			
41997	3.567619238436033e-05	Enterococcus saccharolyticus	Enterococcus	Enterococcaceae	Lactobacillales	Bacilli	Firmicutes	Terrabacteria group	Bacteria			
44009	5.10001158441096e-05	Enterococcus dispar	Enterococcus	Enterococcaceae	Lactobacillales	Bacilli	Firmicutes	Terrabacteria group	Bacteria			
1650662	4.284634892283291e-05	Desnuesiella massiliensis	Desnuesiella	Clostridiaceae	Clostridiales	Clostridia	Firmicutes	Terrabacteria group	Bacteria			
879568	5.960979128562916e-05	Rhizobium capsici	Rhizobium	Rhizobiaceae	Rhizobiales	Alphaproteobacteria	Proteobacteria		Bacteria			
433646	4.897091475182324e-05	Parafrigoribacterium mesophilum	Parafrigoribacterium	Microbacteriaceae	Micrococcales	Actinobacteria	Actinobacteria	Terrabacteria group	Bacteria			
1796618	0.0002167467211294141	Cuneatibacter caecimuris	Cuneatibacter	Lachnospiraceae	Clostridiales	Clostridia	Firmicutes	Terrabacteria group	Bacteria			
46503	0.00016579127316244905	Parabacteroides merdae	Parabacteroides	Tannerellaceae	Bacteroidales	Bacteroidia	Bacteroidetes	FCB group	Bacteria			
29341	4.28889194027971e-05	Clostridium argentinense	Clostridium	Clostridiaceae	Clostridiales	Clostridia	Firmicutes	Terrabacteria group	Bacteria			
320502	5.099643078751573e-05	Hungateiclostridium alkalicellulosi	Hungateiclostridium	Hungateiclostridiaceae	Clostridiales	Clostridia	Firmicutes	Terrabacteria group	Bacteria			
295596	0.00010507905788561358	Candidatus Hepatoplasma crinochetorum	Candidatus Hepatoplasma	Mycoplasmataceae	Mycoplasmatales	Mollicutes	Tenericutes	Terrabacteria group	Bacteria			
979970	4.0879512374786614e-05	Acetobacteroides hydrogenigenes	Acetobacteroides	Rikenellaceae	Bacteroidales	Bacteroidia	Bacteroidetes	FCB group	Bacteria			
142588	3.7393425054161044e-05	Isobaculum melis	Isobaculum	Carnobacteriaceae	Lactobacillales	Bacilli	Firmicutes	Terrabacteria group	Bacteria			
2748	5.7237399725382935e-05	Carnobacterium divergens	Carnobacterium	Carnobacteriaceae	Lactobacillales	Bacilli	Firmicutes	Terrabacteria group	Bacteria			
100884	0.000162709918663945	Coprobacillus cateniformis	Coprobacillus	Erysipelotrichaceae	Erysipelotrichales	Erysipelotrichia	Firmicutes	Terrabacteria group	Bacteria			
238834	5.582749843723444e-05	Clostridium estertheticum	Clostridium	Clostridiaceae	Clostridiales	Clostridia	Firmicutes	Terrabacteria group	Bacteria			
39484	5.727404537868054e-05	Agathobaculum desmolans	Agathobaculum	Ruminococcaceae	Clostridiales	Clostridia	Firmicutes	Terrabacteria group	Bacteria			
171437	0.00016478430419102527	Tistrella mobilis	Tistrella	Rhodospirillaceae	Rhodospirillales	Alphaproteobacteria	Proteobacteria		Bacteria			
265477	3.8241227490812655e-05	Desulfallas alcoholivorax	Desulfallas	Peptococcaceae	Clostridiales	Clostridia	Firmicutes	Terrabacteria group	Bacteria			
1871021	3.576392416846975e-05	Lachnoclostridium phocaeense	Lachnoclostridium	Lachnospiraceae	Clostridiales	Clostridia	Firmicutes	Terrabacteria group	Bacteria			
290589	4.2998876078807566e-05	Alkalibacterium iburiense	Alkalibacterium	Carnobacteriaceae	Lactobacillales	Bacilli	Firmicutes	Terrabacteria group	Bacteria			
68892	5.6885734107864275e-05	Streptococcus infantis	Streptococcus	Streptococcaceae	Lactobacillales	Bacilli	Firmicutes	Terrabacteria group	Bacteria			
1720195	4.437268302934836e-05	Gabonibacter massiliensis	Gabonibacter	Porphyromonadaceae	Bacteroidales	Bacteroidia	Bacteroidetes	FCB group	Bacteria			
1501329	4.0285275814229276e-05	Oribacterium parvum	Oribacterium	Lachnospiraceae	Clostridiales	Clostridia	Firmicutes	Terrabacteria group	Bacteria			
820	4.4374649531142534e-05	Bacteroides uniformis	Bacteroides	Bacteroidaceae	Bacteroidales	Bacteroidia	Bacteroidetes	FCB group	Bacteria			
1329796	2.7987777031479173e-05	Risungbinella massiliensis	Risungbinella	Thermoactinomycetaceae	Bacillales	Bacilli	Firmicutes	Terrabacteria group	Bacteria			
1338	4.87357758679532e-05	Streptococcus intermedius	Streptococcus	Streptococcaceae	Lactobacillales	Bacilli	Firmicutes	Terrabacteria group	Bacteria			Streptococcus anginosus group
33040	4.9136852558794136e-05	Streptococcus milleri	Streptococcus	Streptococcaceae	Lactobacillales	Bacilli	Firmicutes	Terrabacteria group	Bacteria			
1328	3.701456567482621e-05	Streptococcus anginosus	Streptococcus	Streptococcaceae	Lactobacillales	Bacilli	Firmicutes	Terrabacteria group	Bacteria			Streptococcus anginosus group
584	0.00014707592832355267	Proteus mirabilis	Proteus	Morganellaceae	Enterobacterales	Gammaproteobacteria	Proteobacteria		Bacteria			
426703	6.47517858367025e-05	Alkalibacterium putridalgicola	Alkalibacterium	Carnobacteriaceae	Lactobacillales	Bacilli	Firmicutes	Terrabacteria group	Bacteria			
512382	2.5859655256256438e-05	Acidisoma tundrae	Acidisoma	Acetobacteraceae	Rhodospirillales	Alphaproteobacteria	Proteobacteria		Bacteria			
1493	3.0211531418138684e-05	Clostridium cellulovorans	Clostridium	Clostridiaceae	Clostridiales	Clostridia	Firmicutes	Terrabacteria group	Bacteria			
1728934	4.7499705390930915e-05	Clostridium neuense	Clostridium	Clostridiaceae	Clostridiales	Clostridia	Firmicutes	Terrabacteria group	Bacteria			
185008	2.9329539274711305e-05	Butyrivibrio hungatei	Butyrivibrio	Lachnospiraceae	Clostridiales	Clostridia	Firmicutes	Terrabacteria group	Bacteria			
165179	7.707129584265633e-05	Prevotella copri	Prevotella	Prevotellaceae	Bacteroidales	Bacteroidia	Bacteroidetes	FCB group	Bacteria			
65959	6.209698073384759e-05	Acetobacter pomorum	Acetobacter	Acetobacteraceae	Rhodospirillales	Alphaproteobacteria	Proteobacteria		Bacteria			
286730	4.580461634522917e-05	Alkaliflexus imshenetskii	Alkaliflexus	Marinilabiliaceae	Marinilabiliales	Bacteroidia	Bacteroidetes	FCB group	Bacteria			
1639	6.340129168065487e-05	Listeria monocytogenes	Listeria	Listeriaceae	Bacillales	Bacilli	Firmicutes	Terrabacteria group	Bacteria			
850	7.472288318244796e-05	Fusobacterium mortiferum	Fusobacterium	Fusobacteriaceae	Fusobacteriales	Fusobacteriia	Fusobacteria		Bacteria			
496053	8.310469633248619e-05	Hymenobacter daecheongensis	Hymenobacter	Hymenobacteraceae	Cytophagales	Cytophagia	Bacteroidetes	FCB group	Bacteria			
84024	4.261092975036027e-05	Clostridium disporicum	Clostridium	Clostridiaceae	Clostridiales	Clostridia	Firmicutes	Terrabacteria group	Bacteria			
1892865	5.318434096639367e-05	Allostreptomyces psammosilenae	Allostreptomyces	Streptomycetaceae	Streptomycetales	Actinobacteria	Actinobacteria	Terrabacteria group	Bacteria			
901	0.0004383785817047617	Desulfovibrio piger	Desulfovibrio	Desulfovibrionaceae	Desulfovibrionales	Deltaproteobacteria	Proteobacteria		Bacteria			
328812	0.00012213620697182107	Parabacteroides goldsteinii	Parabacteroides	Tannerellaceae	Bacteroidales	Bacteroidia	Bacteroidetes	FCB group	Bacteria			
371601	4.312786285438066e-05	Bacteroides xylanisolvens	Bacteroides	Bacteroidaceae	Bacteroidales	Bacteroidia	Bacteroidetes	FCB group	Bacteria			
2610896	0.00012243060953748446	Streptococcus sp. LPB0220	Streptococcus	Streptococcaceae	Lactobacillales	Bacilli	Firmicutes	Terrabacteria group	Bacteria			
227605	2.4514764974187805e-05	Methylocella tundrae	Methylocella	Beijerinckiaceae	Rhizobiales	Alphaproteobacteria	Proteobacteria		Bacteria			
881	3.904315562761333e-05	Desulfovibrio vulgaris	Desulfovibrio	Desulfovibrionaceae	Desulfovibrionales	Deltaproteobacteria	Proteobacteria		Bacteria			
288004	4.640377228842331e-05	Beggiatoa leptomitoformis	Beggiatoa	Thiotrichaceae	Thiotrichales	Gammaproteobacteria	Proteobacteria		Bacteria			
2098	4.9035107036004525e-05	Mycoplasma hominis	Mycoplasma	Mycoplasmataceae	Mycoplasmatales	Mollicutes	Tenericutes	Terrabacteria group	Bacteria			
44008	5.679993216662465e-05	Enterococcus cecorum	Enterococcus	Enterococcaceae	Lactobacillales	Bacilli	Firmicutes	Terrabacteria group	Bacteria			
29466	6.2666585242695e-05	Veillonella parvula	Veillonella	Veillonellaceae	Veillonellales	Negativicutes	Firmicutes	Terrabacteria group	Bacteria			
1541956	8.340577933678892e-05	Aureimonas glaciistagni	Aureimonas	Aurantimonadaceae	Rhizobiales	Alphaproteobacteria	Proteobacteria		Bacteria			
395922	4.203162179012677e-05	Coraliomargarita akajimensis	Coraliomargarita	Puniceicoccaceae	Puniceicoccales	Opitutae	Verrucomicrobia	PVC group	Bacteria			
209880	7.401817399214497e-05	Allisonella histaminiformans	Allisonella	Veillonellaceae	Veillonellales	Negativicutes	Firmicutes	Terrabacteria group	Bacteria			
225992	0.0001634813949908716	Comamonas kerstersii	Comamonas	Comamonadaceae	Burkholderiales	Betaproteobacteria	Proteobacteria		Bacteria			
2127	4.632881320186123e-05	Mycoplasma collis	Mycoplasma	Mycoplasmataceae	Mycoplasmatales	Mollicutes	Tenericutes	Terrabacteria group	Bacteria			
76517	6.538247472098827e-05	Campylobacter hominis	Campylobacter	Campylobacteraceae	Campylobacterales	Epsilonproteobacteria	Proteobacteria		Bacteria			
187979	4.439278558814932e-05	Mitsuokella jalaludinii	Mitsuokella	Selenomonadaceae	Selenomonadales	Negativicutes	Firmicutes	Terrabacteria group	Bacteria			
249188	0.00017045870593358488	Haemophilus pittmaniae	Haemophilus	Pasteurellaceae	Pasteurellales	Gammaproteobacteria	Proteobacteria		Bacteria			
39778	6.599433112805714e-05	Veillonella dispar	Veillonella	Veillonellaceae	Veillonellales	Negativicutes	Firmicutes	Terrabacteria group	Bacteria			
1304	3.064741978683182e-05	Streptococcus salivarius	Streptococcus	Streptococcaceae	Lactobacillales	Bacilli	Firmicutes	Terrabacteria group	Bacteria			
1335	4.2563954982192465e-05	Streptococcus equinus	Streptococcus	Streptococcaceae	Lactobacillales	Bacilli	Firmicutes	Terrabacteria group	Bacteria			
1348	4.291803893200798e-05	Streptococcus parauberis	Streptococcus	Streptococcaceae	Lactobacillales	Bacilli	Firmicutes	Terrabacteria group	Bacteria			
1816689	7.50719549083322e-05	Sutterella massiliensis	Sutterella	Sutterellaceae	Burkholderiales	Betaproteobacteria	Proteobacteria		Bacteria			
28111	6.297110527239564e-05	Bacteroides eggerthii	Bacteroides	Bacteroidaceae	Bacteroidales	Bacteroidia	Bacteroidetes	FCB group	Bacteria			
1903261	6.879734155237655e-05	Mailhella massiliensis	Mailhella	Desulfovibrionaceae	Desulfovibrionales	Deltaproteobacteria	Proteobacteria		Bacteria			
55969	4.768477927980234e-05	Leucobacter komagatae	Leucobacter	Microbacteriaceae	Micrococcales	Actinobacteria	Actinobacteria	Terrabacteria group	Bacteria			
338188	2.8031715220703063e-05	Bacteroides finegoldii	Bacteroides	Bacteroidaceae	Bacteroidales	Bacteroidia	Bacteroidetes	FCB group	Bacteria			
487173	0.0001267995745614621	Dialister succinatiphilus	Dialister	Veillonellaceae	Veillonellales	Negativicutes	Firmicutes	Terrabacteria group	Bacteria			
