feature	metadata	value	coef	stderr	N	N.not.0	pval	qval
Lachnospiraceae	severity_fact	Moderate	-0.144834253587546	0.0557411029846481	138	138	0.0104158183447496	0.0781186375856223
Ruminococcaceae	severity_fact	Moderate	-0.174226790675968	0.0643309842723209	138	138	0.00764571583681231	0.0781186375856223
Lachnospiraceae	severity_fact	Mild	-0.0964410236255165	0.0471763056751702	138	138	0.0428856456604681	0.214428228302341
Clostridiaceae	severity_fact	Moderate	-0.122090461458963	0.0657794894113572	138	138	0.0656419975009892	0.244247848569539
Clostridiaceae	severity_fact	Severe	-0.114940757165027	0.0689193393187644	138	138	0.0976991394278156	0.244247848569539
Lachnospiraceae	severity_fact	Severe	-0.0983469616286019	0.0584017909682629	138	138	0.0945152020490592	0.244247848569539
Clostridiaceae	severity_fact	Mild	-0.0703753110833043	0.0556722621811321	138	138	0.208388586580995	0.446546971244988
Ruminococcaceae	severity_fact	Severe	-0.0777205121503039	0.0674016927381118	138	138	0.250924386366264	0.470483224436746
Ruminococcaceae	severity_fact	Mild	-0.0498266939939377	0.0544463244520194	138	138	0.361755431818213	0.602925719697021
Oscillospiraceae	severity_fact	Mild	-0.00998048744531852	0.11430300840645	138	138	0.930550642009443	0.930550642009443
Oscillospiraceae	severity_fact	Moderate	0.062938566786177	0.135054571820624	138	138	0.641955514694578	0.930550642009443
Oscillospiraceae	severity_fact	Severe	-0.0234147322482621	0.141501126645246	138	138	0.868820439659214	0.930550642009443
Thermoactinomycetaceae	severity_fact	Mild	-0.00380871819023154	0.0132584303473763	138	138	0.774351143201093	0.930550642009443
Thermoactinomycetaceae	severity_fact	Moderate	-0.00440481364967373	0.0156654812374776	138	138	0.779006369360763	0.930550642009443
Thermoactinomycetaceae	severity_fact	Severe	0.00320758369009836	0.0164132410673751	138	138	0.845355025443343	0.930550642009443
