{
  "dataPath": "C:\\Users\\oreo\\AppData\\Local\\FoundryVTT",
  "manifest": "src",
  "repository": "https://gitlab.com/mesfoliesludiques/foundryvtt-ose",
  "rawURL": "https://gitlab.com/mesfoliesludiques/foundryvtt-ose/-/raw"
}