9235 
9096 637 
973 3269 7039 
3399 3350 4788 7546 
1739 8032 9427 976 2476 
703 9642 4232 1890 704 6463 
9601 1921 5655 1119 3115 5920 1808 
645 3674 246 2023 4440 9607 4112 3215 
660 6345 323 1664 2331 7452 3794 7679 3102 
1383 3058 755 1677 8032 2408 2592 2138 2373 8718 
8117 4602 7324 7545 4014 6970 4342 7682 150 3856 8177 
1966 1782 3248 1745 4864 9443 4900 8115 4120 9015 7040 9258 
4572 6637 9558 5366 7156 1848 2524 4337 5049 7608 8639 8301 1939 
7714 6996 2968 4473 541 3388 5992 2092 2973 9367 2573 2658 9965 8168 
67 1546 3243 752 8497 5215 7319 9245 574 7634 2223 8296 3044 9445 120 
7064 1045 5210 7347 5870 8487 3701 4301 1899 441 9828 3076 7769 8008 4496 6796 
5256 2199 464 5164 4039 1014 8099 7932 1909 3051 4805 1698 8578 1771 5889 5711 9967 
6830 2603 9256 3629 2793 5219 6534 8838 944 5113 4981 6811 6958 48 9463 7477 5723 1111 
7907 9312 4756 8096 3564 7809 9326 2502 5346 6383 5658 3791 423 701 3417 5042 2669 3759 5017 
8754 6389 4368 7284 2150 7288 6145 459 4079 1631 7595 620 2350 171 6401 4222 1182 5561 2669 7641 
3335 696 6551 360 454 708 5378 7750 8156 3187 4263 8282 9494 9607 1989 435 1558 5920 909 6567 5174 
1771 5573 4603 6962 5957 9870 3482 6287 324 6551 5035 7100 5595 6189 3178 6047 354 4873 1168 3815 8771 1222 
8982 6194 3575 3673 5892 5035 8234 8414 7744 6956 6341 6824 4562 9416 6808 8836 1692 9636 609 5238 6918 1685 8565 
7610 6713 1077 9905 9328 7107 4166 8230 4864 8540 1762 4870 7483 9504 2516 9634 7336 761 1805 5454 2967 530 6166 6541 
9277 1113 1596 9327 4106 9159 6484 1666 3774 5001 6357 8586 5151 1306 8160 2201 8124 7684 6362 9309 7702 5800 1827 2679 9402 
9080 7085 1053 5077 2129 8422 8489 8852 7628 6024 5841 4504 2658 8298 5860 6226 2157 5477 8728 4520 4513 590 6642 7711 3209 3005 
4500 7462 8825 848 8698 3585 7756 3857 7587 9434 7531 7443 5232 4212 3761 2111 4765 2628 432 9750 8871 5534 3519 9777 2692 7383 7686 
3624 8816 7672 7245 5646 4888 3871 5462 2170 1897 2787 823 8107 5186 5782 4911 2313 835 816 4192 8726 7262 903 7191 187 5542 4234 9292 
5817 2292 5964 9704 836 5776 5457 9027 9782 9306 5636 1268 250 5976 3032 1188 4460 5327 8071 6400 229 5587 5243 3777 1265 4847 1853 1421 9092 
704 2262 685 5345 716 1758 7567 3740 5354 480 9161 5544 1022 3196 8803 1074 3236 5157 3026 2407 9018 7720 4543 9281 3233 13 8065 996 5680 4485 
