1 10 20
100 200 125
201 210 89
900 1000 174
10 1 20
1 1 1
5 5 6
5 10 20
10 5 20
1000 999 112
13 14 18
14 13 18
99 100 26
50 100 119
10000 10000 30
9999 10000 92
10000 9999 92
45 50 105
1 999 179
999 1 179
8000 9000 247
9000 8000 247
1 2 2
1234 5678 238
555 555 31
555 5555 238
62 602 144
61 70 108
71 80 116
89 90 31
90 70 116
300 399 144
400 300 144
54 53 113
9999 9000 260
156 156 37
9009 9000 141
12 13 10
25 50 112
51 75 116
76 100 119
99 200 125
207 209 89
207 208 89
299 301 118
1 99 119
99 1 119
999 999 50
9999 9999 92
111 111 70
111 112 70
112 111 70
112 110 114
109 112 114
150 105 122
162 126 122
121 122 96
126 126 109
18 21 21
9 9 20
10 9 20
15 19 21
91 51 116
51 91 116
4 6 9
486 482 98
482 486 98
9909 9910 136
9876 9876 136
9874 9875 136
123 321 131
321 123 131
77 77 23
77 777 171
777 77 171
14 44 112
1 1001 179
99 101 26
101 99 26
1001 1 179
451 546 142
546 546 31
546 451 142
654 465 145
654 654 145
465 465 36
465 645 142
465 654 145
1 4 8
4 4 3
3 3 8
2 2 2
4 1 8
500 501 111
510 511 62
511 500 111
510 510 49
510 501 111
999 1001 143
2100 2000 157
1001 2000 182
1000 2000 182
2000 999 182
500 1500 182
1500 500 182
500 5000 238
5000 5000 29
5000 500 238
55555 55555 154
47898 51000 296
99999 100000 227
99990 100000 227
100000 99990 227
75000 75050 307
62002 62000 180
100010 100050 235
999999 999998 259
999999 999998 259
555550 555560 178
599999 600000 227
600001 600002 191
700001 700002 124
999990 999999 259
755506 695501 504
450000 451111 387
478981 479000 170
690001 699000 442
999999 1000000 259
1000000 1000000 153
1000000 999999 259
