1 10 20
100 200 125
201 210 89
900 1000 174
9999 122 262
293 12 128
23 411 144
944 2223 183
3994 11222 268
23 41 112
24 12 21
34 23 112
156 7443 262
34 123 119
1233 4212 238
1 2 2
23 4141 238
244 434 144
23 644 144
33 555 144
11 223 125
255 2323 183
111111 11 354
245 334 144
553 3553 217
23 2414 183
422 55 144
33 33 27
99999 1 351
292 212 128
331 21 144
123 5 119
123 4 119
23 14 21
12 339 144
22 111 119
22 199 125
10 220 125
222 11111 268
3 29 112
4 112 119
44 23 112
17 38 112
22 188 125
38 9992 262
2182 33882 308
24451 28882 308
123 44488 324
9482 8232 260
23 12399 268
2394 23122 279
4823 11822 268
4992 12344 268
12394 12223 263
2321 22222 279
11 11111 268
111 111111 354
122 1812 182
1992 22113 279
19382 23312 274
22231 23332 269
339 123 144
1 2 2
2 3 8
4 5 6
6 7 17
8 10 20
1 100 119
17 102 119
443 22234 279
200 1234 182
123 45678 324
9876 44231 324
123 2345 183
124 6635 262
9953 23939 282
40304 43443 288
122 44422 324
125 353 144
1234 23453 279
1564 3434 217
234 52352 324
2344 23323 279
9696 5533 262
3995 5352 215
355 2342 183
34552 1111 311
244 39192 324
955 35332 311
35 34134 308
344 33523 308
53 53532 340
83838 88888 333
2939 223 217
123 442 144
1123 4422 238
1233 4545 238
99999 99999 227
232 43124 324
553 13241 268
4241 92291 351
2444 3415 217
3344 55513 340
12 99 119
995 33 179
11 1 20
2 8 17
8 3 17
6 9 20
10 2 20
233 42 128
24 51 112
24 21 16
244 55 128
335 52 144
244 21 128
123 55 119
95 33 116
23 42 112
124 42 119
24 11 21
99999 11 351
244 3341 217
123 422 144
95 22 116
1 999999 525
422 923823 525
4923 232211 443
459 333412 443
