.......................
----------------------------------------------------------------------
Ran 23 tests in 61.502s

OK
Name             Stmts   Miss Branch BrPart  Cover   Missing
------------------------------------------------------------
Collatz.py          33      0     12      0   100%
TestCollatz.py      93      0      0      0   100%
------------------------------------------------------------
TOTAL              126      0     12      0   100%
