....................
----------------------------------------------------------------------
Ran 20 tests in 90.203s

OK
Name             Stmts   Miss Branch BrPart  Cover   Missing
------------------------------------------------------------
Collatz.py          33      0     16      0   100%
TestCollatz.py      82      0      0      0   100%
------------------------------------------------------------
TOTAL              115      0     16      0   100%
