Name,WeightClassKg,Division,Sex,Best3SquatKg,Best3BenchKg,Best3DeadliftKg,TotalKg,Event,Equipment,Place
D. Buddemeyer,52,Open,M,110,70,137.5,317.5,SBD,Single-ply,1
K. Kelley,52,Open,M,105,82.5,130,317.5,SBD,Single-ply,2
K. Viator,52,Open,M,,,,,SBD,Single-ply,DQ
J. Funderburk,52,Open,M,,,,,SBD,Single-ply,DQ
Harold Sackett,56,Open,M,155,115,190,460,SBD,Single-ply,1
T. Ngar,56,Open,M,137.5,95,167.5,400,SBD,Single-ply,2
L. Brown,56,Open,M,147.5,80,170,397.5,SBD,Single-ply,3
S. Bellotte,56,Open,M,125,90,150,365,SBD,Single-ply,4
Glen Venator,60,Open,M,187.5,127.5,197.5,512.5,SBD,Single-ply,1
Victor Williams,60,Open,M,165,117.5,180,462.5,SBD,Single-ply,2
J. Reno,60,Open,M,167.5,112.5,177.5,457.5,SBD,Single-ply,3
Dudley Lyon,60,Open,M,182.5,95,165,442.5,SBD,Single-ply,4
T. Henderson,60,Open,M,140,92.5,182.5,415,SBD,Single-ply,5
L. Johnson,60,Open,M,140,85,167.5,392.5,SBD,Single-ply,6
B. Harrel,60,Open,M,112.5,87.5,165,365,SBD,Single-ply,7
Frank Restivo,60,Open,M,-122.5,,,,SBD,Single-ply,DQ
Richard Beck,60,Open,M,,,,,SBD,Single-ply,DQ
Bill Bell,67.5,Open,M,202.5,142.5,235,580,SBD,Single-ply,1
K. Miller,67.5,Open,M,205,137.5,227.5,570,SBD,Single-ply,2
B. Alnany,67.5,Open,M,197.5,127.5,212.5,537.5,SBD,Single-ply,3
D. Courvelle,67.5,Open,M,192.5,127.5,207.5,527.5,SBD,Single-ply,4
Doug Holland,67.5,Open,M,197.5,117.5,210,525,SBD,Single-ply,5
B. Dunn #1,67.5,Open,M,190,120,192.5,502.5,SBD,Single-ply,6
T. McDonald,67.5,Open,M,172.5,132.5,185,490,SBD,Single-ply,7
Joe Paul Beasley,67.5,Open,M,182.5,110,187.5,480,SBD,Single-ply,8
R. Harvey,67.5,Open,M,137.5,110,185,432.5,SBD,Single-ply,9
S. Dunaway,67.5,Open,M,147.5,87.5,152.5,387.5,SBD,Single-ply,10
Joe Joyner,75,Open,M,245,162.5,280,687.5,SBD,Single-ply,1
Floyd Lyon,75,Open,M,255,145,260,660,SBD,Single-ply,2
D. Carroll,75,Open,M,237.5,172.5,250,660,SBD,Single-ply,3
Dan Gay,75,Open,M,222.5,150,265,637.5,SBD,Single-ply,4
M. Sharp,75,Open,M,247.5,145,235,627.5,SBD,Single-ply,5
Dan Canales,75,Open,M,220,147.5,250,617.5,SBD,Single-ply,6
R. Guidroz,75,Open,M,215,145,220,580,SBD,Single-ply,7
Steve Jiles,75,Open,M,182.5,120,242.5,545,SBD,Single-ply,8
D. Cole,75,Open,M,205,107.5,220,532.5,SBD,Single-ply,9
J. Raley,75,Open,M,200,122.5,207.5,530,SBD,Single-ply,10
Jim Rhodes,75,Open,M,182.5,125,215,522.5,SBD,Single-ply,11
G. Tiner,75,Open,M,187.5,107.5,195,490,SBD,Single-ply,12
Paul Aston,82.5,Open,M,302.5,205,280,787.5,SBD,Single-ply,1
Larry Mistric,82.5,Open,M,250,157.5,277.5,685,SBD,Single-ply,2
Mike Reed,82.5,Open,M,247.5,145,272.5,665,SBD,Single-ply,3
Henry Pitard,82.5,Open,M,235,142.5,250,627.5,SBD,Single-ply,4
Mike Cissell,82.5,Open,M,217.5,152.5,235,605,SBD,Single-ply,5
Dana Rosenzweig,82.5,Open,M,215,142.5,230,587.5,SBD,Single-ply,6
H. Clearman,82.5,Open,M,197.5,130,210,537.5,SBD,Single-ply,7
K. Davoust,82.5,Open,M,165,157.5,205,527.5,SBD,Single-ply,8
M. Deutsch,82.5,Open,M,172.5,122.5,220,515,SBD,Single-ply,9
M. Bullock,82.5,Open,M,170,125,205,500,SBD,Single-ply,10
Mike Ford,82.5,Open,M,,,,,SBD,Single-ply,DQ
J. Allen,82.5,Open,M,,,,,SBD,Single-ply,DQ
Roger Bell,90,Open,M,292.5,192.5,302.5,787.5,SBD,Single-ply,1
Gil Thompson,90,Open,M,277.5,217.5,292.5,787.5,SBD,Single-ply,2
Wayne Smith,90,Open,M,272.5,165,280,717.5,SBD,Single-ply,3
Danny Coffey,90,Open,M,262.5,180,242.5,685,SBD,Single-ply,4
Clarence Guiton,90,Open,M,230,165,282.5,677.5,SBD,Single-ply,5
J. Logan,90,Open,M,235,165,245,645,SBD,Single-ply,6
Mark Rippetoe,90,Open,M,230,152.5,250,632.5,SBD,Single-ply,7
M. Davoust,90,Open,M,222.5,177.5,227.5,627.5,SBD,Single-ply,8
G. Oeser,90,Open,M,225,117.5,272.5,615,SBD,Single-ply,9
C. Wattik,90,Open,M,185,122.5,230,537.5,SBD,Single-ply,10
D. Higoon,90,Open,M,-180,,,,SBD,Single-ply,DQ
R. Ard,90,Open,M,,,,,SBD,Single-ply,DQ
R. Kofnovec,90,Open,M,,,,,SBD,Single-ply,DQ
Phil Bradshaw,100,Open,M,330,197.5,307.5,835,SBD,Single-ply,1
Larry Marken,100,Open,M,312.5,210,307.5,830,SBD,Single-ply,2
M. Lagow,100,Open,M,260,200,282.5,742.5,SBD,Single-ply,3
Rick Porter,100,Open,M,317.5,170,247.5,735,SBD,Single-ply,4
B. Huber,100,Open,M,292.5,157.5,265,715,SBD,Single-ply,5
J. Burns,100,Open,M,250,192.5,270,712.5,SBD,Single-ply,6
Frank Christman,100,Open,M,280,172.5,260,712.5,SBD,Single-ply,7
J. Hodges,100,Open,M,225,145,277.5,647.5,SBD,Single-ply,8
Bill Shipp,100,Open,M,210,172.5,260,642.5,SBD,Single-ply,9
T. Dukett,100,Open,M,207.5,182.5,227.5,617.5,SBD,Single-ply,10
Bob Frost,100,Open,M,215,155,242.5,612.5,SBD,Single-ply,11
R. Brazzil,100,Open,M,195,132.5,210,537.5,SBD,Single-ply,12
M. Pritchard,100,Open,M,-245,,,,SBD,Single-ply,DQ
Greg Bowling,110,Open,M,297.5,190,307.5,795,SBD,Single-ply,1
Lee Houston,110,Open,M,277.5,172.5,295,745,SBD,Single-ply,2
Ricky Osborn,110,Open,M,272.5,175,282.5,730,SBD,Single-ply,3
B. Taylor,110,Open,M,250,177.5,302.5,730,SBD,Single-ply,4
B. Gibson,110,Open,M,235,147.5,287.5,670,SBD,Single-ply,5
D. Person,110,Open,M,230,145,250,625,SBD,Single-ply,6
J. Alexander,110,Open,M,197.5,142.5,237.5,577.5,SBD,Single-ply,7
R. Harris,110,Open,M,-210,,,,SBD,Single-ply,DQ
Joe Regaldo,110,Open,M,-215,,,,SBD,Single-ply,DQ
Clay Patterson,110,Open,M,,,,,SBD,Single-ply,DQ
R. Gates,110,Open,M,,,,,SBD,Single-ply,DQ
Doug Patterson,125,Open,M,335,207.5,320,862.5,SBD,Single-ply,1
Hal Hudson,125,Open,M,272.5,197.5,292.5,762.5,SBD,Single-ply,2
J. DiGangi,125,Open,M,287.5,177.5,295,760,SBD,Single-ply,3
Don Martin,125,Open,M,252.5,160,302.5,715,SBD,Single-ply,4
W. Miller,125,Open,M,210,167.5,230,607.5,SBD,Single-ply,5
Craig Young,125+,Open,M,317.5,187.5,340,845,SBD,Single-ply,1
Paul Martin,125+,Open,M,257.5,142.5,235,635,SBD,Single-ply,2
R. Woody,125+,Open,M,-240,,,,SBD,Single-ply,DQ
Lisa West,56,Open,F,92.5,52.5,117.5,262.5,SBD,Single-ply,1
L. Ryland,52,Open,F,52.5,37.5,82.5,172.5,SBD,Single-ply,1
P. Austin,75,Open,F,92.5,50,107.5,250,SBD,Single-ply,1
Patty Dent,82.5,Open,F,,,,,SBD,Single-ply,DQ
Hal Hudson,125,Masters 40-49,M,272.5,197.5,292.5,762.5,SBD,Single-ply,1
Henry Pitard,82.5,Masters 40-49,M,235,142.5,250,627.5,SBD,Single-ply,2
E. Hill,,Masters 40-49,M,210,112.5,227.5,550,SBD,Single-ply,3
P. Pendley,,Masters 40-49,M,167.5,115,177.5,460,SBD,Single-ply,4
W. Johnson,,Masters 40-49,M,,,,,SBD,Single-ply,DQ
B. Hindmon,,Masters 40-49,M,,,,,SBD,Single-ply,DQ
G. Stevens,,Masters 50+,M,100,65,127.5,292.5,SBD,Single-ply,1
S. Barron,,Teen 14-15,M,155,97.5,180,432.5,SBD,Single-ply,1
D. Buddemeyer,52,Teen 14-15,M,110,70,137.5,317.5,SBD,Single-ply,2
Lisa West,56,Teen 14-15,F,92.5,52.5,117.5,262.5,SBD,Single-ply,3
B. Dunn #1,67.5,Teen 16-17,M,190,120,192.5,502.5,SBD,Single-ply,1
Gary McMoran,,Teen 16-17,M,180,92.5,210,482.5,SBD,Single-ply,2
L. Brown,56,Teen 16-17,M,147.5,80,170,397.5,SBD,Single-ply,3
Tommy Sivils,,Teen 16-17,M,155,87.5,192.5,435,SBD,Single-ply,4
J. Kincaid,,Teen 16-17,M,160,100,177.5,437.5,SBD,Single-ply,5
E. Williamson,,Teen 16-17,M,152.5,97.5,177.5,427.5,SBD,Single-ply,6
K. Wall,,Teen 16-17,M,145,82.5,170,397.5,SBD,Single-ply,7
R. McKinney,,Teen 16-17,M,145,90,167.5,402.5,SBD,Single-ply,8
M. Freenan,,Teen 16-17,M,200,115,250,565,SBD,Single-ply,9
M. Ashcraft,,Teen 16-17,M,205,105,212.5,522.5,SBD,Single-ply,10
B. Harrel,,Teen 16-17,M,112.5,87.5,155,355,SBD,Single-ply,11
J. Staton,,Teen 16-17,M,115,75,165,355,SBD,Single-ply,12
K. Viator,,Teen 16-17,M,,,,,SBD,Single-ply,DQ
S. Wilkins,,Teen 16-17,M,,,,,SBD,Single-ply,DQ
Bill Almany,,Teen 18-19,M,197.5,127.5,212.5,537.5,SBD,Single-ply,1
R. Jackson,,Teen 18-19,M,205,147.5,272.5,625,SBD,Single-ply,2
Joe Paul Beasley,67.5,Teen 18-19,M,182.5,110,187.5,480,SBD,Single-ply,3
B. Boyer,,Teen 18-19,M,195,137.5,222.5,555,SBD,Single-ply,4
R. McMoran,,Teen 18-19,M,205,115,235,555,SBD,Single-ply,5
D. Harris,,Teen 18-19,M,240,140,240,620,SBD,Single-ply,6
C. Conant,,Teen 18-19,M,157.5,117.5,180,455,SBD,Single-ply,7
Gregg Jumper,,Teen 18-19,M,180,127.5,182.5,490,SBD,Single-ply,8
K. Kelley,,Teen 18-19,M,105,82.5,130,317.5,SBD,Single-ply,9
