Name,WeightClassKg,Division,Sex,Best3SquatKg,Best3BenchKg,Best3DeadliftKg,TotalKg,Event,Equipment,Place
B. Wilcox,,Open,F,63.5,45.36,74.84,183.71,SBD,Single-ply,1
E. Smith,,Open,F,77.11,58.97,104.33,240.4,SBD,Single-ply,2
Thomas,,Open,F,81.65,49.9,102.06,233.6,SBD,Single-ply,3
Hollenbeck,,Open,F,54.43,38.56,88.45,181.44,SBD,Single-ply,4
Love,,Open,F,34.02,29.48,61.24,124.74,SBD,Single-ply,5
LaFrancis,,Open,F,,,,,SBD,Single-ply,DQ
Hernandez,52,Open,M,68.04,45.36,113.4,226.8,SBD,Single-ply,1
Jackson,56,Open,M,90.72,74.84,136.08,301.64,SBD,Single-ply,1
Taylor,56,Open,M,45.36,27.22,79.38,151.95,SBD,Single-ply,2
Rodriguez,60,Open,M,192.78,108.86,181.44,483.08,SBD,Single-ply,1
G. Icks,60,Open,M,181.44,95.25,190.51,467.2,SBD,Single-ply,2
A. Fasolin,60,Open,M,147.42,115.67,170.1,433.18,SBD,Single-ply,3
Russel,60,Open,M,124.74,111.13,142.88,378.75,SBD,Single-ply,4
Mielich,60,Open,M,120.2,86.18,163.29,369.68,SBD,Single-ply,5
Tollman,60,Open,M,102.06,104.33,136.08,342.46,SBD,Single-ply,6
Buttner,60,Open,M,83.91,83.91,149.69,317.52,SBD,Single-ply,7
Edwards,60,Open,M,83.91,45.36,136.08,265.35,SBD,Single-ply,8
J. McNair,67.5,Open,M,197.31,115.67,215.46,528.44,SBD,Single-ply,1
Gross #3,67.5,Open,M,161.03,115.67,208.65,485.34,SBD,Single-ply,2
Mihlbraun,67.5,Open,M,161.03,115.67,190.51,467.2,SBD,Single-ply,3
S. Martin,67.5,Open,M,158.76,104.33,204.12,467.2,SBD,Single-ply,4
Asby,67.5,Open,M,111.13,124.74,170.1,405.97,SBD,Single-ply,6
Knox,67.5,Open,M,145.15,117.93,170.1,433.18,SBD,Single-ply,5
O. Rodriguez,67.5,Open,M,95.25,90.72,129.27,315.25,SBD,Single-ply,7
Marshall,67.5,Open,M,102.06,61.24,147.42,310.71,SBD,Single-ply,8
Dix,67.5,Open,M,176.9,104.33,,,SBD,Single-ply,DQ
Lux,75,Open,M,174.63,111.13,226.8,512.56,SBD,Single-ply,1
Bostic,75,Open,M,174.63,131.54,204.12,510.29,SBD,Single-ply,2
Hain,75,Open,M,170.1,120.2,204.12,494.42,SBD,Single-ply,3
Lane,75,Open,M,170.1,127.01,172.37,469.47,SBD,Single-ply,4
Fleace,75,Open,M,136.08,111.13,181.44,428.65,SBD,Single-ply,5
Forman,75,Open,M,127.01,117.93,176.9,421.84,SBD,Single-ply,6
Catalana,75,Open,M,127.01,120.2,163.29,410.5,SBD,Single-ply,7
Williams,75,Open,M,127.01,90.72,167.83,385.55,SBD,Single-ply,8
Domben,75,Open,M,97.52,97.52,147.42,342.46,SBD,Single-ply,9
Martin,82.5,Open,M,263.08,136.08,235.87,635.03,SBD,Single-ply,1
Brown,82.5,Open,M,192.78,147.42,249.48,589.67,SBD,Single-ply,2
Hambrick,82.5,Open,M,154.22,147.42,226.8,528.44,SBD,Single-ply,3
Rainer,82.5,Open,M,176.9,120.2,222.26,519.36,SBD,Single-ply,4
Rucker,82.5,Open,M,136.08,149.69,217.72,503.49,SBD,Single-ply,5
Newark,82.5,Open,M,174.63,131.54,190.51,496.68,SBD,Single-ply,6
King,82.5,Open,M,204.12,,278.96,,SBD,Single-ply,DQ
Farris,82.5,Open,M,,102.06,136.08,,SBD,Single-ply,DQ
Bridgewater,82.5,Open,M,181.44,,,,SBD,Single-ply,DQ
Pietraszack,82.5,Open,M,136.08,,165.56,,SBD,Single-ply,DQ
Sell,90,Open,M,238.14,142.88,272.16,653.17,SBD,Single-ply,1
G. Lethaniel,90,Open,M,192.78,145.15,244.94,582.87,SBD,Single-ply,2
Schaffer,90,Open,M,190.51,127.01,240.4,557.92,SBD,Single-ply,3
White,90,Open,M,167.83,158.76,226.8,553.38,SBD,Single-ply,4
Rogers,90,Open,M,192.78,124.74,215.46,532.97,SBD,Single-ply,5
Monte,90,Open,M,172.37,131.54,226.8,530.7,SBD,Single-ply,6
Wilcox,90,Open,M,181.44,149.69,181.44,512.56,SBD,Single-ply,7
Eaton,90,Open,M,172.37,127.01,195.04,494.42,SBD,Single-ply,8
Midriff,90,Open,M,163.29,127.01,192.78,483.08,SBD,Single-ply,9
Anderson,90,Open,M,145.15,127.01,190.51,462.66,SBD,Single-ply,10
Falls,90,Open,M,127.01,113.4,190.51,430.91,SBD,Single-ply,11
Knox,90,Open,M,136.08,92.99,183.71,412.77,SBD,Single-ply,12
Griffin,100,Open,M,226.8,181.44,238.14,646.37,SBD,Single-ply,1
Pietsch,100,Open,M,244.94,124.74,233.6,603.28,SBD,Single-ply,2
Edwards,100,Open,M,185.97,140.61,204.12,530.7,SBD,Single-ply,3
Warren,100,Open,M,90.72,115.67,226.8,433.18,SBD,Single-ply,4
Harris,100,Open,M,154.22,113.4,163.29,430.91,SBD,Single-ply,5
Gondoras,100,Open,M,,,204.12,,SBD,Single-ply,DQ
Greene,100,Open,M,272.16,,319.78,,SBD,Single-ply,DQ
Tims,100,Open,M,120.2,,183.71,,SBD,Single-ply,DQ
H. Wohdl,110,Open,M,260.82,190.51,301.64,752.96,SBD,Single-ply,1
Warren Vogel,110,Open,M,244.94,179.17,283.5,707.6,SBD,Single-ply,2
Smalls,110,Open,M,158.76,122.47,204.12,485.34,SBD,Single-ply,3
Bullock,110,Open,M,122.47,108.86,199.58,430.91,SBD,Single-ply,4
Heilegenthal,110+,Open,M,151.95,97.52,206.38,455.86,SBD,Single-ply,1
G. Roersch,110+,Open,M,,210.92,,,SBD,Single-ply,DQ
