NOIMMATRIC;DATEACHAT;MODELE;MARQUE
236CKV95;12/12/2000;Sprinter;Mercedes
257DEF95;12/12/2000;Sprinter;Mercedes
357BAS95;08/04/2004;Master;Renault
763OPE95;16/04/2004;Master;Renault
124FAK95;13/09/2006;ZE;Renault
658SQL95;04/10/2010;TGL;Man
532DFC95;04/10/2010;TGL;Man
602LKS95;04/10/2010;TGL;Man