^C:\USERS\JULIE\DOCUMENTS\TP\TITANIC-V2\X64\RELEASE\DATABASE.OBJ|C:\USERS\JULIE\DOCUMENTS\TP\TITANIC-V2\X64\RELEASE\MEMBRE.OBJ|C:\USERS\JULIE\DOCUMENTS\TP\TITANIC-V2\X64\RELEASE\MEMBRECREATEW.OBJ|C:\USERS\JULIE\DOCUMENTS\TP\TITANIC-V2\X64\RELEASE\MEMBREGETW.OBJ|C:\USERS\JULIE\DOCUMENTS\TP\TITANIC-V2\X64\RELEASE\MEMBREW.OBJ|C:\USERS\JULIE\DOCUMENTS\TP\TITANIC-V2\X64\RELEASE\PENALITE.OBJ|C:\USERS\JULIE\DOCUMENTS\TP\TITANIC-V2\X64\RELEASE\TITANIC.OBJ|C:\USERS\JULIE\DOCUMENTS\TP\TITANIC-V2\X64\RELEASE\TITANIC.RES
C:\PROGRAM FILES\MYSQL\CONNECTOR C++ 1.1\LIB\OPT\MYSQLCPPCONN.LIB
C:\USERS\JULIE\DOCUMENTS\TP\TITANIC-V2\LIBMYSQL.LIB
C:\PROGRAM FILES (X86)\WINDOWS KITS\10\LIB\10.0.19041.0\UM\X64\KERNEL32.LIB
C:\PROGRAM FILES (X86)\WINDOWS KITS\10\LIB\10.0.19041.0\UM\X64\USER32.LIB
C:\PROGRAM FILES (X86)\WINDOWS KITS\10\LIB\10.0.19041.0\UM\X64\GDI32.LIB
C:\PROGRAM FILES (X86)\WINDOWS KITS\10\LIB\10.0.19041.0\UM\X64\WINSPOOL.LIB
C:\PROGRAM FILES (X86)\WINDOWS KITS\10\LIB\10.0.19041.0\UM\X64\COMDLG32.LIB
C:\PROGRAM FILES (X86)\WINDOWS KITS\10\LIB\10.0.19041.0\UM\X64\ADVAPI32.LIB
C:\PROGRAM FILES (X86)\WINDOWS KITS\10\LIB\10.0.19041.0\UM\X64\SHELL32.LIB
C:\PROGRAM FILES (X86)\WINDOWS KITS\10\LIB\10.0.19041.0\UM\X64\OLE32.LIB
C:\PROGRAM FILES (X86)\WINDOWS KITS\10\LIB\10.0.19041.0\UM\X64\OLEAUT32.LIB
C:\PROGRAM FILES (X86)\WINDOWS KITS\10\LIB\10.0.19041.0\UM\X64\UUID.LIB
C:\PROGRAM FILES (X86)\WINDOWS KITS\10\LIB\10.0.19041.0\UM\X64\ODBC32.LIB
C:\PROGRAM FILES (X86)\WINDOWS KITS\10\LIB\10.0.19041.0\UM\X64\ODBCCP32.LIB
C:\USERS\JULIE\DOCUMENTS\TP\TITANIC-V2\X64\RELEASE\TITANIC.RES
C:\USERS\JULIE\DOCUMENTS\TP\TITANIC-V2\X64\RELEASE\DATABASE.OBJ
C:\USERS\JULIE\DOCUMENTS\TP\TITANIC-V2\X64\RELEASE\MEMBRE.OBJ
C:\USERS\JULIE\DOCUMENTS\TP\TITANIC-V2\X64\RELEASE\PENALITE.OBJ
C:\USERS\JULIE\DOCUMENTS\TP\TITANIC-V2\X64\RELEASE\MEMBREGETW.OBJ
C:\USERS\JULIE\DOCUMENTS\TP\TITANIC-V2\X64\RELEASE\MEMBRECREATEW.OBJ
C:\USERS\JULIE\DOCUMENTS\TP\TITANIC-V2\X64\RELEASE\MEMBREW.OBJ
C:\USERS\JULIE\DOCUMENTS\TP\TITANIC-V2\X64\RELEASE\TITANIC.OBJ
C:\WINDOWS\GLOBALIZATION\SORTING\SORTDEFAULT.NLS
C:\PROGRAM FILES (X86)\MICROSOFT VISUAL STUDIO\2019\ENTERPRISE\VC\TOOLS\MSVC\14.28.29910\BIN\HOSTX86\X64\C2.DLL
C:\PROGRAM FILES (X86)\MICROSOFT VISUAL STUDIO\2019\ENTERPRISE\VC\TOOLS\MSVC\14.28.29910\LIB\X64\MSVCPRT.LIB
C:\PROGRAM FILES (X86)\MICROSOFT VISUAL STUDIO\2019\ENTERPRISE\VC\TOOLS\MSVC\14.28.29910\LIB\X64\MSVCRT.LIB
C:\PROGRAM FILES (X86)\MICROSOFT VISUAL STUDIO\2019\ENTERPRISE\VC\TOOLS\MSVC\14.28.29910\LIB\X64\OLDNAMES.LIB
C:\PROGRAM FILES (X86)\MICROSOFT VISUAL STUDIO\2019\ENTERPRISE\VC\TOOLS\MSVC\14.28.29910\LIB\X64\VCRUNTIME.LIB
C:\PROGRAM FILES (X86)\WINDOWS KITS\10\LIB\10.0.19041.0\UCRT\X64\UCRT.LIB
C:\PROGRAM FILES (X86)\MICROSOFT VISUAL STUDIO\2019\ENTERPRISE\VC\TOOLS\MSVC\14.28.29910\BIN\HOSTX86\X64\1036\LINKUI.DLL
C:\PROGRAM FILES (X86)\MICROSOFT VISUAL STUDIO\2019\ENTERPRISE\VC\TOOLS\MSVC\14.28.29910\BIN\HOSTX86\X64\CVTRES.EXE
C:\PROGRAM FILES (X86)\MICROSOFT VISUAL STUDIO\2019\ENTERPRISE\VC\TOOLS\MSVC\14.28.29910\BIN\HOSTX86\X64\MSPDBSRV.EXE
C:\WINDOWS\SYSTEM32\TZRES.DLL
