code;manufacturer;description;amount;price
;;9V battery (rechargeable?);1;
232;Keystone Electronics;9V battery clip;1;0.456
B3F-4005;Omron;12x12mm Tact. switch 260g;6;0.407
B32-1200;Omron; 9x9mm Tact. switch cap - Ivory;2;0.237
B32-1220;Omron; 9x9mm Tact. switch cap - Orange;2;0.271
B32-1250;Omron; 9x9mm Tact. switch cap - Green;1;0.288
B32-1280;Omron; 9x9mm Tact. switch cap - Red;1;0.271
L7805CV;STM;5V, 1A linear regulator;2;0.424
60R025XU;LittleFuse;PTC resettable fuse (250ma hold, 500ma trip);2;0.339
BB830;BPS;830 point breadboard;1;8.850
ZW-MM-10;BPS;Jumper wires, male-male;1;4.46
ZW-MM-20;BPS;Jumper wires, male-male;1;4.93
NE555P;Texas Instruments;555 timer IC;4;0.39
BC547BTA;Fairchild;General purpose NPN transistor;10;0.119
BC557BTA;Fairchild;General purpose PNP transistor;10;0.128
SS12SDP2;NKK Switches;Slide Switch SPDT ON-ON;1;1.26
HLMP-3507;Broadcom;5mm LED, diffused green;5;0.313
HLMP-3401;Broadcom;5mm LED, diffused yellow;5;0.313
HLMP-3301;Broadcom;5mm LED, diffused red;5;0.313
EEA-FC1V120B;Panasonic;ELCO Cap, 12uF, 35V;2;0.271
K103K10X7RH5TH5;Vishay;MLC Cap, 10nF, 100V;4;0.102
CFR-25JT-52-10K;Yageo;Carbon Film Resistor 10K, 1/4W;10;0.039
CFR-25JT-52-390K;Yageo;Carbon Film Resistor 390K, 1/4W;4;0.085