sid,dist,microtime
ttc_34_0_34A,10.719668028050044,68580192
ttc_34_0_34C,0.04876362517253736,68444541
ttc_34_0_34A,1.1401199513407037,67677592
ttc_34_1_34A,14.61057657824394,68293725
ttc_34_0_34A,10.737803567232731,68421569
ttc_none,0.010151744038582664,68422630
ttc_34_0_34C,7.843125778805981,67796266
ttc_34_1_34A,6.769004981181102,68158992
ttc_34_1_34A,11.843304972342569,68357078
ttc_34_1_34A,0.15681942310109676,68504237
ttc_34_1_34A,6.9118687923700355,67802156
ttc_34_0_34A,6.793056028327291,67907552
ttc_34_0_34A,7.780276570268782,68032082
ttc_34_1_34C,6.756981268723,68277035
ttc_34_0_34A,3.6288872851192084,68602589
ttc_34_0_34C,5.7003560566097216,68641730
ttc_34_1_34A,15.05760516567384,67799530
ttc_34_1_34C,8.03296131766401,67704106
ttc_34_1_34A,9.599705418195143,67860706
ttc_34_1_34A,8.335080043921922,67997635
ttc_34_1_34A,12.645496537302485,68158788
ttc_34_0_34A,0.1535863676155111,68165983
ttc_34_1_34A,15.131957454046102,68088222
ttc_34_0_34A,8.21030295944034,68226252
ttc_34_0_34C,0.6546404855418407,68388187
ttc_34_1_34A,0.05289723729884814,67763971
ttc_34_1_34C,8.045216496275303,67942954
ttc_34_1_34C,2.4239856521565475,68141510
ttc_34_1_34A,15.135792498079596,68050507
ttc_34_0_34C,0.08189215184845075,68265146
