sid,dist,microtime
ttc_34_1_34A,3.831306322364691,63957137
ttc_34_0_34C,7.24569106598432,64058998
ttc_34_0_34A,15.035913023696388,64487099
ttc_34_1_34A,0.010151744038582664,63729948
ttc_34_1_34A,3.5590923025400656,63909239
ttc_none,3.8176391178086684,63909239
ttc_34_1_34C,2.4613373682414497,64038520
ttc_none,4.342521943052571,64038466
ttc_34_0_34A,13.940086686020415,63927422
ttc_none,0.010151744038582664,63927419
ttc_none,3.9349405138744538,63928419
ttc_34_1_34A,11.47901494111219,64086561
ttc_34_1_34A,9.365948513330562,63917581
ttc_34_0_34C,0.050059493809061155,64035357
ttc_34_1_34A,11.611191000718824,64115578
ttc_34_1_34C,3.0408572144679287,64225138
ttc_34_0_34A,2.2862662929479023,64077168
ttc_34_1_34C,5.664419634662395,63923312
ttc_34_0_34A,4.814039214581935,64056992
ttc_34_0_34A,6.580913028431499,63895273
ttc_34_0_34C,4.314372223047949,63758871
ttc_34_1_34A,0.010151744038582664,64605937
ttc_34_0_34A,1.2945793011334603,64567087
ttc_34_1_34A,15.12655898700172,63805292
ttc_34_1_34A,0.05014004530305299,64680477
ttc_34_1_34A,7.27396242777039,64552816
ttc_34_1_34C,7.847719896583382,64648210
ttc_34_0_34A,14.092620161813263,64541782
ttc_34_0_34C,3.703204332641596,64404853
ttc_34_1_34A,2.5554930836371645,64266718
ttc_34_1_34C,8.045216496275303,64395694
