sid,dist,microtime
ttc_34_1_34A,9.56968782493196,62721835
ttc_34_0_34C,3.9252014775201647,63004264
ttc_34_1_34A,2.5826034786630783,63113968
ttc_34_1_34A,9.039383363581347,63393109
ttc_34_0_34A,0.3269210228299378,62665590
ttc_34_1_34C,6.449235513259205,63002355
ttc_34_0_34A,2.24930278536382,63109964
ttc_34_0_34A,9.358884509492201,63491627
ttc_34_1_34A,2.4630127383315,63455045
ttc_34_0_34A,1.2127265024734832,62940394
ttc_34_1_34A,13.455148493518063,63014513
ttc_34_1_34A,11.645084430387227,63222385
ttc_34_1_34A,15.027632370597189,63159571
ttc_34_1_34C,7.8894882928869965,63547868
ttc_34_1_34A,0.1188473973177953,62864202
ttc_34_1_34C,7.889045867347376,63117417
ttc_34_0_34A,2.2974853232749624,63474408
ttc_34_0_34A,3.637933699642926,63473595
ttc_34_0_34C,2.2107349717853104,63340783
ttc_34_1_34A,2.7303908048471786,63226545
ttc_34_1_34A,1.164639995611706,63331268
ttc_34_0_34A,11.16997442354551,63170468
ttc_34_1_34A,4.324219466432925,63271787
ttc_34_1_34A,11.308455213277647,63127165
ttc_34_1_34C,8.041676992858793,63094033
ttc_34_0_34A,8.682746712712047,63083179
ttc_34_1_34C,1.1158505679554327,63185906
ttc_34_0_34C,0.0017790346095601472,63366430
ttc_34_1_34A,6.365627825522573,63482116
ttc_34_0_34C,7.248770218160232,63597802
