sid,dist,microtime
ttc_34_1_34A,3.59428776299716,64345947
ttc_34_0_34C,7.768784552456714,64219886
ttc_34_0_34A,15.035913023696388,64060051
ttc_none,0.010151744038582664,64060051
ttc_34_1_34A,2.8720139938938525,63950955
ttc_none,3.84572718139775,63951898
ttc_34_1_34C,2.181512365102621,63813861
ttc_34_0_34A,4.786769490832348,63790772
ttc_34_0_34A,14.42269799365539,64651719
ttc_34_0_34A,0.13750206668952486,64608170
ttc_34_0_34A,3.9684008289308306,64677564
ttc_34_1_34A,11.461799746136665,63842466
ttc_34_1_34A,9.039383363581347,63793334
ttc_34_0_34C,0.050059493809061155,63938433
ttc_none,11.565232730462908,63967433
ttc_34_1_34C,2.887597323457089,64072319
ttc_34_0_34A,2.6659409932867715,64008274
ttc_34_1_34C,5.595203500815856,64208334
ttc_34_0_34A,5.222553674594007,64191065
ttc_34_0_34A,6.768465662026716,64020246
ttc_34_0_34C,4.642725592383405,63878721
ttc_34_1_34A,0.010151744038582664,64719553
ttc_34_0_34A,1.7394064619544787,64532555
ttc_34_1_34A,15.127535481146039,64405214
ttc_34_1_34A,0.010151744038582664,64538492
ttc_34_1_34A,6.805608027265988,64458357
ttc_34_1_34C,7.84067615219791,64353637
ttc_34_0_34A,14.488365733387592,64384426
ttc_34_0_34C,0.09499549427368166,64213447
ttc_34_0_34C,3.726869647139067,64110268
ttc_34_1_34A,2.4239856521565475,63991744
ttc_34_1_34C,8.045216496275303,64088962
