sid,dist,microtime
ttc_34_1_34A,5.575041811203871,64067732
ttc_34_0_34C,6.641127319379872,63924792
ttc_34_0_34A,14.517396300513859,63783531
ttc_34_1_34A,0.010151744038582664,63681132
ttc_34_1_34A,4.517512451726231,64084122
ttc_34_0_34A,3.7468778650036576,64214044
ttc_34_1_34C,2.698411895110656,64059125
ttc_none,4.235069796824143,64059094
ttc_34_0_34A,13.082294890721615,64215336
ttc_34_1_34A,0.010151744038582664,63454351
ttc_34_0_34A,3.9127929669438637,63819163
ttc_none,11.645386075290212,63820107
ttc_34_1_34A,9.706898269181522,63979162
ttc_34_0_34C,0.050059493809061155,64141847
ttc_34_1_34C,4.479765185587058,63984547
ttc_34_0_34A,1.2127265024734832,63894454
ttc_34_1_34C,6.109284572386388,64024091
ttc_none,4.282181573623527,64024928
ttc_34_0_34A,4.642725592383405,64071504
ttc_none,4.118462455412308,64071504
ttc_34_1_34A,0.0403604408075713,64010307
ttc_34_0_34A,0.3269210228299378,63866789
ttc_34_0_34A,14.457402332896491,64179357
ttc_34_1_34A,0.9737853385456109,64050871
ttc_34_1_34A,8.771088687129932,64270841
ttc_34_1_34C,8.030332557379634,63537905
ttc_34_0_34A,13.083099489478501,64371175
ttc_34_0_34C,2.406191540150694,63574473
ttc_34_1_34A,3.2346369135253012,64485043
ttc_34_0_34C,7.602077503763265,64363563
