sid,dist,microtime
ttc_34_0_34A,13.800041133197695,68608719
ttc_34_0_34C,0.019055413133543978,68757763
ttc_34_0_34A,6.718275982551581,68965012
ttc_34_1_34A,10.741644553588074,68805091
ttc_34_0_34A,14.472671845409451,68799122
ttc_34_0_34A,1.1405331880526497,68721931
ttc_34_1_34C,8.034073316945149,68724635
ttc_34_1_34A,0.7253044408274668,68578195
ttc_34_0_34A,0.18749215359479868,68741427
ttc_34_1_34A,7.622317086798807,68855779
ttc_34_1_34A,0.4346289483414979,68986238
ttc_34_0_34A,8.017931900998192,69297419
ttc_34_0_34A,8.249911506104416,69104715
ttc_none,0.36727048014754166,69104715
ttc_34_0_34A,7.778595844264299,68991621
ttc_34_0_34C,7.879055578435841,68869641
ttc_34_1_34C,8.045216496275303,68716315
ttc_34_1_34A,2.9553026976485466,68608987
ttc_34_1_34A,0.7265853578122615,68710408
ttc_34_1_34A,6.487199939695083,68553651
ttc_34_1_34A,9.034196244495616,68693782
ttc_34_0_34A,5.128719815588448,68865972
ttc_34_1_34A,12.705834280647663,68970667
ttc_34_0_34A,12.255937682890545,68838674
ttc_34_0_34C,6.079186136535724,68678755
ttc_34_0_34A,0.010151744038582664,68933302
ttc_34_1_34C,6.61426718482168,68831313
ttc_34_0_34C,0.07495641033763432,68938680
ttc_34_1_34A,14.630166407492231,69030320
ttc_34_0_34C,0.7900944388794848,69110708
