dir,id,route,predable,time,hdg,spd,temp,vis,t_min,t_max,snow,rain,lat,lon
34_1_34C,8730,34,true,1585529422,246,39,284.08,14484,282.04,285.37,False,0,43.721705,-79.3355183
34_1_34C,8730,34,true,1585529453,245,38,284.08,14484,282.04,285.37,False,0,43.7205883,-79.3393516
34_1_34C,8730,34,true,1585529482,243,43,284.08,14484,282.04,285.37,False,0,43.7193333,-79.3430366
34_1_34C,8730,34,true,1585529513,247,39,284.05,14484,282.04,285.37,False,0,43.7178916,-79.347515
34_1_34C,8730,34,true,1585529543,248,0,284.05,14484,282.04,285.37,False,0,43.7172466,-79.3497333
34_1_34C,8730,34,true,1585529572,248,0,284.05,14484,282.04,285.37,False,0,43.7172466,-79.3497333
34_1_34C,8730,34,true,1585529573,248,0,284.05,14484,282.04,285.37,False,0,43.7172466,-79.3497333
34_1_34C,8730,34,true,1585529603,248,0,284.05,14484,282.04,285.37,False,0,43.7172466,-79.3497333
34_1_34C,8730,34,true,1585529602,248,0,284.05,14484,282.04,285.37,False,0,43.7172466,-79.3497333
34_1_34C,8730,34,true,1585529632,240,35,284.05,14484,282.04,285.37,False,0,43.7166116,-79.35163
34_1_34C,8730,34,true,1585529633,240,35,284.05,14484,282.04,285.37,False,0,43.7166116,-79.35163
34_1_34C,8730,34,true,1585529662,255,35,284.02,14484,282.04,285.37,False,0,43.7155816,-79.3552616
34_1_34C,8730,34,true,1585529663,255,35,284.02,14484,282.04,285.37,False,0,43.7155816,-79.3552616
34_1_34C,8730,34,true,1585529692,250,35,283.89,14484,282.04,285.37,False,0,43.7148416,-79.3591566
34_1_34C,8730,34,true,1585529693,250,35,283.89,14484,282.04,285.37,False,0,43.7148416,-79.3591566
34_1_34C,8730,34,true,1585529722,251,34,283.89,14484,282.04,285.37,False,0,43.713975,-79.3630216
34_1_34C,8730,34,true,1585529723,251,34,283.89,14484,282.04,285.37,False,0,43.713975,-79.3630216
34_1_34C,8730,34,true,1585529752,254,0,283.89,14484,282.04,285.37,False,0,43.7136783,-79.3646233
34_1_34C,8730,34,true,1585529753,254,0,283.89,14484,282.04,285.37,False,0,43.7136783,-79.3646233
34_1_34C,8730,34,true,1585529785,252,31,283.89,14484,282.04,285.37,False,0,43.7132166,-79.36668
34_1_34C,8730,34,true,1585529784,252,31,283.89,14484,282.04,285.37,False,0,43.7132166,-79.36668
34_1_34C,8730,34,true,1585529812,254,38,283.89,14484,282.04,285.37,False,0,43.71233,-79.3709583
34_1_34C,8730,34,true,1585529813,254,38,283.89,14484,282.04,285.37,False,0,43.71233,-79.3709583
34_1_34C,8730,34,true,1585529843,256,36,283.89,14484,282.04,285.37,False,0,43.711785,-79.3737466
34_1_34C,8730,34,true,1585529842,256,36,283.89,14484,282.04,285.37,False,0,43.711785,-79.3737466
34_1_34C,8730,34,true,1585529873,246,7,283.88,14484,282.04,285.37,False,0,43.7112,-79.3763066
34_1_34C,8730,34,true,1585529872,246,7,283.88,14484,282.04,285.37,False,0,43.7112,-79.3763066
34_1_34C,8730,34,true,1585529902,255,0,283.88,14484,282.04,285.37,False,0,43.7111833,-79.3763633
34_1_34C,8730,34,true,1585529903,255,0,283.88,14484,282.04,285.37,False,0,43.7111833,-79.3763633
34_1_34C,8730,34,true,1585529932,247,7,283.88,14484,282.04,285.37,False,0,43.7111733,-79.3764
34_1_34C,8730,34,true,1585529933,247,7,283.88,14484,282.04,285.37,False,0,43.7111733,-79.3764
34_1_34C,8730,34,true,1585529963,257,35,283.88,14484,282.04,285.37,False,0,43.710645,-79.3792933
34_1_34C,8730,34,true,1585529992,254,37,283.83,14484,282.04,285.37,False,0,43.7097866,-79.3834566
34_1_34C,8730,34,true,1585529993,254,37,283.88,14484,282.04,285.37,False,0,43.7097866,-79.3834566
34_1_34C,8730,34,true,1585530022,258,30,283.84,14484,282.04,285.37,False,0,43.7090183,-79.38739
34_1_34C,8730,34,true,1585530023,258,30,283.82,14484,282.04,285.37,False,0,43.7090183,-79.38739
34_1_34C,8730,34,true,1585530053,254,23,283.82,14484,282.04,285.37,False,0,43.7084616,-79.38966
34_1_34C,8730,34,true,1585530082,254,26,283.82,14484,282.04,285.37,False,0,43.7080066,-79.392315
34_1_34C,8730,34,true,1585530083,254,26,283.82,14484,282.04,285.37,False,0,43.7080066,-79.392315
34_1_34C,8730,34,true,1585530112,251,25,283.82,14484,282.04,285.37,False,0,43.70735,-79.3952633
34_1_34C,8730,34,true,1585530142,254,18,283.82,14484,282.04,285.37,False,0,43.7067916,-79.3978716
34_1_34C,8730,34,true,1585530143,254,18,283.82,14484,282.04,285.37,False,0,43.7067916,-79.3978716
34_1_34C,8730,34,true,1585530173,253,0,283.82,14484,282.04,285.37,False,0,43.70677,-79.3979716
34_1_34C,8730,34,true,1585530203,254,4,283.82,14484,282.04,285.37,False,0,43.7067666,-79.3979899
34_1_34C,8730,34,true,1585530233,251,4,283.82,14484,282.04,285.37,False,0,43.7056274,-79.3999176
34_1_34C,8730,34,true,1585530262,164,20,283.82,14484,282.04,285.37,False,0,43.7059733,-79.4001966
34_1_34C,8730,34,true,1585530293,165,10,283.82,14484,282.04,285.37,False,0,43.7050933,-79.3985671
34_1_34C,8730,34,true,1585530323,118,9,283.82,14484,282.04,285.37,False,0,43.7050933,-79.3985671
34_1_34C,8730,34,true,1585530353,173,1,283.82,14484,282.04,285.37,False,0,43.7050933,-79.3985671
