dir,id,route,predable,time,hdg,spd,temp,vis,t_min,t_max,snow,rain,lat,lon
34_0_34C,8779,34,true,1585434799,104,13,280.08,14484,277.59,282.59,False,0,43.7045106,-79.3992954
34_0_34C,8779,34,true,1585434829,95,0,280.08,14484,277.59,282.59,False,0,43.7042573,-79.3986409
34_0_34C,8779,34,true,1585434859,300,12,280.02,14484,277.59,282.04,False,0,43.7053833,-79.39878
34_0_34C,8779,34,true,1585434890,148,2,280.08,14484,277.59,282.59,False,0,43.7047333,-79.399195
34_0_34C,8779,34,true,1585434889,148,2,280.08,14484,277.59,282.59,False,0,43.7047333,-79.399195
34_0_34C,8779,34,true,1585434919,216,0,280.08,14484,277.59,282.59,False,0,43.70467,-79.3990366
34_0_34C,8779,34,true,1585434949,216,0,280.08,14484,277.59,282.59,False,0,43.70467,-79.3990366
34_0_34C,8779,34,true,1585434979,216,0,280.08,14484,277.59,282.59,False,0,43.70467,-79.3990366
34_0_34C,8779,34,true,1585435009,216,0,279.91,14484,277.04,282.04,False,0,43.70467,-79.3990366
34_0_34C,8779,34,true,1585435039,216,0,279.91,14484,277.04,282.04,False,0,43.70467,-79.3990366
34_0_34C,8779,34,true,1585435069,216,0,279.91,14484,277.04,282.04,False,0,43.70467,-79.3990366
34_0_34C,8779,34,true,1585435070,216,0,279.91,14484,277.04,282.04,False,0,43.70467,-79.3990366
34_0_34C,8779,34,true,1585435099,216,0,279.91,14484,277.04,282.04,False,0,43.70467,-79.3990366
34_0_34C,8779,34,true,1585435129,216,0,279.91,14484,277.04,282.04,False,0,43.70467,-79.3990366
34_0_34C,8779,34,true,1585435130,216,0,279.91,14484,277.04,282.04,False,0,43.70467,-79.3990366
34_0_34C,8779,34,true,1585435159,216,0,279.91,14484,277.04,282.04,False,0,43.70467,-79.3990366
34_0_34C,8779,34,true,1585435189,216,0,279.91,14484,277.04,282.04,False,0,43.70467,-79.3990366
34_0_34C,8779,34,true,1585435190,216,0,279.91,14484,277.04,282.04,False,0,43.70467,-79.3990366
34_0_34C,8779,34,true,1585435219,216,0,279.91,14484,277.04,282.04,False,0,43.70467,-79.3990366
34_0_34C,8779,34,true,1585435249,216,0,279.91,14484,277.04,282.04,False,0,43.70467,-79.3990366
34_0_34C,8779,34,true,1585435250,216,0,279.91,14484,277.04,282.04,False,0,43.70467,-79.3990366
34_0_34C,8779,34,true,1585435279,216,0,279.91,14484,277.04,282.04,False,0,43.70467,-79.3990366
34_0_34C,8779,34,true,1585435280,216,0,279.91,14484,277.04,282.04,False,0,43.70467,-79.3990366
34_0_34C,8779,34,true,1585435309,216,0,279.91,14484,277.04,282.04,False,0,43.70467,-79.3990366
34_0_34C,8779,34,true,1585435310,216,0,279.91,14484,277.04,282.04,False,0,43.70467,-79.3990366
34_0_34C,8779,34,true,1585435339,216,0,279.91,14484,277.04,282.04,False,0,43.70467,-79.3990366
34_0_34C,8779,34,true,1585435369,216,0,279.91,14484,277.04,282.04,False,0,43.70467,-79.3990366
34_0_34C,8779,34,true,1585435400,216,0,279.91,14484,277.04,282.04,False,0,43.70467,-79.3990366
34_0_34C,8779,34,true,1585435399,216,0,279.91,14484,277.04,282.04,False,0,43.70467,-79.3990366
34_0_34C,8779,34,true,1585435429,216,0,279.91,14484,277.04,282.04,False,0,43.70467,-79.3990366
34_0_34C,8779,34,true,1585435430,216,0,279.91,14484,277.04,282.04,False,0,43.70467,-79.3990366
34_0_34C,8779,34,true,1585435459,216,0,279.91,14484,277.04,282.04,False,0,43.70467,-79.3990366
34_0_34C,8779,34,true,1585435460,216,0,279.91,14484,277.04,282.04,False,0,43.70467,-79.3990366
34_0_34C,8779,34,true,1585435489,216,0,279.91,14484,277.04,282.04,False,0,43.70467,-79.3990366
34_0_34C,8779,34,true,1585435519,216,0,279.91,14484,277.04,282.04,False,0,43.70467,-79.3990366
34_0_34C,8779,34,true,1585435520,216,0,279.91,14484,277.04,282.04,False,0,43.70467,-79.3990366
34_0_34C,8779,34,true,1585435550,216,0,279.91,14484,277.04,282.04,False,0,43.70467,-79.3990366
34_0_34C,8779,34,true,1585435549,216,0,279.91,14484,277.04,282.04,False,0,43.70467,-79.3990366
34_0_34C,8779,34,true,1585435579,216,0,279.91,14484,277.04,282.04,False,0,43.70467,-79.3990366
34_0_34C,8779,34,true,1585435580,216,0,279.91,14484,277.04,282.04,False,0,43.70467,-79.3990366
34_0_34C,8779,34,true,1585435609,216,0,279.9,14484,277.04,282.04,False,0,43.70467,-79.3990366
34_0_34C,8779,34,true,1585435640,216,0,279.9,14484,277.04,282.04,False,0,43.70467,-79.3990366
34_0_34C,8779,34,true,1585435639,216,0,279.9,14484,277.04,282.04,False,0,43.70467,-79.3990366
34_0_34C,8779,34,true,1585435669,216,0,279.9,14484,277.04,282.04,False,0,43.70467,-79.3990366
34_0_34C,8779,34,true,1585435670,216,0,279.9,14484,277.04,282.04,False,0,43.70467,-79.3990366
34_0_34C,8779,34,true,1585435699,216,0,279.9,14484,277.04,282.04,False,0,43.70467,-79.3990366
34_0_34C,8779,34,true,1585435700,216,0,279.9,14484,277.04,282.04,False,0,43.70467,-79.3990366
34_0_34C,8779,34,true,1585435729,216,0,279.9,14484,277.04,282.04,False,0,43.70467,-79.3990366
34_0_34C,8779,34,true,1585435730,216,0,279.9,14484,277.04,282.04,False,0,43.70467,-79.3990366
34_0_34C,8779,34,true,1585435759,216,0,279.9,14484,277.04,282.04,False,0,43.70467,-79.3990366
34_0_34C,8779,34,true,1585435760,216,0,279.9,14484,277.04,282.04,False,0,43.70467,-79.3990366
34_0_34C,8779,34,true,1585435789,65,12,279.9,14484,277.04,282.04,False,0,43.7047615,-79.3984985
34_0_34C,8779,34,true,1585435790,65,12,279.9,14484,277.04,282.04,False,0,43.7047615,-79.3984985
34_0_34C,8779,34,true,1585435819,216,0,279.9,14484,277.04,282.04,False,0,43.7047615,-79.3984985
34_0_34C,8779,34,true,1585435820,216,0,279.9,14484,277.04,282.04,False,0,43.7047615,-79.3984985
34_0_34C,8779,34,true,1585435849,216,0,279.9,14484,277.04,282.04,False,0,43.7047615,-79.3984985
34_0_34C,8779,34,true,1585435850,216,0,279.9,14484,277.04,282.04,False,0,43.7047615,-79.3984985
34_0_34C,8779,34,true,1585435879,216,0,279.9,14484,277.04,282.04,False,0,43.7047615,-79.3984985
34_0_34C,8779,34,true,1585435880,216,0,279.9,14484,277.04,282.04,False,0,43.7047615,-79.3984985
34_0_34C,8779,34,true,1585435910,282,15,279.91,14484,277.04,282.04,False,0,43.7053239,-79.3987404
34_0_34C,8779,34,true,1585435909,282,15,279.91,14484,277.04,282.04,False,0,43.7053239,-79.3987404
34_0_34C,8779,34,true,1585435939,353,14,279.91,14484,277.04,282.04,False,0,43.7057652,-79.4000777
34_0_34C,8779,34,true,1585435970,344,2,279.87,14484,277.04,282.04,False,0,43.7059269,-79.4000884
34_0_34C,8779,34,true,1585435969,344,2,279.87,14484,277.04,282.04,False,0,43.7059269,-79.4000884
34_0_34C,8779,34,true,1585435999,74,17,279.87,14484,277.04,282.04,False,0,43.7066011,-79.3989843
34_0_34C,8779,34,true,1585436000,74,17,279.87,14484,277.04,282.04,False,0,43.7066011,-79.3989843
34_0_34C,8779,34,true,1585436029,69,20,279.87,14484,277.04,282.04,False,0,43.7070781,-79.3966217
34_0_34C,8779,34,true,1585436030,69,20,279.87,14484,277.04,282.04,False,0,43.7070781,-79.3966217
34_0_34C,8779,34,true,1585436059,76,0,279.87,14484,277.04,282.04,False,0,43.7071629,-79.3959421
34_0_34C,8779,34,true,1585436060,76,0,279.87,14484,277.04,282.04,False,0,43.7071629,-79.3959421
34_0_34C,8779,34,true,1585436089,79,17,279.9,14484,277.04,282.04,False,0,43.7076685,-79.3935746
34_0_34C,8779,34,true,1585436090,79,17,279.9,14484,277.04,282.04,False,0,43.7076685,-79.3935746
34_0_34C,8779,34,true,1585436119,70,21,279.9,14484,277.04,282.04,False,0,43.7078304,-79.3927491
34_0_34C,8779,34,true,1585436120,70,21,279.9,14484,277.04,282.04,False,0,43.7078304,-79.3927491
34_0_34C,8779,34,true,1585436150,74,10,279.9,14484,277.04,282.04,False,0,43.7082801,-79.3907627
34_0_34C,8779,34,true,1585436149,74,10,279.9,14484,277.04,282.04,False,0,43.7082801,-79.3907627
34_0_34C,8779,34,true,1585436180,74,0,279.9,14484,277.04,282.04,False,0,43.7082914,-79.390709
34_0_34C,8779,34,true,1585436179,74,0,279.9,14484,277.04,282.04,False,0,43.7082914,-79.390709
