dir,id,route,predable,time,hdg,spd,temp,vis,t_min,t_max,snow,rain,lat,lon
34_0_34C,8929,34,true,1585438190,216,0,279.73,14484,278.15,281.48,False,0,43.7211433,-79.2914983
34_0_34C,8929,34,true,1585438220,216,0,279.73,14484,278.15,281.48,False,0,43.7211433,-79.2914983
34_0_34C,8929,34,true,1585438221,216,0,279.73,14484,278.15,281.48,False,0,43.7211433,-79.2914983
34_0_34C,8929,34,true,1585438250,216,0,279.79,14484,278.15,281.48,False,0,43.7211433,-79.2914983
34_0_34C,8929,34,true,1585438251,216,0,279.79,14484,278.15,281.48,False,0,43.7211433,-79.2914983
34_0_34C,8929,34,true,1585438281,216,0,279.79,14484,278.15,281.48,False,0,43.7211433,-79.2914983
34_0_34C,8929,34,true,1585438280,216,0,279.79,14484,278.15,281.48,False,0,43.7211433,-79.2914983
34_0_34C,8929,34,true,1585438310,216,0,279.79,14484,278.15,281.48,False,0,43.7211349,-79.291465
34_0_34C,8929,34,true,1585438340,216,0,279.79,14484,278.15,281.48,False,0,43.7211349,-79.291465
34_0_34C,8929,34,true,1585438370,216,0,279.79,14484,278.15,281.48,False,0,43.7211349,-79.291465
34_0_34C,8929,34,true,1585438400,216,0,279.79,14484,278.15,281.48,False,0,43.7211349,-79.291465
34_0_34C,8929,34,true,1585438401,216,0,279.79,14484,278.15,281.48,False,0,43.7211349,-79.291465
34_0_34C,8929,34,true,1585438433,216,1,279.79,14484,278.15,281.48,False,0,43.7208933,-79.2914933
34_0_34C,8929,34,true,1585438432,216,1,279.79,14484,278.15,281.48,False,0,43.7208933,-79.2914933
34_0_34C,8929,34,true,1585438460,338,12,279.79,14484,278.15,281.48,False,0,43.721195,-79.2911633
34_0_34C,8929,34,true,1585438461,338,12,279.79,14484,278.15,281.48,False,0,43.721195,-79.2911633
34_0_34C,8929,34,true,1585438490,339,11,279.79,14484,278.15,281.48,False,0,43.72155,-79.2913766
34_0_34C,8929,34,true,1585438520,243,22,279.79,14484,278.15,281.48,False,0,43.7215883,-79.292855
34_0_34C,8929,34,true,1585438550,216,0,279.79,14484,278.15,281.48,False,0,43.7213116,-79.2931466
34_0_34C,8929,34,true,1585438551,216,0,279.79,14484,278.15,281.48,False,0,43.7213116,-79.2931466
34_0_34C,8929,34,true,1585438580,216,0,279.79,14484,278.15,281.48,False,0,43.7213116,-79.2931466
34_0_34C,8929,34,true,1585438581,216,0,279.79,14484,278.15,281.48,False,0,43.7213116,-79.2931466
34_0_34C,8929,34,true,1585438611,216,0,279.79,14484,278.15,281.48,False,0,43.7213116,-79.2931466
34_0_34C,8929,34,true,1585438610,216,0,279.79,14484,278.15,281.48,False,0,43.7213116,-79.2931466
34_0_34C,8929,34,true,1585438640,216,0,279.79,14484,278.15,281.48,False,0,43.7213116,-79.2931466
34_0_34C,8929,34,true,1585438670,216,0,279.79,14484,278.15,281.48,False,0,43.7213116,-79.2931466
34_0_34C,8929,34,true,1585438700,216,0,279.79,14484,278.15,281.48,False,0,43.7213116,-79.2931466
34_0_34C,8929,34,true,1585438701,216,0,279.79,14484,278.15,281.48,False,0,43.7213116,-79.2931466
34_0_34C,8929,34,true,1585438730,216,0,279.79,14484,278.15,281.48,False,0,43.7213116,-79.2931466
34_0_34C,8929,34,true,1585438731,216,0,279.79,14484,278.15,281.48,False,0,43.7213116,-79.2931466
34_0_34C,8929,34,true,1585438761,160,20,279.79,14484,278.15,281.48,False,0,43.7208666,-79.2931216
34_0_34C,8929,34,true,1585439363,343,17,279.58,14484,277.59,281.48,False,0,43.7266116,-79.2913466
34_0_34C,8929,34,true,1585439391,216,0,279.58,14484,277.59,281.48,False,0,43.72676,-79.2914266
34_0_34C,8929,34,true,1585439390,216,0,279.58,14484,277.59,281.48,False,0,43.72676,-79.2914266
34_0_34C,8929,34,true,1585439420,254,13,279.58,14484,277.59,281.48,False,0,43.7268216,-79.2927766
34_0_34C,8929,34,true,1585439421,254,13,279.58,14484,277.59,281.48,False,0,43.7268216,-79.2927766
34_0_34C,8929,34,true,1585439451,216,0,279.58,14484,277.59,281.48,False,0,43.7268066,-79.2928533
34_0_34C,8929,34,true,1585439450,216,0,279.58,14484,277.59,281.48,False,0,43.7268066,-79.2928533
34_0_34C,8929,34,true,1585439481,216,0,279.58,14484,277.59,281.48,False,0,43.7268066,-79.2928533
34_0_34C,8929,34,true,1585439480,216,0,279.58,14484,277.59,281.48,False,0,43.7268066,-79.2928533
34_0_34C,8929,34,true,1585439511,251,19,279.58,14484,277.59,281.48,False,0,43.7267283,-79.2931583
34_0_34C,8929,34,true,1585439510,251,19,279.58,14484,277.59,281.48,False,0,43.7267283,-79.2931583
34_0_34C,8929,34,true,1585439541,253,26,279.56,14484,277.59,281.15,False,0,43.7260433,-79.2962566
34_0_34C,8929,34,true,1585439540,253,26,279.56,14484,277.59,281.15,False,0,43.7260433,-79.2962566
34_0_34C,8929,34,true,1585439571,253,14,279.56,14484,277.59,281.15,False,0,43.7256283,-79.298115
34_0_34C,8929,34,true,1585439570,253,14,279.56,14484,277.59,281.15,False,0,43.7256283,-79.298115
34_0_34C,8929,34,true,1585439600,253,28,279.56,14484,277.59,281.15,False,0,43.72545,-79.29892
34_0_34C,8929,34,true,1585439601,253,28,279.56,14484,277.59,281.15,False,0,43.72545,-79.29892
34_0_34C,8929,34,true,1585440171,217,21,279.42,14484,277.59,281.15,False,0,43.7192192,-79.3279571
34_0_34C,8929,34,true,1585440170,217,21,279.42,14484,277.59,281.15,False,0,43.7192192,-79.3279571
34_0_34C,8929,34,true,1585440201,249,20,279.42,14484,277.59,281.15,False,0,43.7184562,-79.3310852
34_0_34C,8929,34,true,1585440200,249,20,279.42,14484,277.59,281.15,False,0,43.7184562,-79.3310852
34_0_34C,8929,34,true,1585440231,157,13,279.42,14484,277.59,281.15,False,0,43.7167282,-79.3304672
34_0_34C,8929,34,true,1585440261,95,21,279.42,14484,277.59,281.15,False,0,43.7153244,-79.3292846
34_0_34C,8929,34,true,1585440260,95,21,279.42,14484,277.59,281.15,False,0,43.7153244,-79.3292846
34_0_34C,8929,34,true,1585440290,70,4,279.42,14484,277.59,281.15,False,0,43.715496,-79.3282318
34_0_34C,8929,34,true,1585440291,70,4,279.42,14484,277.59,281.15,False,0,43.715496,-79.3282318
34_0_34C,8929,34,true,1585443262,97,13,279.01,14484,277.59,280.37,False,0,43.7045269,-79.3992996
34_0_34C,8929,34,true,1585443291,95,0,279.01,14484,277.59,280.37,False,0,43.704261,-79.3986816
34_0_34C,8929,34,true,1585443322,95,0,279.01,14484,277.59,280.37,False,0,43.704261,-79.3986816
34_0_34C,8929,34,true,1585443321,95,0,279.01,14484,277.59,280.37,False,0,43.704261,-79.3986816
34_0_34C,8929,34,true,1585443352,95,0,279.01,14484,277.59,280.37,False,0,43.704261,-79.3986816
34_0_34C,8929,34,true,1585443351,95,0,279.01,14484,277.59,280.37,False,0,43.704261,-79.3986816
34_0_34C,8929,34,true,1585443382,95,0,279.01,14484,277.59,280.37,False,0,43.704261,-79.3986816
34_0_34C,8929,34,true,1585443381,95,0,279.01,14484,277.59,280.37,False,0,43.704261,-79.3986816
34_0_34C,8929,34,true,1585443411,95,0,279.01,14484,277.59,280.37,False,0,43.704261,-79.3986816
34_0_34C,8929,34,true,1585443441,95,0,279.01,14484,277.59,280.37,False,0,43.704261,-79.3986816
34_0_34C,8929,34,true,1585443442,95,0,279.01,14484,277.59,280.37,False,0,43.704261,-79.3986816
34_0_34C,8929,34,true,1585443471,95,0,279.01,14484,277.59,280.37,False,0,43.704261,-79.3986816
34_0_34C,8929,34,true,1585443472,95,0,279.01,14484,277.59,280.37,False,0,43.704261,-79.3986816
34_0_34C,8929,34,true,1585443502,95,0,279.01,14484,277.59,280.37,False,0,43.704261,-79.3986816
34_0_34C,8929,34,true,1585443501,95,0,279.01,14484,277.59,280.37,False,0,43.704261,-79.3986816
34_0_34C,8929,34,true,1585443532,95,0,279.01,14484,277.59,280.37,False,0,43.704261,-79.3986816
34_0_34C,8929,34,true,1585443531,95,0,279.01,14484,277.59,280.37,False,0,43.704261,-79.3986816
34_0_34C,8929,34,true,1585443561,95,0,279.01,14484,277.59,280.37,False,0,43.704261,-79.3986816
34_0_34C,8929,34,true,1585443562,95,0,279.01,14484,277.59,280.37,False,0,43.704261,-79.3986816
34_0_34C,8929,34,true,1585443595,292,15,279.02,14484,277.59,280.37,False,0,43.7054566,-79.3988
34_0_34C,8929,34,true,1585443594,292,15,279.02,14484,277.59,280.37,False,0,43.7054566,-79.3988
34_0_34C,8929,34,true,1585443621,1,16,279.02,14484,277.59,280.37,False,0,43.7058563,-79.4000854
34_0_34C,8929,34,true,1585443622,1,16,279.02,14484,277.59,280.37,False,0,43.7058563,-79.4000854
34_0_34C,8929,34,true,1585443652,32,11,278.99,14484,277.59,280.37,False,0,43.7062301,-79.4001083
34_0_34C,8929,34,true,1585443651,32,11,278.99,14484,277.59,280.37,False,0,43.7062301,-79.4001083
34_0_34C,8929,34,true,1585443682,76,0,278.99,14484,277.59,280.37,False,0,43.7066802,-79.39859
34_0_34C,8929,34,true,1585443681,76,0,278.99,14484,277.59,280.37,False,0,43.7066802,-79.39859
34_0_34C,8929,34,true,1585443712,76,0,278.99,14484,277.59,280.37,False,0,43.7066802,-79.39859
34_0_34C,8929,34,true,1585443711,76,0,278.99,14484,277.59,280.37,False,0,43.7066802,-79.39859
34_0_34C,8929,34,true,1585443742,77,13,278.99,14484,277.59,280.37,False,0,43.7067756,-79.3981094
34_0_34C,8929,34,true,1585443741,77,13,278.99,14484,277.59,280.37,False,0,43.7067756,-79.3981094
34_0_34C,8929,34,true,1585443772,74,20,278.99,14484,277.59,280.37,False,0,43.7071456,-79.39608
34_0_34C,8929,34,true,1585443771,74,20,278.99,14484,277.59,280.37,False,0,43.7071456,-79.39608
34_0_34C,8929,34,true,1585443802,74,20,278.99,14484,277.59,280.37,False,0,43.7073124,-79.3953702
34_0_34C,8929,34,true,1585443801,74,20,278.99,14484,277.59,280.37,False,0,43.7073124,-79.3953702
34_0_34C,8929,34,true,1585443831,74,0,278.99,14484,277.59,280.37,False,0,43.707756,-79.3929367
34_0_34C,8929,34,true,1585443832,74,0,278.99,14484,277.59,280.37,False,0,43.707756,-79.3929367
34_0_34C,8929,34,true,1585443862,74,0,278.99,14484,277.59,280.37,False,0,43.707756,-79.3929367
34_0_34C,8929,34,true,1585443861,74,0,278.99,14484,277.59,280.37,False,0,43.707756,-79.3929367
34_0_34C,8929,34,true,1585443891,69,21,278.99,14484,277.59,280.37,False,0,43.7078056,-79.3928116
34_0_34C,8929,34,true,1585443892,69,21,278.99,14484,277.59,280.37,False,0,43.7078056,-79.3928116
34_0_34C,8929,34,true,1585443922,75,10,278.99,14484,277.59,280.37,False,0,43.7083139,-79.3906015
34_0_34C,8929,34,true,1585443921,75,10,278.99,14484,277.59,280.37,False,0,43.7083139,-79.3906015
34_0_34C,8929,34,true,1585443952,74,0,278.99,14484,277.59,280.37,False,0,43.7083177,-79.3905836
34_0_34C,8929,34,true,1585443951,74,0,278.99,14484,277.59,280.37,False,0,43.7083177,-79.3905836
34_0_34C,8929,34,true,1585443982,74,0,278.99,14484,277.59,280.37,False,0,43.7083177,-79.3905836
34_0_34C,8929,34,true,1585443981,74,0,278.99,14484,277.59,280.37,False,0,43.7083177,-79.3905836
34_0_34C,8929,34,true,1585444012,71,21,278.99,14484,277.59,280.37,False,0,43.7086306,-79.3889527
34_0_34C,8929,34,true,1585444011,71,21,278.99,14484,277.59,280.37,False,0,43.7086306,-79.3889527
34_0_34C,8929,34,true,1585444042,74,0,278.99,14484,277.59,280.37,False,0,43.7088394,-79.3876647
34_0_34C,8929,34,true,1585444041,74,0,278.99,14484,277.59,280.37,False,0,43.7088394,-79.3876647
34_0_34C,8929,34,true,1585444072,73,31,278.99,14484,277.59,280.37,False,0,43.7091708,-79.3861428
34_0_34C,8929,34,true,1585444071,73,31,278.99,14484,277.59,280.37,False,0,43.7091708,-79.3861428
34_0_34C,8929,34,true,1585444102,72,32,279,14484,277.59,280.37,False,0,43.7100044,-79.3821311
34_0_34C,8929,34,true,1585444101,72,32,279,14484,277.59,280.37,False,0,43.7100044,-79.3821311
34_0_34C,8929,34,true,1585444131,75,23,279,14484,277.59,280.37,False,0,43.7107482,-79.3784186
34_0_34C,8929,34,true,1585444132,75,23,279,14484,277.59,280.37,False,0,43.7107482,-79.3784186
34_0_34C,8929,34,true,1585444162,75,29,279,14484,277.59,280.37,False,0,43.7112142,-79.3759548
34_0_34C,8929,34,true,1585444161,75,29,279,14484,277.59,280.37,False,0,43.7112142,-79.3759548
34_0_34C,8929,34,true,1585444191,74,34,279.02,14484,277.59,280.37,False,0,43.7120816,-79.3720904
34_0_34C,8929,34,true,1585444192,74,34,279.02,14484,277.59,280.37,False,0,43.7120816,-79.3720904
34_0_34C,8929,34,true,1585444222,74,37,279.02,14484,277.59,280.37,False,0,43.7128601,-79.3679282
34_0_34C,8929,34,true,1585444221,74,37,279.02,14484,277.59,280.37,False,0,43.7128601,-79.3679282
34_0_34C,8929,34,true,1585444252,74,21,279.02,14484,277.59,280.37,False,0,43.7134108,-79.3652468
34_0_34C,8929,34,true,1585444282,75,0,279.03,14484,277.59,280.37,False,0,43.7135105,-79.3649318
34_0_34C,8929,34,true,1585444281,75,0,279.03,14484,277.59,280.37,False,0,43.7135105,-79.3649318
34_0_34C,8929,34,true,1585444312,76,34,279.03,14484,277.59,280.37,False,0,43.7139717,-79.3623723
34_0_34C,8929,34,true,1585444311,76,34,279.03,14484,277.59,280.37,False,0,43.7139717,-79.3623723
34_0_34C,8929,34,true,1585444342,73,24,279.03,14484,277.59,280.37,False,0,43.7145485,-79.3597512
34_0_34C,8929,34,true,1585444341,73,24,279.03,14484,277.59,280.37,False,0,43.7145485,-79.3597512
34_0_34C,8929,34,true,1585444372,77,29,279.02,14484,277.59,280.37,False,0,43.7153323,-79.3564205
34_0_34C,8929,34,true,1585444371,77,29,279.02,14484,277.59,280.37,False,0,43.7153323,-79.3564205
34_0_34C,8929,34,true,1585444401,68,36,279.02,14484,277.59,280.37,False,0,43.7162132,-79.3526535
34_0_34C,8929,34,true,1585444402,68,36,279.02,14484,277.59,280.37,False,0,43.7162132,-79.3526535
34_0_34C,8929,34,true,1585444432,63,38,279.02,14484,277.59,280.37,False,0,43.7175012,-79.3485322
34_0_34C,8929,34,true,1585444462,65,33,279.03,14484,277.59,280.37,False,0,43.718742,-79.3444491
34_0_34C,8929,34,true,1585444461,65,33,279.03,14484,277.59,280.37,False,0,43.718742,-79.3444491
34_0_34C,8929,34,true,1585444493,67,41,279.03,14484,277.59,280.37,False,0,43.7199675,-79.3405238
34_0_34C,8929,34,true,1585444523,66,32,279.03,14484,277.59,280.37,False,0,43.7215906,-79.3390385
34_0_34C,8929,34,true,1585444553,198,27,279.03,14484,277.59,280.37,False,0,43.7208866,-79.3357066
34_0_34C,8929,34,true,1585444552,198,27,279.03,14484,277.59,280.37,False,0,43.7208866,-79.3357066
34_0_34C,8929,34,true,1585444643,69,0,279.03,14484,277.59,280.37,False,0,43.7204322,-79.3390502
34_0_34C,8929,34,true,1585444642,69,0,279.03,14484,277.59,280.37,False,0,43.7204322,-79.3390502
34_0_34C,8929,34,true,1585444673,344,27,279.03,14484,277.59,280.37,False,0,43.7210197,-79.339035
34_0_34C,8929,34,true,1585444672,344,27,279.03,14484,277.59,280.37,False,0,43.7210197,-79.339035
34_0_34C,8929,34,true,1585444703,79,24,279.03,14484,277.59,280.37,False,0,43.7230834,-79.3391113
34_0_34C,8929,34,true,1585444702,79,24,279.03,14484,277.59,280.37,False,0,43.7230834,-79.3391113
34_0_34C,8929,34,true,1585444733,74,36,279.03,14484,277.59,280.37,False,0,43.7235794,-79.3359069
34_0_34C,8929,34,true,1585444732,74,36,279.03,14484,277.59,280.37,False,0,43.7235794,-79.3359069
34_0_34C,8929,34,true,1585444763,59,37,279.07,14484,278.15,280.37,False,0,43.726284,-79.332405
34_0_34C,8929,34,true,1585444762,59,37,279.07,14484,278.15,280.37,False,0,43.726284,-79.332405
34_0_34C,8929,34,true,1585444793,68,40,279.07,14484,278.15,280.37,False,0,43.727066,-79.3286819
34_0_34C,8929,34,true,1585444822,356,33,279.07,14484,278.15,280.37,False,0,43.7284851,-79.3283157
34_0_34C,8929,34,true,1585444823,356,33,279.07,14484,278.15,280.37,False,0,43.7284851,-79.3283157
34_0_34C,8929,34,true,1585444852,254,16,279.07,14484,278.15,280.37,False,0,43.7302818,-79.3284606
34_0_34C,8929,34,true,1585444853,254,16,279.07,14484,278.15,280.37,False,0,43.7302818,-79.3284606
34_0_34C,8929,34,true,1585444883,170,36,279.07,14484,278.15,280.37,False,0,43.7282981,-79.3283157
34_0_34C,8929,34,true,1585444882,170,36,279.07,14484,278.15,280.37,False,0,43.7282981,-79.3283157
34_0_34C,8929,34,true,1585444913,169,32,279.07,14484,278.15,280.37,False,0,43.726593,-79.3275451
34_0_34C,8929,34,true,1585444943,148,28,279.03,14484,277.59,280.37,False,0,43.7240676,-79.3250808
34_0_34C,8929,34,true,1585444973,172,24,278.99,14484,277.59,280.37,False,0,43.7234344,-79.3245544
34_0_34C,8929,34,true,1585445005,192,46,279.03,14484,277.59,280.37,False,0,43.7213897,-79.3279037
34_0_34C,8929,34,true,1585445004,192,46,279.03,14484,277.59,280.37,False,0,43.7213897,-79.3279037
34_0_34C,8929,34,true,1585445032,227,22,278.99,14484,277.59,280.37,False,0,43.7192192,-79.3279571
34_0_34C,8929,34,true,1585445033,227,22,278.99,14484,277.59,280.37,False,0,43.7192192,-79.3279571
34_0_34C,8929,34,true,1585445062,157,24,278.99,14484,277.59,280.37,False,0,43.7180137,-79.3312301
34_0_34C,8929,34,true,1585445063,157,24,278.99,14484,277.59,280.37,False,0,43.7180137,-79.3312301
34_0_34C,8929,34,true,1585445093,155,26,278.99,14484,277.59,280.37,False,0,43.7163925,-79.3302917
34_0_34C,8929,34,true,1585445092,155,26,278.99,14484,277.59,280.37,False,0,43.7163925,-79.3302917
34_0_34C,8929,34,true,1585445123,68,30,278.99,14484,277.59,280.37,False,0,43.715435,-79.3286895
34_0_34C,8929,34,true,1585445122,68,30,278.99,14484,277.59,280.37,False,0,43.715435,-79.3286895
34_0_34C,8929,34,true,1585445153,158,26,279.02,14484,277.59,280.37,False,0,43.7135963,-79.3269348
34_0_34C,8929,34,true,1585447133,86,12,278.83,14484,277.59,279.82,False,0,43.7043805,-79.399159
34_0_34C,8929,34,true,1585447164,95,0,278.83,14484,277.59,279.82,False,0,43.7042548,-79.3986129
34_0_34C,8929,34,true,1585447163,95,0,278.83,14484,277.59,279.82,False,0,43.7042548,-79.3986129
34_0_34C,8929,34,true,1585447196,95,0,278.83,14484,277.59,279.82,False,0,43.7042548,-79.3986129
34_0_34C,8929,34,true,1585447195,95,0,278.83,14484,277.59,279.82,False,0,43.7042548,-79.3986129
34_0_34C,8929,34,true,1585447223,95,0,278.83,14484,277.59,279.82,False,0,43.7042548,-79.3986129
34_0_34C,8929,34,true,1585447224,95,0,278.83,14484,277.59,279.82,False,0,43.7042548,-79.3986129
34_0_34C,8929,34,true,1585447254,95,0,278.83,14484,277.59,279.82,False,0,43.7042548,-79.3986129
34_0_34C,8929,34,true,1585447253,95,0,278.83,14484,277.59,279.82,False,0,43.7042548,-79.3986129
34_0_34C,8929,34,true,1585447283,95,0,278.83,14484,277.59,279.82,False,0,43.7042548,-79.3986129
34_0_34C,8929,34,true,1585447284,95,0,278.83,14484,277.59,279.82,False,0,43.7042548,-79.3986129
34_0_34C,8929,34,true,1585447313,95,0,278.81,14484,277.59,279.82,False,0,43.7042548,-79.3986129
34_0_34C,8929,34,true,1585447314,95,0,278.81,14484,277.59,279.82,False,0,43.7042548,-79.3986129
34_0_34C,8929,34,true,1585447343,95,0,278.81,14484,277.59,279.82,False,0,43.7042548,-79.3986129
34_0_34C,8929,34,true,1585447344,95,0,278.81,14484,277.59,279.82,False,0,43.7042548,-79.3986129
34_0_34C,8929,34,true,1585447374,95,0,278.81,14484,277.59,279.82,False,0,43.7042548,-79.3986129
34_0_34C,8929,34,true,1585447373,95,0,278.81,14484,277.59,279.82,False,0,43.7042548,-79.3986129
34_0_34C,8929,34,true,1585447404,95,0,278.81,14484,277.59,279.82,False,0,43.7042548,-79.3986129
34_0_34C,8929,34,true,1585447403,95,0,278.81,14484,277.59,279.82,False,0,43.7042548,-79.3986129
34_0_34C,8929,34,true,1585447434,95,0,278.81,14484,277.59,279.82,False,0,43.7042548,-79.3986129
34_0_34C,8929,34,true,1585447464,95,0,278.81,14484,277.59,279.82,False,0,43.7042548,-79.3986129
34_0_34C,8929,34,true,1585447463,95,0,278.81,14484,277.59,279.82,False,0,43.7042548,-79.3986129
34_0_34C,8929,34,true,1585447493,95,0,278.81,14484,277.59,279.82,False,0,43.7042548,-79.3986129
34_0_34C,8929,34,true,1585447494,95,0,278.81,14484,277.59,279.82,False,0,43.7042548,-79.3986129
34_0_34C,8929,34,true,1585447525,95,0,278.81,14484,277.59,279.82,False,0,43.7042548,-79.3986129
34_0_34C,8929,34,true,1585447526,95,0,278.81,14484,277.59,279.82,False,0,43.7042548,-79.3986129
34_0_34C,8929,34,true,1585447553,95,0,278.81,14484,277.59,279.82,False,0,43.7042548,-79.3986129
34_0_34C,8929,34,true,1585447554,95,0,278.81,14484,277.59,279.82,False,0,43.7042548,-79.3986129
34_0_34C,8929,34,true,1585447584,95,0,278.81,14484,277.59,279.82,False,0,43.7042548,-79.3986129
34_0_34C,8929,34,true,1585447583,95,0,278.81,14484,277.59,279.82,False,0,43.7042548,-79.3986129
34_0_34C,8929,34,true,1585447613,95,0,278.81,14484,277.59,279.82,False,0,43.7042548,-79.3986129
34_0_34C,8929,34,true,1585447614,95,0,278.81,14484,277.59,279.82,False,0,43.7042548,-79.3986129
34_0_34C,8929,34,true,1585447644,95,0,278.81,14484,277.59,279.82,False,0,43.7042548,-79.3986129
34_0_34C,8929,34,true,1585447643,95,0,278.81,14484,277.59,279.82,False,0,43.7042548,-79.3986129
34_0_34C,8929,34,true,1585447673,95,0,278.81,14484,277.59,279.82,False,0,43.7042548,-79.3986129
34_0_34C,8929,34,true,1585447674,95,0,278.81,14484,277.59,279.82,False,0,43.7042548,-79.3986129
34_0_34C,8929,34,true,1585447703,95,0,278.81,14484,277.59,279.82,False,0,43.7042548,-79.3986129
34_0_34C,8929,34,true,1585447704,95,0,278.81,14484,277.59,279.82,False,0,43.7042548,-79.3986129
34_0_34C,8929,34,true,1585447734,95,0,278.81,14484,277.59,279.82,False,0,43.7042548,-79.3986129
34_0_34C,8929,34,true,1585447733,95,0,278.81,14484,277.59,279.82,False,0,43.7042548,-79.3986129
34_0_34C,8929,34,true,1585447764,95,0,278.81,14484,277.59,279.82,False,0,43.7042548,-79.3986129
34_0_34C,8929,34,true,1585447794,95,0,278.81,14484,277.59,279.82,False,0,43.7042548,-79.3986129
34_0_34C,8929,34,true,1585447793,95,0,278.81,14484,277.59,279.82,False,0,43.7042548,-79.3986129
34_0_34C,8929,34,true,1585447823,95,0,278.81,14484,277.59,279.82,False,0,43.7042548,-79.3986129
34_0_34C,8929,34,true,1585447824,95,0,278.81,14484,277.59,279.82,False,0,43.7042548,-79.3986129
34_0_34C,8929,34,true,1585447854,95,0,278.81,14484,277.59,279.82,False,0,43.7042548,-79.3986129
34_0_34C,8929,34,true,1585447884,95,0,278.81,14484,277.59,279.82,False,0,43.7042548,-79.3986129
34_0_34C,8929,34,true,1585447914,95,0,278.81,14484,277.59,279.82,False,0,43.7042548,-79.3986129
34_0_34C,8929,34,true,1585447913,95,0,278.81,14484,277.59,279.82,False,0,43.7042548,-79.3986129
34_0_34C,8929,34,true,1585447944,95,0,278.81,14484,277.59,279.82,False,0,43.7042548,-79.3986129
34_0_34C,8929,34,true,1585447943,95,0,278.81,14484,277.59,279.82,False,0,43.7042548,-79.3986129
34_0_34C,8929,34,true,1585447973,95,0,278.81,14484,277.59,279.82,False,0,43.7042548,-79.3986129
34_0_34C,8929,34,true,1585447974,95,0,278.81,14484,277.59,279.82,False,0,43.7042548,-79.3986129
34_0_34C,8929,34,true,1585448003,95,0,278.81,14484,277.59,279.82,False,0,43.7042548,-79.3986129
34_0_34C,8929,34,true,1585448004,95,0,278.81,14484,277.59,279.82,False,0,43.7042548,-79.3986129
34_0_34C,8929,34,true,1585448033,95,0,278.81,14484,277.59,279.82,False,0,43.7042548,-79.3986129
34_0_34C,8929,34,true,1585448034,95,0,278.81,14484,277.59,279.82,False,0,43.7042548,-79.3986129
34_0_34C,8929,34,true,1585448061,95,0,278.81,14484,277.59,279.82,False,0,43.7042548,-79.3986129
34_0_34C,8929,34,true,1585448060,95,0,278.81,14484,277.59,279.82,False,0,43.7042548,-79.3986129
34_0_34C,8929,34,true,1585448091,95,0,278.81,14484,277.59,279.82,False,0,43.7042548,-79.3986129
34_0_34C,8929,34,true,1585448090,95,0,278.81,14484,277.59,279.82,False,0,43.7042548,-79.3986129
34_0_34C,8929,34,true,1585448121,95,0,278.81,14484,277.59,279.82,False,0,43.7042548,-79.3986129
34_0_34C,8929,34,true,1585448150,95,0,278.81,14484,277.59,279.82,False,0,43.7042548,-79.3986129
34_0_34C,8929,34,true,1585448151,95,0,278.81,14484,277.59,279.82,False,0,43.7042548,-79.3986129
34_0_34C,8929,34,true,1585448181,95,0,278.81,14484,277.59,279.82,False,0,43.7042548,-79.3986129
34_0_34C,8929,34,true,1585448211,95,0,278.81,14484,277.59,279.82,False,0,43.7042548,-79.3986129
34_0_34C,8929,34,true,1585448210,95,0,278.81,14484,277.59,279.82,False,0,43.7042548,-79.3986129
34_0_34C,8929,34,true,1585448241,95,0,278.81,14484,277.59,279.82,False,0,43.7042548,-79.3986129
34_0_34C,8929,34,true,1585448240,95,0,278.81,14484,277.59,279.82,False,0,43.7042548,-79.3986129
34_0_34C,8929,34,true,1585448271,95,0,278.81,14484,277.59,279.82,False,0,43.7042548,-79.3986129
34_0_34C,8929,34,true,1585448270,95,0,278.81,14484,277.59,279.82,False,0,43.7042548,-79.3986129
34_0_34C,8929,34,true,1585448301,95,0,278.81,14484,277.59,279.82,False,0,43.7042548,-79.3986129
34_0_34C,8929,34,true,1585448331,276,17,278.77,14484,277.59,279.82,False,0,43.7055166,-79.399015
34_0_34C,8929,34,true,1585448330,276,17,278.77,14484,277.59,279.82,False,0,43.7055166,-79.399015
34_0_34C,8929,34,true,1585448361,358,16,278.77,14484,277.59,279.82,False,0,43.7058563,-79.4000854
34_0_34C,8929,34,true,1585448360,358,16,278.77,14484,277.59,279.82,False,0,43.7058563,-79.4000854
34_0_34C,8929,34,true,1585448391,75,4,278.77,14484,277.59,279.82,False,0,43.7065849,-79.3990707
34_0_34C,8929,34,true,1585448420,74,28,278.77,14484,277.59,279.82,False,0,43.7068786,-79.3976364
34_0_34C,8929,34,true,1585448421,74,28,278.77,14484,277.59,279.82,False,0,43.7068786,-79.3976364
34_0_34C,8929,34,true,1585448451,73,29,278.8,14484,277.59,279.82,False,0,43.7074165,-79.3949966
34_0_34C,8929,34,true,1585448450,73,29,278.8,14484,277.59,279.82,False,0,43.7074165,-79.3949966
34_0_34C,8929,34,true,1585448481,74,0,278.77,14484,277.59,279.82,False,0,43.707756,-79.3929367
34_0_34C,8929,34,true,1585448480,74,0,278.77,14484,277.59,279.82,False,0,43.707756,-79.3929367
34_0_34C,8929,34,true,1585448510,74,0,278.77,14484,277.59,279.82,False,0,43.707756,-79.3929367
34_0_34C,8929,34,true,1585448511,74,0,278.77,14484,277.59,279.82,False,0,43.707756,-79.3929367
34_0_34C,8929,34,true,1585448541,77,19,278.77,14484,277.59,279.82,False,0,43.7081456,-79.3914118
34_0_34C,8929,34,true,1585448540,77,19,278.77,14484,277.59,279.82,False,0,43.7081456,-79.3914118
34_0_34C,8929,34,true,1585448571,73,21,278.77,14484,277.59,279.82,False,0,43.708513,-79.3895908
34_0_34C,8929,34,true,1585448570,73,21,278.77,14484,277.59,279.82,False,0,43.708513,-79.3895908
34_0_34C,8929,34,true,1585448604,74,0,278.77,14484,277.59,279.82,False,0,43.7087809,-79.3882268
34_0_34C,8929,34,true,1585448631,74,26,278.77,14484,277.59,279.82,False,0,43.7090134,-79.3869341
34_0_34C,8929,34,true,1585448630,74,26,278.77,14484,277.59,279.82,False,0,43.7090134,-79.3869341
34_0_34C,8929,34,true,1585448660,74,33,278.77,14484,277.59,279.82,False,0,43.7098384,-79.3829535
34_0_34C,8929,34,true,1585448661,74,33,278.77,14484,277.59,279.82,False,0,43.7098384,-79.3829535
34_0_34C,8929,34,true,1585448691,73,36,278.77,14484,277.59,279.82,False,0,43.7104847,-79.3795838
34_0_34C,8929,34,true,1585448721,74,14,278.77,14484,277.59,279.82,False,0,43.7111939,-79.3760385
34_0_34C,8929,34,true,1585448751,74,33,278.77,12874,277.59,279.82,False,0,43.7119586,-79.372719
34_0_34C,8929,34,true,1585448781,74,32,278.77,12874,277.59,279.82,False,0,43.7125298,-79.3695856
34_0_34C,8929,34,true,1585448811,74,0,278.77,12874,277.59,279.82,False,0,43.7129699,-79.3673082
34_0_34C,8929,34,true,1585448810,74,0,278.77,12874,277.59,279.82,False,0,43.7129699,-79.3673082
34_0_34C,8929,34,true,1585448844,72,12,278.77,12874,277.59,279.82,False,0,43.7130363,-79.3671478
34_0_34C,8929,34,true,1585448843,72,12,278.77,12874,277.59,279.82,False,0,43.7130363,-79.3671478
34_0_34C,8929,34,true,1585448871,75,3,278.77,12874,277.59,279.82,False,0,43.7135211,-79.3648923
34_0_34C,8929,34,true,1585448901,74,34,278.77,12874,277.59,279.82,False,0,43.7138194,-79.3631275
34_0_34C,8929,34,true,1585448931,72,26,278.77,12874,277.59,279.82,False,0,43.7145509,-79.3597472
34_0_34C,8929,34,true,1585448961,71,35,278.78,12874,277.59,279.82,False,0,43.7151307,-79.3574965
34_0_34C,8929,34,true,1585448991,68,34,278.78,12874,277.59,279.82,False,0,43.716234,-79.3525841
34_0_34C,8929,34,true,1585449021,64,37,278.78,12874,277.59,279.82,False,0,43.7174762,-79.3486189
34_0_34C,8929,34,true,1585449051,65,37,278.84,12874,277.59,279.82,False,0,43.7187293,-79.3444872
34_0_34C,8929,34,true,1585449081,72,35,278.84,12874,277.59,279.82,False,0,43.7197805,-79.3410925
34_0_34C,8929,34,true,1585449112,66,19,278.84,12874,277.59,279.82,False,0,43.7209027,-79.3389943
34_0_34C,8929,34,true,1585449111,66,19,278.84,12874,277.59,279.82,False,0,43.7209027,-79.3389943
34_0_34C,8929,34,true,1585449141,100,13,278.84,12874,277.59,279.82,False,0,43.7211866,-79.3358333
34_0_34C,8929,34,true,1585449261,69,0,278.84,12874,277.59,279.82,False,0,43.7204322,-79.3390502
34_0_34C,8929,34,true,1585449291,341,20,278.84,12874,277.59,279.82,False,0,43.7206687,-79.3389205
34_0_34C,8929,34,true,1585449321,348,29,278.84,12874,277.59,279.82,False,0,43.7225646,-79.3394699
34_0_34C,8929,34,true,1585449351,78,32,278.84,12874,277.59,279.82,False,0,43.7233924,-79.3370132
34_0_34C,8929,34,true,1585449352,78,32,278.84,12874,277.59,279.82,False,0,43.7233924,-79.3370132
34_0_34C,8929,34,true,1585449381,31,39,278.78,12874,277.59,279.82,False,0,43.7248382,-79.3340682
34_0_34C,8929,34,true,1585449382,31,39,278.78,12874,277.59,279.82,False,0,43.7248382,-79.3340682
34_0_34C,8929,34,true,1585449411,71,40,278.8,12874,277.59,279.82,False,0,43.7269477,-79.3296127
34_0_34C,8929,34,true,1585449412,71,40,278.8,12874,277.59,279.82,False,0,43.7269477,-79.3296127
34_0_34C,8929,34,true,1585449441,328,30,278.8,12874,277.59,279.82,False,0,43.7277565,-79.3280181
34_0_34C,8929,34,true,1585449471,358,28,278.8,12874,277.59,279.82,False,0,43.7297058,-79.3284149
34_0_34C,8929,34,true,1585449472,358,28,278.8,12874,277.59,279.82,False,0,43.7297058,-79.3284149
34_0_34C,8929,34,true,1585449501,177,17,278.8,12874,277.59,279.82,False,0,43.7293663,-79.3284301
34_0_34C,8929,34,true,1585449531,153,16,278.8,12874,277.59,279.82,False,0,43.7276496,-79.3279418
34_0_34C,8929,34,true,1585449532,153,16,278.8,12874,277.59,279.82,False,0,43.7276496,-79.3279418
34_0_34C,8929,34,true,1585449562,125,0,278.8,12874,277.59,279.82,False,0,43.7274818,-79.3278579
34_0_34C,8929,34,true,1585449561,125,0,278.8,12874,277.59,279.82,False,0,43.7274818,-79.3278579
34_0_34C,8929,34,true,1585449591,144,32,278.87,12874,278.15,279.82,False,0,43.7250442,-79.3258819
34_0_34C,8929,34,true,1585449621,176,29,278.83,12874,277.59,279.82,False,0,43.7234344,-79.3245544
34_0_34C,8929,34,true,1585449622,176,29,278.83,12874,277.59,279.82,False,0,43.7234344,-79.3245544
34_0_34C,8929,34,true,1585449651,206,38,278.85,12874,277.59,279.82,False,0,43.7220115,-79.3275909
34_0_34C,8929,34,true,1585449682,235,26,278.85,12874,277.59,279.82,False,0,43.7191352,-79.3281173
34_0_34C,8929,34,true,1585449681,235,26,278.85,12874,277.59,279.82,False,0,43.7191352,-79.3281173
34_0_34C,8929,34,true,1585449711,248,19,278.85,12874,277.59,279.82,False,0,43.7185287,-79.3308563
34_0_34C,8929,34,true,1585449741,157,6,278.85,12874,277.59,279.82,False,0,43.7167282,-79.3304672
34_0_34C,8929,34,true,1585449742,157,6,278.85,12874,277.59,279.82,False,0,43.7167282,-79.3304672
34_0_34C,8929,34,true,1585449771,76,29,278.85,12874,277.59,279.82,False,0,43.7153396,-79.3291702
34_0_34C,8929,34,true,1585449772,76,29,278.85,12874,277.59,279.82,False,0,43.7153396,-79.3291702
34_0_34C,8929,34,true,1585449802,158,31,278.85,12874,277.59,279.82,False,0,43.7151107,-79.3278198
34_0_34C,8929,34,true,1585449801,158,31,278.85,12874,277.59,279.82,False,0,43.7151107,-79.3278198
34_0_34C,8929,34,true,1585451632,95,0,278.77,12874,277.04,280.37,False,0,43.7042557,-79.3986231
34_0_34C,8929,34,true,1585451631,95,0,278.77,12874,277.04,280.37,False,0,43.7042557,-79.3986231
34_0_34C,8929,34,true,1585451662,95,0,278.77,12874,277.04,280.37,False,0,43.7042557,-79.3986231
34_0_34C,8929,34,true,1585451691,95,0,278.77,12874,277.04,280.37,False,0,43.7042557,-79.3986231
34_0_34C,8929,34,true,1585451692,95,0,278.77,12874,277.04,280.37,False,0,43.7042557,-79.3986231
34_0_34C,8929,34,true,1585451722,95,0,278.77,12874,277.04,280.37,False,0,43.7042557,-79.3986231
34_0_34C,8929,34,true,1585451721,95,0,278.77,12874,277.04,280.37,False,0,43.7042557,-79.3986231
34_0_34C,8929,34,true,1585451754,95,0,278.77,12874,277.04,280.37,False,0,43.7042557,-79.3986231
34_0_34C,8929,34,true,1585451753,95,0,278.77,12874,277.04,280.37,False,0,43.7042557,-79.3986231
34_0_34C,8929,34,true,1585451781,95,0,278.77,12874,277.04,280.37,False,0,43.7042557,-79.3986231
34_0_34C,8929,34,true,1585451782,95,0,278.77,12874,277.04,280.37,False,0,43.7042557,-79.3986231
34_0_34C,8929,34,true,1585451811,95,0,278.77,12874,277.04,280.37,False,0,43.7042557,-79.3986231
34_0_34C,8929,34,true,1585451812,95,0,278.77,12874,277.04,280.37,False,0,43.7042557,-79.3986231
34_0_34C,8929,34,true,1585451842,95,0,278.77,12874,277.04,280.37,False,0,43.7042557,-79.3986231
34_0_34C,8929,34,true,1585451872,95,0,278.77,12874,277.04,280.37,False,0,43.7042557,-79.3986231
34_0_34C,8929,34,true,1585451871,95,0,278.77,12874,277.04,280.37,False,0,43.7042557,-79.3986231
34_0_34C,8929,34,true,1585451902,95,0,278.77,12874,277.04,280.37,False,0,43.7042557,-79.3986231
34_0_34C,8929,34,true,1585451931,95,0,278.77,12874,277.04,280.37,False,0,43.7042557,-79.3986231
34_0_34C,8929,34,true,1585451932,95,0,278.77,12874,277.04,280.37,False,0,43.7042557,-79.3986231
34_0_34C,8929,34,true,1585451962,95,0,278.77,12874,277.04,280.37,False,0,43.7042557,-79.3986231
34_0_34C,8929,34,true,1585451961,95,0,278.77,12874,277.04,280.37,False,0,43.7042557,-79.3986231
34_0_34C,8929,34,true,1585451992,95,0,278.77,12874,277.04,280.37,False,0,43.7042557,-79.3986231
34_0_34C,8929,34,true,1585452022,95,0,278.77,12874,277.04,280.37,False,0,43.7042557,-79.3986231
34_0_34C,8929,34,true,1585452052,95,0,278.77,12874,277.04,280.37,False,0,43.7042557,-79.3986231
34_0_34C,8929,34,true,1585452082,95,0,278.77,12874,277.04,280.37,False,0,43.7042557,-79.3986231
34_0_34C,8929,34,true,1585452112,95,0,278.77,12874,277.04,280.37,False,0,43.7042557,-79.3986231
34_0_34C,8929,34,true,1585452111,95,0,278.77,12874,277.04,280.37,False,0,43.7042557,-79.3986231
34_0_34C,8929,34,true,1585452142,315,14,278.74,12874,277.04,280.37,False,0,43.7053966,-79.39881
34_0_34C,8929,34,true,1585452171,2,14,278.74,12874,277.04,280.37,False,0,43.7058563,-79.4000854
34_0_34C,8929,34,true,1585452172,2,14,278.74,12874,277.04,280.37,False,0,43.7058563,-79.4000854
34_0_34C,8929,34,true,1585452202,72,23,278.74,12874,277.04,280.37,False,0,43.7064895,-79.3995513
34_0_34C,8929,34,true,1585452233,78,18,278.74,12874,277.04,280.37,False,0,43.706726,-79.3983535
34_0_34C,8929,34,true,1585452234,78,18,278.74,12874,277.04,280.37,False,0,43.706726,-79.3983535
34_0_34C,8929,34,true,1585452262,71,14,278.74,12874,277.04,280.37,False,0,43.7071151,-79.3963241
34_0_34C,8929,34,true,1585452261,71,14,278.74,12874,277.04,280.37,False,0,43.7071151,-79.3963241
34_0_34C,8929,34,true,1585452292,75,4,278.74,12874,277.04,280.37,False,0,43.7071762,-79.3958358
34_0_34C,8929,34,true,1585452291,75,4,278.74,12874,277.04,280.37,False,0,43.7071762,-79.3958358
34_0_34C,8929,34,true,1585452322,77,19,278.76,12874,277.04,280.37,False,0,43.707695,-79.3933868
34_0_34C,8929,34,true,1585452352,74,0,278.76,12874,277.04,280.37,False,0,43.7077255,-79.3931427
34_0_34C,8929,34,true,1585452382,76,16,278.76,12874,277.04,280.37,False,0,43.708229,-79.3910064
34_0_34C,8929,34,true,1585452412,73,23,278.76,12874,277.04,280.37,False,0,43.7086486,-79.3888626
34_0_34C,8929,34,true,1585452442,73,29,278.76,12874,277.04,280.37,False,0,43.7092819,-79.3857116
34_0_34C,8929,34,true,1585452472,73,37,278.81,14484,277.04,280.37,False,0,43.7101058,-79.381752
34_0_34C,8929,34,true,1585452502,77,31,278.81,14484,277.04,280.37,False,0,43.7106094,-79.3791503
34_0_34C,8929,34,true,1585452532,75,0,278.81,14484,277.04,280.37,False,0,43.7109756,-79.3773803
34_0_34C,8929,34,true,1585452562,75,0,278.81,14484,277.04,280.37,False,0,43.7109756,-79.3773803
34_0_34C,8929,34,true,1585452592,73,15,278.81,14484,277.04,280.37,False,0,43.7109756,-79.3773803
34_0_34C,8929,34,true,1585452622,74,25,278.81,14484,277.04,280.37,False,0,43.7112846,-79.3756713
34_0_34C,8929,34,true,1585452623,74,25,278.81,14484,277.04,280.37,False,0,43.7112846,-79.3756713
34_0_34C,8929,34,true,1585452652,74,29,278.82,14484,277.04,280.37,False,0,43.7119827,-79.3726043
34_0_34C,8929,34,true,1585452682,73,39,278.82,14484,277.04,280.37,False,0,43.7126502,-79.3691635
34_0_34C,8929,34,true,1585452712,71,32,278.82,14484,277.04,280.37,False,0,43.71315,-79.3667297
34_0_34C,8929,34,true,1585452713,71,32,278.82,14484,277.04,280.37,False,0,43.71315,-79.3667297
34_0_34C,8929,34,true,1585452742,75,0,278.83,14484,277.04,280.37,False,0,43.7135162,-79.3649139
34_0_34C,8929,34,true,1585452772,75,0,278.83,14484,277.04,280.37,False,0,43.7135162,-79.3649139
34_0_34C,8929,34,true,1585452773,75,0,278.83,14484,277.04,280.37,False,0,43.7135162,-79.3649139
34_0_34C,8929,34,true,1585452803,80,30,278.83,14484,277.04,280.37,False,0,43.7138252,-79.3630905
34_0_34C,8929,34,true,1585452802,80,30,278.83,14484,277.04,280.37,False,0,43.7138252,-79.3630905
34_0_34C,8929,34,true,1585452832,74,32,278.83,14484,277.04,280.37,False,0,43.7141937,-79.3614977
34_0_34C,8929,34,true,1585452862,74,0,278.83,14484,277.04,280.37,False,0,43.7144114,-79.3601823
34_0_34C,8929,34,true,1585452863,74,0,278.83,14484,277.04,280.37,False,0,43.7144114,-79.3601823
34_0_34C,8929,34,true,1585452892,66,32,278.83,14484,277.04,280.37,False,0,43.7148523,-79.3587
34_0_34C,8929,34,true,1585452922,80,32,278.84,14484,277.04,280.37,False,0,43.7155886,-79.3550868
34_0_34C,8929,34,true,1585452952,73,37,278.84,14484,277.04,280.37,False,0,43.716652,-79.3511997
34_0_34C,8929,34,true,1585452983,67,38,278.84,14484,277.04,280.37,False,0,43.7177769,-79.3475556
34_0_34C,8929,34,true,1585452982,67,38,278.84,14484,277.04,280.37,False,0,43.7177769,-79.3475556
34_0_34C,8929,34,true,1585453012,66,34,278.83,14484,277.04,280.37,False,0,43.7190281,-79.3435564
34_0_34C,8929,34,true,1585453042,67,47,278.83,14484,277.04,280.37,False,0,43.7198661,-79.3408361
34_0_34C,8929,34,true,1585453072,104,8,278.83,14484,277.04,280.37,False,0,43.7211666,-79.3357583
34_0_34C,8929,34,true,1585453192,69,0,278.83,14484,277.04,280.37,False,0,43.7204322,-79.3390502
34_0_34C,8929,34,true,1585453223,349,33,278.83,14484,277.04,280.37,False,0,43.7217102,-79.3391036
34_0_34C,8929,34,true,1585453222,349,33,278.83,14484,277.04,280.37,False,0,43.7217102,-79.3391036
34_0_34C,8929,34,true,1585453252,79,27,278.83,14484,277.04,280.37,False,0,43.7231178,-79.3388671
34_0_34C,8929,34,true,1585453253,79,27,278.83,14484,277.04,280.37,False,0,43.7231178,-79.3388671
34_0_34C,8929,34,true,1585453282,49,38,278.87,14484,277.59,280.37,False,0,43.7239418,-79.3349609
34_0_34C,8929,34,true,1585453312,71,42,278.87,14484,277.59,280.37,False,0,43.7264404,-79.331871
34_0_34C,8929,34,true,1585453313,71,42,278.87,14484,277.59,280.37,False,0,43.7264404,-79.331871
34_0_34C,8929,34,true,1585453342,66,0,278.87,14484,277.59,280.37,False,0,43.7272796,-79.3280029
34_0_34C,8929,34,true,1585453343,66,0,278.87,14484,277.59,280.37,False,0,43.7272796,-79.3280029
34_0_34C,8929,34,true,1585453373,358,34,278.87,14484,277.59,280.37,False,0,43.7284851,-79.3283157
34_0_34C,8929,34,true,1585453372,358,34,278.87,14484,277.59,280.37,False,0,43.7284851,-79.3283157
34_0_34C,8929,34,true,1585453402,10,17,278.87,14484,277.59,280.37,False,0,43.7301902,-79.3283843
34_0_34C,8929,34,true,1585453403,10,17,278.87,14484,277.59,280.37,False,0,43.7301902,-79.3283843
34_0_34C,8929,34,true,1585453433,180,13,278.87,14484,277.59,280.37,False,0,43.7295417,-79.3283996
34_0_34C,8929,34,true,1585453434,180,13,278.87,14484,277.59,280.37,False,0,43.7295417,-79.3283996
34_0_34C,8929,34,true,1585453464,154,12,278.87,14484,277.59,280.37,False,0,43.7276496,-79.3279418
34_0_34C,8929,34,true,1585453463,154,12,278.87,14484,277.59,280.37,False,0,43.7276496,-79.3279418
34_0_34C,8929,34,true,1585453493,139,35,278.87,14484,277.59,280.37,False,0,43.7259254,-79.3271179
34_0_34C,8929,34,true,1585453494,139,35,278.87,14484,277.59,280.37,False,0,43.7259254,-79.3271179
34_0_34C,8929,34,true,1585453523,172,28,278.81,14484,277.04,280.37,False,0,43.7234344,-79.3245544
34_0_34C,8929,34,true,1585453524,172,28,278.81,14484,277.04,280.37,False,0,43.7234344,-79.3245544
34_0_34C,8929,34,true,1585453553,208,39,278.87,14484,277.59,280.37,False,0,43.7221641,-79.3274688
34_0_34C,8929,34,true,1585453554,208,39,278.87,14484,277.59,280.37,False,0,43.7221641,-79.3274688
34_0_34C,8929,34,true,1585453584,175,7,278.87,14484,277.59,280.37,False,0,43.7194671,-79.3278503
34_0_34C,8929,34,true,1585453583,175,7,278.87,14484,277.59,280.37,False,0,43.7194671,-79.3278503
34_0_34C,8929,34,true,1585453613,249,28,278.87,14484,277.59,280.37,False,0,43.7186737,-79.3303985
34_0_34C,8929,34,true,1585453614,249,28,278.87,14484,277.59,280.37,False,0,43.7186737,-79.3303985
34_0_34C,8929,34,true,1585453643,245,1,278.87,14484,277.59,280.37,False,0,43.7184562,-79.3310852
34_0_34C,8929,34,true,1585453644,245,1,278.87,14484,277.59,280.37,False,0,43.7184562,-79.3310852
34_0_34C,8929,34,true,1585453673,156,10,278.87,14484,277.59,280.37,False,0,43.7167282,-79.3304672
34_0_34C,8929,34,true,1585453674,156,10,278.87,14484,277.59,280.37,False,0,43.7167282,-79.3304672
34_0_34C,8929,34,true,1585453703,69,26,278.87,14484,277.59,280.37,False,0,43.715435,-79.3286895
34_0_34C,8929,34,true,1585453704,69,26,278.87,14484,277.59,280.37,False,0,43.715435,-79.3286895
34_0_34C,8929,34,true,1585453733,157,35,278.71,14484,277.04,280.37,False,0,43.7139892,-79.327156
34_0_34C,8929,34,true,1585453734,157,35,278.71,14484,277.04,280.37,False,0,43.7139892,-79.327156
34_0_34C,8929,34,true,1585455414,216,0,278.67,14484,277.04,280.37,False,0,43.7047615,-79.3984985
34_0_34C,8929,34,true,1585455444,216,0,278.67,14484,277.04,280.37,False,0,43.7049293,-79.3985824
34_0_34C,8929,34,true,1585455443,216,0,278.67,14484,277.04,280.37,False,0,43.7049293,-79.3985824
34_0_34C,8929,34,true,1585455474,216,0,278.67,14484,277.04,280.37,False,0,43.7049293,-79.3985824
34_0_34C,8929,34,true,1585455504,216,0,278.67,14484,277.04,280.37,False,0,43.7049293,-79.3985824
34_0_34C,8929,34,true,1585455534,216,0,278.67,14484,277.04,280.37,False,0,43.7049293,-79.3985824
34_0_34C,8929,34,true,1585455564,216,0,278.67,14484,277.04,280.37,False,0,43.7049293,-79.3985824
34_0_34C,8929,34,true,1585455596,216,0,278.67,14484,277.04,280.37,False,0,43.7049293,-79.3985824
34_0_34C,8929,34,true,1585455597,216,0,278.67,14484,277.04,280.37,False,0,43.7049293,-79.3985824
34_0_34C,8929,34,true,1585455624,216,0,278.67,14484,277.04,280.37,False,0,43.7049293,-79.3985824
34_0_34C,8929,34,true,1585455654,216,0,278.67,14484,277.04,280.37,False,0,43.7049293,-79.3985824
34_0_34C,8929,34,true,1585455684,216,0,278.67,14484,277.04,280.37,False,0,43.7049293,-79.3985824
34_0_34C,8929,34,true,1585455714,216,0,278.67,14484,277.04,280.37,False,0,43.7049293,-79.3985824
34_0_34C,8929,34,true,1585455744,216,0,278.67,14484,277.04,280.37,False,0,43.7049293,-79.3985824
34_0_34C,8929,34,true,1585455774,216,0,278.67,14484,277.04,280.37,False,0,43.7049293,-79.3985824
34_0_34C,8929,34,true,1585455804,216,0,278.67,14484,277.04,280.37,False,0,43.7049293,-79.3985824
34_0_34C,8929,34,true,1585455805,216,0,278.67,14484,277.04,280.37,False,0,43.7049293,-79.3985824
34_0_34C,8929,34,true,1585455864,2,17,278.68,14484,277.04,280.37,False,0,43.7056379,-79.3999499
34_0_34C,8929,34,true,1585455894,74,25,278.68,14484,277.04,280.37,False,0,43.7063242,-79.3999671
34_0_34C,8929,34,true,1585455924,76,20,278.68,14484,277.04,280.37,False,0,43.7066969,-79.398504
34_0_34C,8929,34,true,1585455925,76,20,278.68,14484,277.04,280.37,False,0,43.7066969,-79.398504
34_0_34C,8929,34,true,1585455954,74,31,278.68,14484,277.04,280.37,False,0,43.7072858,-79.3954297
34_0_34C,8929,34,true,1585455955,74,31,278.68,14484,277.04,280.37,False,0,43.7072858,-79.3954297
34_0_34C,8929,34,true,1585455984,74,0,278.69,14484,277.04,280.37,False,0,43.7077108,-79.3932604
34_0_34C,8929,34,true,1585455985,74,0,278.69,14484,277.04,280.37,False,0,43.7077108,-79.3932604
34_0_34C,8929,34,true,1585456014,69,22,278.69,14484,277.04,280.37,False,0,43.7078447,-79.3927132
34_0_34C,8929,34,true,1585456015,69,22,278.69,14484,277.04,280.37,False,0,43.7078447,-79.3927132
34_0_34C,8929,34,true,1585456044,74,9,278.69,14484,277.04,280.37,False,0,43.7082914,-79.390709
34_0_34C,8929,34,true,1585456045,74,9,278.69,14484,277.04,280.37,False,0,43.7082914,-79.390709
34_0_34C,8929,34,true,1585456074,74,0,278.69,14484,277.04,280.37,False,0,43.7082951,-79.3906911
34_0_34C,8929,34,true,1585456075,74,0,278.69,14484,277.04,280.37,False,0,43.7082951,-79.3906911
34_0_34C,8929,34,true,1585456104,74,0,278.69,14484,277.04,280.37,False,0,43.7082989,-79.3906732
34_0_34C,8929,34,true,1585456134,74,25,278.69,14484,277.04,280.37,False,0,43.7087636,-79.3883119
34_0_34C,8929,34,true,1585456164,74,32,278.69,14484,277.04,280.37,False,0,43.7090122,-79.3869416
34_0_34C,8929,34,true,1585456165,74,32,278.69,14484,277.04,280.37,False,0,43.7090122,-79.3869416
34_0_34C,8929,34,true,1585456194,74,24,278.69,14484,277.04,280.37,False,0,43.7098388,-79.3829498
34_0_34C,8929,34,true,1585456195,74,24,278.69,14484,277.04,280.37,False,0,43.7098388,-79.3829498
34_0_34C,8929,34,true,1585456224,74,0,278.69,14484,277.04,280.37,False,0,43.7099151,-79.3823394
34_0_34C,8929,34,true,1585456225,74,0,278.69,14484,277.04,280.37,False,0,43.7099151,-79.3823394
34_0_34C,8929,34,true,1585456254,74,32,278.69,14484,277.04,280.37,False,0,43.7104837,-79.3795873
34_0_34C,8929,34,true,1585456255,74,32,278.69,14484,277.04,280.37,False,0,43.7104837,-79.3795873
34_0_34C,8929,34,true,1585456284,75,0,278.69,14484,277.04,280.37,False,0,43.7109403,-79.3775418
34_0_34C,8929,34,true,1585456285,75,0,278.69,14484,277.04,280.37,False,0,43.7109403,-79.3775418
34_0_34C,8929,34,true,1585456314,75,0,278.69,14484,277.04,280.37,False,0,43.7109403,-79.3775418
34_0_34C,8929,34,true,1585456315,75,0,278.69,14484,277.04,280.37,False,0,43.7109403,-79.3775418
34_0_34C,8929,34,true,1585456345,75,0,278.69,14484,277.04,280.37,False,0,43.7109403,-79.3775418
34_0_34C,8929,34,true,1585456344,75,0,278.69,14484,277.04,280.37,False,0,43.7109403,-79.3775418
34_0_34C,8929,34,true,1585456374,74,31,278.69,14484,277.04,280.37,False,0,43.7112115,-79.3759657
34_0_34C,8929,34,true,1585456404,74,41,278.7,14484,277.04,280.37,False,0,43.7121234,-79.3714188
34_0_34C,8929,34,true,1585456405,74,41,278.7,14484,277.04,280.37,False,0,43.7121234,-79.3714188
34_0_34C,8929,34,true,1585456435,73,18,278.7,14484,277.04,280.37,False,0,43.7128588,-79.3679356
34_0_34C,8929,34,true,1585456434,73,18,278.7,14484,277.04,280.37,False,0,43.7128588,-79.3679356
34_0_34C,8929,34,true,1585456465,72,23,278.7,14484,277.04,280.37,False,0,43.71305,-79.3671146
34_0_34C,8929,34,true,1585456464,72,23,278.7,14484,277.04,280.37,False,0,43.71305,-79.3671146
34_0_34C,8929,34,true,1585456494,74,40,278.74,14484,277.04,280.37,False,0,43.7138206,-79.3631201
34_0_34C,8929,34,true,1585456495,74,40,278.74,14484,277.04,280.37,False,0,43.7138206,-79.3631201
34_0_34C,8929,34,true,1585456524,74,0,278.74,14484,277.04,280.37,False,0,43.7144584,-79.3599014
34_0_34C,8929,34,true,1585456556,74,0,278.74,14484,277.04,280.37,False,0,43.7144584,-79.3599014
34_0_34C,8929,34,true,1585456584,75,38,278.73,14484,277.04,280.37,False,0,43.7152064,-79.3571046
34_0_34C,8929,34,true,1585456585,75,38,278.73,14484,277.04,280.37,False,0,43.7152064,-79.3571046
34_0_34C,8929,34,true,1585456614,61,39,278.74,14484,277.04,280.37,False,0,43.7160128,-79.3533315
34_0_34C,8929,34,true,1585456615,61,39,278.74,14484,277.04,280.37,False,0,43.7160128,-79.3533315
34_0_34C,8929,34,true,1585456644,216,0,278.74,14484,277.04,280.37,False,0,43.7169151,-79.3497619
34_0_34C,8929,34,true,1585456645,216,0,278.74,14484,277.04,280.37,False,0,43.7169151,-79.3497619
34_0_34C,8929,34,true,1585456677,216,0,278.74,14484,277.04,280.37,False,0,43.7169151,-79.3497619
34_0_34C,8929,34,true,1585456705,67,39,278.74,14484,277.04,280.37,False,0,43.7178538,-79.347299
34_0_34C,8929,34,true,1585456704,67,39,278.74,14484,277.04,280.37,False,0,43.7178538,-79.347299
34_0_34C,8929,34,true,1585456734,66,36,278.75,14484,277.04,280.37,False,0,43.7191853,-79.3430809
34_0_34C,8929,34,true,1585456735,66,36,278.75,14484,277.04,280.37,False,0,43.7191853,-79.3430809
34_0_34C,8929,34,true,1585456764,67,22,278.75,14484,277.04,280.37,False,0,43.7202987,-79.3395226
34_0_34C,8929,34,true,1585456765,67,22,278.75,14484,277.04,280.37,False,0,43.7202987,-79.3395226
34_0_34C,8929,34,true,1585456794,66,24,278.75,14484,277.04,280.37,False,0,43.7209001,-79.3389934
34_0_34C,8929,34,true,1585456795,66,24,278.75,14484,277.04,280.37,False,0,43.7209001,-79.3389934
34_0_34C,8929,34,true,1585456824,103,9,278.75,14484,277.04,280.37,False,0,43.7211733,-79.3358216
34_0_34C,8929,34,true,1585456825,103,9,278.75,14484,277.04,280.37,False,0,43.7211733,-79.3358216
34_0_34C,8929,34,true,1585456945,69,0,278.75,14484,277.04,280.37,False,0,43.7204322,-79.3390502
34_0_34C,8929,34,true,1585456944,69,0,278.75,14484,277.04,280.37,False,0,43.7204322,-79.3390502
34_0_34C,8929,34,true,1585456974,69,0,278.75,14484,277.04,280.37,False,0,43.7204322,-79.3390502
34_0_34C,8929,34,true,1585456975,69,0,278.75,14484,277.04,280.37,False,0,43.7204322,-79.3390502
34_0_34C,8929,34,true,1585457004,349,35,278.75,14484,277.04,280.37,False,0,43.721878,-79.3391952
34_0_34C,8929,34,true,1585457005,349,35,278.75,14484,277.04,280.37,False,0,43.721878,-79.3391952
34_0_34C,8929,34,true,1585457034,78,39,278.75,14484,277.04,280.37,False,0,43.7232131,-79.3378677
34_0_34C,8929,34,true,1585457035,78,39,278.75,14484,277.04,280.37,False,0,43.7232131,-79.3378677
34_0_34C,8929,34,true,1585457064,31,41,278.76,14484,277.04,280.37,False,0,43.7248382,-79.3340682
34_0_34C,8929,34,true,1585457065,31,41,278.76,14484,277.04,280.37,False,0,43.7248382,-79.3340682
34_0_34C,8929,34,true,1585457094,75,37,278.79,14484,277.59,280.37,False,0,43.7266616,-79.3308792
34_0_34C,8929,34,true,1585457095,75,37,278.79,14484,277.59,280.37,False,0,43.7266616,-79.3308792
34_0_34C,8929,34,true,1585457125,66,0,278.79,14484,277.59,280.37,False,0,43.7272796,-79.3280029
34_0_34C,8929,34,true,1585457124,66,0,278.79,14484,277.59,280.37,False,0,43.7272796,-79.3280029
34_0_34C,8929,34,true,1585457154,358,36,278.73,14484,277.59,280.37,False,0,43.7286643,-79.3283309
34_0_34C,8929,34,true,1585457155,358,36,278.73,14484,277.59,280.37,False,0,43.7286643,-79.3283309
34_0_34C,8929,34,true,1585457184,250,15,278.73,14484,277.59,280.37,False,0,43.7302818,-79.3284606
34_0_34C,8929,34,true,1585457185,250,15,278.73,14484,277.59,280.37,False,0,43.7302818,-79.3284606
34_0_34C,8929,34,true,1585457214,169,38,278.73,14484,277.59,280.37,False,0,43.7282981,-79.3283157
34_0_34C,8929,34,true,1585457244,125,0,278.73,14484,277.59,280.37,False,0,43.7274818,-79.3278579
34_0_34C,8929,34,true,1585457245,125,0,278.73,14484,277.59,280.37,False,0,43.7274818,-79.3278579
34_0_34C,8929,34,true,1585457275,144,35,278.73,14484,277.59,280.37,False,0,43.7260017,-79.3272018
34_0_34C,8929,34,true,1585457274,144,35,278.73,14484,277.59,280.37,False,0,43.7260017,-79.3272018
34_0_34C,8929,34,true,1585457305,159,0,278.76,14484,277.04,280.37,False,0,43.7247619,-79.3257293
34_0_34C,8929,34,true,1585457304,159,0,278.76,14484,277.04,280.37,False,0,43.7247619,-79.3257293
34_0_34C,8929,34,true,1585457334,146,32,278.76,14484,277.04,280.37,False,0,43.7241963,-79.3251666
34_0_34C,8929,34,true,1585457335,146,32,278.76,14484,277.04,280.37,False,0,43.7241963,-79.3251666
34_0_34C,8929,34,true,1585457365,266,39,278.76,14484,277.04,280.37,False,0,43.7227232,-79.3262854
34_0_34C,8929,34,true,1585457364,266,39,278.76,14484,277.04,280.37,False,0,43.7227232,-79.3262854
34_0_34C,8929,34,true,1585457397,163,34,278.76,14484,277.04,280.37,False,0,43.7199863,-79.3280202
34_0_34C,8929,34,true,1585457425,166,7,278.76,14484,277.04,280.37,False,0,43.7195385,-79.3279146
34_0_34C,8929,34,true,1585457424,166,7,278.76,14484,277.04,280.37,False,0,43.7195385,-79.3279146
34_0_34C,8929,34,true,1585457455,248,33,278.76,14484,277.04,280.37,False,0,43.7186319,-79.3305303
34_0_34C,8929,34,true,1585457454,248,33,278.76,14484,277.04,280.37,False,0,43.7186319,-79.3305303
34_0_34C,8929,34,true,1585457484,245,0,278.76,14484,277.04,280.37,False,0,43.7185023,-79.3309395
34_0_34C,8929,34,true,1585457485,245,0,278.76,14484,277.04,280.37,False,0,43.7185023,-79.3309395
34_0_34C,8929,34,true,1585457515,157,15,278.76,14484,277.04,280.37,False,0,43.7168745,-79.3305625
34_0_34C,8929,34,true,1585457516,157,15,278.76,14484,277.04,280.37,False,0,43.7168745,-79.3305625
34_0_34C,8929,34,true,1585457544,70,30,278.76,14484,277.04,280.37,False,0,43.7154156,-79.3288449
34_0_34C,8929,34,true,1585457545,70,30,278.76,14484,277.04,280.37,False,0,43.7154156,-79.3288449
34_0_34C,8929,34,true,1585457575,156,32,278.69,14484,277.04,280.37,False,0,43.713669,-79.3269696
34_0_34C,8929,34,true,1585457574,156,32,278.69,14484,277.04,280.37,False,0,43.713669,-79.3269696
34_0_34C,8929,34,true,1585458985,119,0,278.65,14484,277.04,280.37,False,0,43.7042771,-79.3989489
34_0_34C,8929,34,true,1585459015,119,0,278.65,14484,277.04,280.37,False,0,43.7042771,-79.3989489
34_0_34C,8929,34,true,1585459045,119,0,278.65,14484,277.04,280.37,False,0,43.7042771,-79.3989489
34_0_34C,8929,34,true,1585459044,119,0,278.65,14484,277.04,280.37,False,0,43.7042771,-79.3989489
34_0_34C,8929,34,true,1585459075,119,0,278.65,14484,277.04,280.37,False,0,43.7042771,-79.3989489
34_0_34C,8929,34,true,1585459074,119,0,278.65,14484,277.04,280.37,False,0,43.7042771,-79.3989489
34_0_34C,8929,34,true,1585459105,119,0,278.65,14484,277.04,280.37,False,0,43.7042771,-79.3989489
34_0_34C,8929,34,true,1585459135,119,0,278.65,14484,277.04,280.37,False,0,43.7042771,-79.3989489
34_0_34C,8929,34,true,1585459165,119,0,278.65,14484,277.04,280.37,False,0,43.7042771,-79.3989489
34_0_34C,8929,34,true,1585459195,119,0,278.65,14484,277.04,280.37,False,0,43.7042771,-79.3989489
34_0_34C,8929,34,true,1585459225,119,0,278.65,14484,277.04,280.37,False,0,43.7042771,-79.3989489
34_0_34C,8929,34,true,1585459255,119,0,278.65,14484,277.04,280.37,False,0,43.7042771,-79.3989489
34_0_34C,8929,34,true,1585459307,347,20,278.65,14484,277.04,280.37,False,0,43.704305,-79.398529
34_0_34C,8929,34,true,1585459337,72,27,278.66,14484,277.04,280.37,False,0,43.7064895,-79.3995513
34_0_34C,8929,34,true,1585459367,74,28,278.66,14484,277.04,280.37,False,0,43.7071456,-79.39608
34_0_34C,8929,34,true,1585459397,73,30,278.67,14484,277.04,280.37,False,0,43.7079544,-79.3923263
34_0_34C,8929,34,true,1585459427,74,0,278.67,14484,277.04,280.37,False,0,43.7083282,-79.3905334
34_0_34C,8929,34,true,1585459457,74,0,278.67,14484,277.04,280.37,False,0,43.7083282,-79.3905334
34_0_34C,8929,34,true,1585459487,71,28,278.67,14484,277.04,280.37,False,0,43.7086257,-79.388977
34_0_34C,8929,34,true,1585459517,72,40,278.67,14484,277.04,280.37,False,0,43.7092819,-79.3857116
34_0_34C,8929,34,true,1585459547,74,40,278.68,14484,277.04,280.37,False,0,43.710411,-79.3801956
34_0_34C,8929,34,true,1585459577,74,35,278.68,14484,277.04,280.37,False,0,43.7110557,-79.3768997
34_0_34C,8929,34,true,1585459607,75,43,278.69,14484,277.04,280.37,False,0,43.7120895,-79.372055
34_0_34C,8929,34,true,1585459637,73,37,278.69,14484,277.04,280.37,False,0,43.7128562,-79.3679504
34_0_34C,8929,34,true,1585459667,75,0,278.69,14484,277.04,280.37,False,0,43.7134437,-79.3651428
34_0_34C,8929,34,true,1585459697,74,39,278.7,14484,277.04,280.37,False,0,43.7137489,-79.3635711
34_0_34C,8929,34,true,1585459727,66,36,278.7,14484,277.04,280.37,False,0,43.7147064,-79.3593368
34_0_34C,8929,34,true,1585459757,82,40,278.71,14484,277.04,280.37,False,0,43.7155685,-79.355194
34_0_34C,8929,34,true,1585459787,66,42,278.72,14484,277.04,280.37,False,0,43.716835,-79.3506698
34_0_34C,8929,34,true,1585459788,66,42,278.72,14484,277.04,280.37,False,0,43.716835,-79.3506698
34_0_34C,8929,34,true,1585459817,66,45,278.72,14484,277.04,280.37,False,0,43.7178611,-79.3472747
34_0_34C,8929,34,true,1585459847,71,41,278.73,14484,277.04,280.37,False,0,43.7192802,-79.3427581
34_0_34C,8929,34,true,1585459877,65,27,278.73,14484,277.04,280.37,False,0,43.720333,-79.3394012
34_0_34C,8929,34,true,1585459878,65,27,278.73,14484,277.04,280.37,False,0,43.720333,-79.3394012
34_0_34C,8929,34,true,1585459907,94,17,278.73,14484,277.04,280.37,False,0,43.7211866,-79.3358883
34_0_34C,8929,34,true,1585459908,94,17,278.73,14484,277.04,280.37,False,0,43.7211866,-79.3358883
34_0_34C,8929,34,true,1585459997,350,20,278.73,14484,277.04,280.37,False,0,43.7204322,-79.3390502
34_0_34C,8929,34,true,1585460027,69,0,278.73,14484,277.04,280.37,False,0,43.7204322,-79.3390502
34_0_34C,8929,34,true,1585460057,69,0,278.73,14484,277.04,280.37,False,0,43.7204322,-79.3390502
34_0_34C,8929,34,true,1585460088,350,34,278.73,14484,277.04,280.37,False,0,43.7217102,-79.3391036
34_0_34C,8929,34,true,1585460087,350,34,278.73,14484,277.04,280.37,False,0,43.7217102,-79.3391036
34_0_34C,8929,34,true,1585460117,78,43,278.73,14484,277.04,280.37,False,0,43.7232131,-79.3378677
34_0_34C,8929,34,true,1585460118,78,43,278.73,14484,277.04,280.37,False,0,43.7232131,-79.3378677
34_0_34C,8929,34,true,1585460147,30,49,278.75,14484,277.04,280.37,False,0,43.7248382,-79.3340682
34_0_34C,8929,34,true,1585460177,73,47,278.78,14484,277.59,280.37,False,0,43.7269325,-79.3296737
34_0_34C,8929,34,true,1585460207,66,0,278.78,14484,277.59,280.37,False,0,43.7272796,-79.3280029
34_0_34C,8929,34,true,1585460237,357,45,278.78,14484,277.59,280.37,False,0,43.7286643,-79.3283309
34_0_34C,8929,34,true,1585460267,254,19,278.78,14484,277.59,280.37,False,0,43.7302818,-79.3284606
34_0_34C,8929,34,true,1585460268,254,19,278.78,14484,277.59,280.37,False,0,43.7302818,-79.3284606
34_0_34C,8929,34,true,1585460297,176,32,278.78,14484,277.59,280.37,False,0,43.7291908,-79.3284606
34_0_34C,8929,34,true,1585460327,125,0,278.78,14484,277.59,280.37,False,0,43.7274818,-79.3278579
34_0_34C,8929,34,true,1585460357,125,0,278.78,14484,277.59,280.37,False,0,43.7274818,-79.3278579
34_0_34C,8929,34,true,1585460387,138,40,278.78,14484,277.59,280.37,False,0,43.725872,-79.3270416
34_0_34C,8929,34,true,1585460418,253,45,278.78,14484,277.04,280.37,False,0,43.7227935,-79.325653
34_0_34C,8929,34,true,1585460417,253,45,278.78,14484,277.04,280.37,False,0,43.7227935,-79.325653
34_0_34C,8929,34,true,1585460447,173,33,278.78,14484,277.04,280.37,False,0,43.7204017,-79.3281326
34_0_34C,8929,34,true,1585460448,173,33,278.78,14484,277.04,280.37,False,0,43.7204017,-79.3281326
34_0_34C,8929,34,true,1585460477,253,41,278.78,14484,277.04,280.37,False,0,43.7189369,-79.3289871
34_0_34C,8929,34,true,1585460508,153,28,278.78,14484,277.04,280.37,False,0,43.7180137,-79.3312301
34_0_34C,8929,34,true,1585460538,157,37,278.78,14484,277.04,280.37,False,0,43.7157974,-79.3299636
34_0_34C,8929,34,true,1585460568,158,33,278.78,14484,277.04,280.37,False,0,43.7151107,-79.3278198
