dir,id,route,predable,time,hdg,spd,temp,vis,t_min,t_max,snow,rain,lat,lon
34_0_34Aam,8624,34,true,1585479803,216,0,278.36,14484,277.04,279.82,False,2,43.7205366,-79.2921033
34_0_34Aam,8624,34,true,1585479802,216,0,278.36,14484,277.04,279.82,False,2,43.7205366,-79.2921033
34_0_34Aam,8624,34,true,1585479833,216,0,278.36,14484,277.04,279.82,False,2,43.7212638,-79.2917175
34_0_34Aam,8624,34,true,1585479832,216,0,278.36,14484,277.04,279.82,False,2,43.7212638,-79.2917175
34_0_34Aam,8624,34,true,1585479862,216,0,278.36,14484,277.04,279.82,False,2,43.7212638,-79.2917175
34_0_34Aam,8624,34,true,1585479863,216,0,278.36,14484,277.04,279.82,False,2,43.7212638,-79.2917175
34_0_34Aam,8624,34,true,1585479893,216,0,278.36,14484,277.04,279.82,False,2,43.7212638,-79.2917175
34_0_34Aam,8624,34,true,1585479892,216,0,278.36,14484,277.04,279.82,False,2,43.7212638,-79.2917175
34_0_34Aam,8624,34,true,1585479922,216,0,278.36,14484,277.04,279.82,False,2,43.7212638,-79.2917175
34_0_34Aam,8624,34,true,1585479923,216,0,278.36,14484,277.04,279.82,False,2,43.7212638,-79.2917175
34_0_34Aam,8624,34,true,1585479953,216,0,278.36,14484,277.04,279.82,False,2,43.7212638,-79.2917175
34_0_34Aam,8624,34,true,1585479952,216,0,278.36,14484,277.04,279.82,False,2,43.7212638,-79.2917175
34_0_34Aam,8624,34,true,1585479983,216,0,278.36,14484,277.04,279.82,False,2,43.7212638,-79.2917175
34_0_34Aam,8624,34,true,1585479982,216,0,278.36,14484,277.04,279.82,False,2,43.7212638,-79.2917175
34_0_34Aam,8624,34,true,1585480012,216,0,278.36,14484,277.04,279.82,False,2,43.7212638,-79.2917175
34_0_34Aam,8624,34,true,1585480013,216,0,278.36,14484,277.04,279.82,False,2,43.7212638,-79.2917175
34_0_34Aam,8624,34,true,1585480043,216,0,278.38,14484,277.04,279.82,False,2,43.7212638,-79.2917175
34_0_34Aam,8624,34,true,1585480042,216,0,278.38,14484,277.04,279.82,False,2,43.7212638,-79.2917175
34_0_34Aam,8624,34,true,1585480073,216,0,278.38,14484,277.04,279.82,False,2,43.7212638,-79.2917175
34_0_34Aam,8624,34,true,1585480072,216,0,278.38,14484,277.04,279.82,False,2,43.7212638,-79.2917175
34_0_34Aam,8624,34,true,1585480103,216,0,278.38,14484,277.04,279.82,False,2,43.7212638,-79.2917175
34_0_34Aam,8624,34,true,1585480102,216,0,278.38,14484,277.04,279.82,False,2,43.7212638,-79.2917175
34_0_34Aam,8624,34,true,1585480133,216,0,278.38,14484,277.04,279.82,False,2,43.7212638,-79.2917175
34_0_34Aam,8624,34,true,1585480132,216,0,278.38,14484,277.04,279.82,False,2,43.7212638,-79.2917175
34_0_34Aam,8624,34,true,1585480163,216,0,278.38,14484,277.04,279.82,False,2,43.7205016,-79.2922566
34_0_34Aam,8624,34,true,1585480162,216,0,278.38,14484,277.04,279.82,False,2,43.7205016,-79.2922566
34_0_34Aam,8624,34,true,1585480193,216,0,278.38,14484,277.04,279.82,False,2,43.7205016,-79.2922566
34_0_34Aam,8624,34,true,1585480222,216,0,278.38,14484,277.04,279.82,False,2,43.7205016,-79.2922566
34_0_34Aam,8624,34,true,1585480223,216,0,278.38,14484,277.04,279.82,False,2,43.7205016,-79.2922566
34_0_34Aam,8624,34,true,1585480253,216,0,278.38,14484,277.04,279.82,False,2,43.7205016,-79.2922566
34_0_34Aam,8624,34,true,1585480252,216,0,278.38,14484,277.04,279.82,False,2,43.7205016,-79.2922566
34_0_34Aam,8624,34,true,1585480283,216,1,278.38,14484,277.04,279.82,False,2,43.7204983,-79.2922616
34_0_34Aam,8624,34,true,1585480282,216,1,278.38,14484,277.04,279.82,False,2,43.7204983,-79.2922616
34_0_34Aam,8624,34,true,1585480313,170,5,278.38,14484,277.04,279.82,False,2,43.720205,-79.2929033
34_0_34Aam,8624,34,true,1585480312,170,5,278.38,14484,277.04,279.82,False,2,43.720205,-79.2929033
34_0_34Aam,8624,34,true,1585480343,70,29,278.38,14484,277.04,279.82,False,2,43.7200283,-79.2918433
34_0_34Aam,8624,34,true,1585480372,18,17,278.38,14484,277.04,279.82,False,2,43.7208433,-79.2887866
34_0_34Aam,8624,34,true,1585480373,18,17,278.38,14484,277.04,279.82,False,2,43.7208433,-79.2887866
34_0_34Aam,8624,34,true,1585480403,343,37,278.38,14484,277.04,279.82,False,2,43.723765,-79.2900483
34_0_34Aam,8624,34,true,1585480433,335,25,278.38,14484,277.04,279.82,False,2,43.72646,-79.2912833
34_0_34Aam,8624,34,true,1585480463,252,29,278.38,14484,277.04,279.82,False,2,43.72677,-79.2930433
34_0_34Aam,8624,34,true,1585480492,253,32,278.38,14484,277.04,279.82,False,2,43.7259716,-79.296605
34_0_34Aam,8624,34,true,1585480493,253,32,278.38,14484,277.04,279.82,False,2,43.7259716,-79.296605
34_0_34Aam,8624,34,true,1585480523,252,21,278.38,14484,277.04,279.82,False,2,43.7252316,-79.2999183
34_0_34Aam,8624,34,true,1585480522,252,21,278.38,14484,277.04,279.82,False,2,43.7252316,-79.2999183
34_0_34Aam,8624,34,true,1585480553,216,0,278.38,14484,277.04,279.82,False,2,43.7251083,-79.30049
34_0_34Aam,8624,34,true,1585480583,216,0,278.38,14484,277.04,279.82,False,2,43.7251083,-79.30049
34_0_34Aam,8624,34,true,1585480613,261,24,278.38,14484,277.04,279.82,False,2,43.7249466,-79.3016166
34_0_34Aam,8624,34,true,1585480643,270,34,278.38,14484,277.04,279.82,False,2,43.7247816,-79.3036833
34_0_34Aam,8624,34,true,1585480673,281,31,278.37,14484,277.04,279.82,False,2,43.7252083,-79.3076083
34_0_34Aam,8624,34,true,1585480703,283,33,278.37,14484,277.04,279.82,False,2,43.7258083,-79.3111833
34_0_34Aam,8624,34,true,1585480733,216,0,278.37,14484,277.04,279.82,False,2,43.72612,-79.3131416
34_0_34Aam,8624,34,true,1585480764,275,36,278.37,14484,277.04,279.82,False,2,43.72633,-79.3150333
34_0_34Aam,8624,34,true,1585480763,275,36,278.37,14484,277.04,279.82,False,2,43.72633,-79.3150333
34_0_34Aam,8624,34,true,1585480793,255,32,278.37,14484,277.04,279.82,False,2,43.7261049,-79.3190566
34_0_34Aam,8624,34,true,1585480823,250,35,278.37,14484,277.04,279.82,False,2,43.7250633,-79.3231349
34_0_34Aam,8624,34,true,1585480854,251,31,278.36,14484,277.04,279.82,False,2,43.7241766,-79.3267266
34_0_34Aam,8624,34,true,1585480853,251,31,278.36,14484,277.04,279.82,False,2,43.7241766,-79.3267266
34_0_34Aam,8624,34,true,1585480883,250,12,278.36,14484,277.04,279.82,False,2,43.7237216,-79.3284483
34_0_34Aam,8624,34,true,1585480913,249,24,278.36,14484,277.04,279.82,False,2,43.7229066,-79.3314266
34_0_34Aam,8624,34,true,1585480943,216,0,278.36,14484,277.04,279.82,False,2,43.72281,-79.331755
34_0_34Aam,8624,34,true,1585480973,246,37,278.36,14484,277.04,279.82,False,2,43.7221583,-79.3339483
34_0_34Aam,8624,34,true,1585480974,246,37,278.36,14484,277.04,279.82,False,2,43.7221583,-79.3339483
34_0_34Aam,8624,34,true,1585481003,252,33,278.32,14484,276.48,279.82,False,2,43.721125,-79.3375083
34_0_34Aam,8624,34,true,1585481004,252,33,278.32,14484,276.48,279.82,False,2,43.721125,-79.3375083
34_0_34Aam,8624,34,true,1585481033,245,40,278.32,14484,276.48,279.82,False,2,43.7198833,-79.34136
34_0_34Aam,8624,34,true,1585481034,245,40,278.32,14484,276.48,279.82,False,2,43.7198833,-79.34136
34_0_34Aam,8624,34,true,1585481063,245,40,278.33,14484,276.48,279.82,False,2,43.7185166,-79.3455183
34_0_34Aam,8624,34,true,1585481094,246,22,278.33,14484,276.48,279.82,False,2,43.717355,-79.34935
34_0_34Aam,8624,34,true,1585481093,246,22,278.33,14484,276.48,279.82,False,2,43.717355,-79.34935
34_0_34Aam,8624,34,true,1585481123,216,0,278.33,14484,276.48,279.82,False,2,43.7172383,-79.349705
34_0_34Aam,8624,34,true,1585481153,245,19,278.33,14484,276.48,279.82,False,2,43.7171733,-79.3498866
34_0_34Aam,8624,34,true,1585481184,248,43,278.33,14484,276.48,279.82,False,2,43.7160083,-79.3535266
34_0_34Aam,8624,34,true,1585481183,248,43,278.33,14484,276.48,279.82,False,2,43.7160083,-79.3535266
34_0_34Aam,8624,34,true,1585481213,251,37,278.32,14484,276.48,279.82,False,2,43.7151783,-79.357785
34_0_34Aam,8624,34,true,1585481243,216,0,278.31,14484,276.48,279.82,False,2,43.7147283,-79.35955
34_0_34Aam,8624,34,true,1585481273,252,18,278.31,14484,276.48,279.82,False,2,43.7146683,-79.359795
34_0_34Aam,8624,34,true,1585481303,254,35,278.31,14484,276.48,279.82,False,2,43.7139666,-79.3631333
