dir,id,route,predable,time,hdg,spd,temp,vis,t_min,t_max,snow,rain,lat,lon
34_0_34A,8903,34,true,1585433779,333,7,280.01,14484,276.48,283.15,False,0,43.7050933,-79.3985671
34_0_34A,8903,34,true,1585433780,333,7,280.01,14484,276.48,283.15,False,0,43.7050933,-79.3985671
34_0_34A,8903,34,true,1585433809,284,14,280.01,14484,276.48,283.15,False,0,43.7050933,-79.3985671
34_0_34A,8903,34,true,1585433810,284,14,280.01,14484,276.48,283.15,False,0,43.7050933,-79.3985671
34_0_34A,8903,34,true,1585433839,62,13,280.01,14484,276.48,283.15,False,0,43.7063522,-79.3999252
34_0_34A,8903,34,true,1585433840,62,13,280.01,14484,276.48,283.15,False,0,43.7063522,-79.3999252
34_0_34A,8903,34,true,1585433869,74,2,280.01,14484,276.48,283.15,False,0,43.7065849,-79.3990707
34_0_34A,8903,34,true,1585433870,74,2,280.01,14484,276.48,283.15,False,0,43.7065849,-79.3990707
34_0_34A,8903,34,true,1585433899,75,21,280.01,14484,276.48,283.15,False,0,43.706974,-79.3971862
34_0_34A,8903,34,true,1585433900,75,21,280.01,14484,276.48,283.15,False,0,43.706974,-79.3971862
34_0_34A,8903,34,true,1585433929,76,0,280.01,14484,276.48,283.15,False,0,43.7071762,-79.3958358
34_0_34A,8903,34,true,1585433930,76,0,280.01,14484,276.48,283.15,False,0,43.7071762,-79.3958358
34_0_34A,8903,34,true,1585433960,68,21,280.02,14484,276.48,283.15,False,0,43.7074165,-79.3949966
34_0_34A,8903,34,true,1585433959,68,21,280.02,14484,276.48,283.15,False,0,43.7074165,-79.3949966
34_0_34A,8903,34,true,1585433989,74,0,280.02,14484,276.48,283.15,False,0,43.7077255,-79.3931427
34_0_34A,8903,34,true,1585433990,74,0,280.02,14484,276.48,283.15,False,0,43.7077255,-79.3931427
34_0_34A,8903,34,true,1585434019,75,15,280.02,14484,276.48,283.15,False,0,43.707756,-79.3929367
34_0_34A,8903,34,true,1585434020,75,15,280.02,14484,276.48,283.15,False,0,43.707756,-79.3929367
34_0_34A,8903,34,true,1585434049,78,16,280.02,14484,276.48,283.15,False,0,43.708229,-79.3910064
34_0_34A,8903,34,true,1585434050,78,16,280.02,14484,276.48,283.15,False,0,43.708229,-79.3910064
34_0_34A,8903,34,true,1585434080,71,20,280.02,14484,276.48,283.15,False,0,43.7086257,-79.388977
34_0_34A,8903,34,true,1585434079,71,20,280.02,14484,276.48,283.15,False,0,43.7086257,-79.388977
34_0_34A,8903,34,true,1585434109,74,20,280.02,14484,276.48,283.15,False,0,43.7089958,-79.3870468
34_0_34A,8903,34,true,1585434110,74,20,280.02,14484,276.48,283.15,False,0,43.7089958,-79.3870468
34_0_34A,8903,34,true,1585434139,74,1,280.02,14484,276.48,283.15,False,0,43.7090721,-79.3865585
34_0_34A,8903,34,true,1585434140,74,1,280.02,14484,276.48,283.15,False,0,43.7090721,-79.3865585
34_0_34A,8903,34,true,1585434170,74,26,280.17,14484,277.59,283.15,False,0,43.7096557,-79.3839416
34_0_34A,8903,34,true,1585434169,74,26,280.17,14484,277.59,283.15,False,0,43.7096557,-79.3839416
34_0_34A,8903,34,true,1585434200,76,13,280.17,14484,277.59,283.15,False,0,43.7098999,-79.3824615
34_0_34A,8903,34,true,1585434199,76,13,280.17,14484,277.59,283.15,False,0,43.7098999,-79.3824615
34_0_34A,8903,34,true,1585434229,71,14,280.17,14484,277.59,283.15,False,0,43.7099952,-79.3821525
34_0_34A,8903,34,true,1585434230,71,14,280.17,14484,277.59,283.15,False,0,43.7099952,-79.3821525
34_0_34A,8903,34,true,1585434260,74,23,280.17,14484,277.59,283.15,False,0,43.7103782,-79.3803571
34_0_34A,8903,34,true,1585434259,74,23,280.17,14484,277.59,283.15,False,0,43.7103782,-79.3803571
34_0_34A,8903,34,true,1585434289,74,13,280.17,14484,277.59,283.15,False,0,43.7107795,-79.3782731
34_0_34A,8903,34,true,1585434290,74,13,280.17,14484,277.59,283.15,False,0,43.7107795,-79.3782731
34_0_34A,8903,34,true,1585434319,75,0,280.17,14484,277.59,283.15,False,0,43.7108756,-79.3778466
34_0_34A,8903,34,true,1585434320,75,0,280.17,14484,277.59,283.15,False,0,43.7108756,-79.3778466
34_0_34A,8903,34,true,1585434350,75,0,280.17,14484,277.59,283.15,False,0,43.7108756,-79.3778466
34_0_34A,8903,34,true,1585434349,75,0,280.17,14484,277.59,283.15,False,0,43.7108756,-79.3778466
34_0_34A,8903,34,true,1585434379,75,0,280.17,14484,277.59,283.15,False,0,43.7108756,-79.3778466
34_0_34A,8903,34,true,1585434409,74,20,280.17,14484,277.59,283.15,False,0,43.711171,-79.3761331
34_0_34A,8903,34,true,1585434410,74,20,280.17,14484,277.59,283.15,False,0,43.711171,-79.3761331
34_0_34A,8903,34,true,1585434439,74,19,280.17,14484,277.59,283.15,False,0,43.7113306,-79.375493
34_0_34A,8903,34,true,1585434440,74,19,280.17,14484,277.59,283.15,False,0,43.7113306,-79.375493
34_0_34A,8903,34,true,1585434469,74,31,280.17,14484,277.59,283.15,False,0,43.7120807,-79.3720945
34_0_34A,8903,34,true,1585434470,74,31,280.17,14484,277.59,283.15,False,0,43.7120807,-79.3720945
34_0_34A,8903,34,true,1585434499,73,29,280.17,14484,277.59,283.15,False,0,43.7127635,-79.3684933
34_0_34A,8903,34,true,1585434500,73,29,280.17,14484,277.59,283.15,False,0,43.7127635,-79.3684933
34_0_34A,8903,34,true,1585434530,76,16,280.17,14484,277.59,283.15,False,0,43.7132694,-79.3659974
34_0_34A,8903,34,true,1585434560,70,14,280.17,14484,277.59,283.15,False,0,43.7133712,-79.3653717
34_0_34A,8903,34,true,1585434559,70,14,280.17,14484,277.59,283.15,False,0,43.7133712,-79.3653717
34_0_34A,8903,34,true,1585434589,74,7,280.17,14484,277.59,283.15,False,0,43.7134426,-79.3651462
34_0_34A,8903,34,true,1585434590,74,7,280.17,14484,277.59,283.15,False,0,43.7134426,-79.3651462
34_0_34A,8903,34,true,1585434619,74,23,280.17,14484,277.59,283.15,False,0,43.7138206,-79.3631201
34_0_34A,8903,34,true,1585434620,74,23,280.17,14484,277.59,283.15,False,0,43.7138206,-79.3631201
34_0_34A,8903,34,true,1585434650,74,0,280.17,14484,277.59,283.15,False,0,43.7139167,-79.3624954
34_0_34A,8903,34,true,1585434649,74,0,280.17,14484,277.59,283.15,False,0,43.7139167,-79.3624954
34_0_34A,8903,34,true,1585434680,76,17,280.17,14484,277.59,283.15,False,0,43.714356,-79.3605157
34_0_34A,8903,34,true,1585434679,76,17,280.17,14484,277.59,283.15,False,0,43.714356,-79.3605157
34_0_34A,8903,34,true,1585434710,64,26,279.97,14484,277.04,282.04,False,0,43.7150392,-79.3579493
34_0_34A,8903,34,true,1585434739,80,31,280.19,14484,277.59,283.15,False,0,43.7156477,-79.3548116
34_0_34A,8903,34,true,1585434740,80,31,280.19,14484,277.59,283.15,False,0,43.7156477,-79.3548116
34_0_34A,8903,34,true,1585434770,69,29,280.19,14484,277.59,283.15,False,0,43.7166125,-79.3513296
34_0_34A,8903,34,true,1585434800,67,14,280.19,14484,277.59,283.15,False,0,43.7169661,-79.3500453
34_0_34A,8903,34,true,1585434799,67,14,280.19,14484,277.59,283.15,False,0,43.7169661,-79.3500453
34_0_34A,8903,34,true,1585434830,65,29,280.19,14484,277.59,283.15,False,0,43.7177117,-79.3477808
34_0_34A,8903,34,true,1585434829,65,29,280.19,14484,277.59,283.15,False,0,43.7177117,-79.3477808
34_0_34A,8903,34,true,1585434860,65,28,279.99,14484,277.04,282.04,False,0,43.7186718,-79.3446611
34_0_34A,8903,34,true,1585434859,65,28,279.99,14484,277.04,282.04,False,0,43.7186718,-79.3446611
34_0_34A,8903,34,true,1585434890,71,32,279.99,14484,277.04,282.04,False,0,43.7196975,-79.3413365
34_0_34A,8903,34,true,1585434920,78,0,279.99,14484,277.04,282.04,False,0,43.7204625,-79.3389541
34_0_34A,8903,34,true,1585434919,78,0,279.99,14484,277.04,282.04,False,0,43.7204625,-79.3389541
34_0_34A,8903,34,true,1585434949,67,24,279.99,14484,277.04,282.04,False,0,43.7206583,-79.338322
34_0_34A,8903,34,true,1585434950,67,24,279.99,14484,277.04,282.04,False,0,43.7206583,-79.338322
34_0_34A,8903,34,true,1585434980,65,0,279.99,14484,277.04,282.04,False,0,43.7205824,-79.3376687
34_0_34A,8903,34,true,1585434979,65,0,279.99,14484,277.04,282.04,False,0,43.7205824,-79.3376687
34_0_34A,8903,34,true,1585435009,64,27,279.99,14484,277.04,282.04,False,0,43.7214216,-79.3358431
34_0_34A,8903,34,true,1585435010,64,27,279.99,14484,277.04,282.04,False,0,43.7214216,-79.3358431
34_0_34A,8903,34,true,1585435039,68,26,280.02,14484,277.59,282.04,False,0,43.7222394,-79.3329803
34_0_34A,8903,34,true,1585435040,68,26,280.02,14484,277.59,282.04,False,0,43.7222394,-79.3329803
34_0_34A,8903,34,true,1585435070,66,9,280.02,14484,277.59,282.04,False,0,43.7225093,-79.3321306
34_0_34A,8903,34,true,1585435069,66,9,280.02,14484,277.59,282.04,False,0,43.7225093,-79.3321306
34_0_34A,8903,34,true,1585435100,70,30,280.02,14484,277.59,282.04,False,0,43.7233923,-79.3288012
34_0_34A,8903,34,true,1585435130,71,29,280.02,14484,277.59,282.04,False,0,43.7243171,-79.3255758
34_0_34A,8903,34,true,1585435129,71,29,280.02,14484,277.59,282.04,False,0,43.7243171,-79.3255758
34_0_34A,8903,34,true,1585435160,70,0,280.02,14484,277.59,282.04,False,0,43.7247202,-79.3240299
34_0_34A,8903,34,true,1585435159,70,0,280.02,14484,277.59,282.04,False,0,43.7247202,-79.3240299
34_0_34A,8903,34,true,1585435190,70,0,280.02,14484,277.59,282.04,False,0,43.7247202,-79.3240299
34_0_34A,8903,34,true,1585435189,70,0,280.02,14484,277.59,282.04,False,0,43.7247202,-79.3240299
34_0_34A,8903,34,true,1585435219,70,30,280.04,14484,277.59,282.04,False,0,43.7252564,-79.3220036
34_0_34A,8903,34,true,1585435220,70,30,280.04,14484,277.59,282.04,False,0,43.7252564,-79.3220036
34_0_34A,8903,34,true,1585435250,76,11,280.04,14484,277.59,282.04,False,0,43.7259625,-79.318699
34_0_34A,8903,34,true,1585435280,87,26,280.04,14484,277.59,282.04,False,0,43.7262826,-79.3163214
34_0_34A,8903,34,true,1585435279,87,26,280.04,14484,277.59,282.04,False,0,43.7262826,-79.3163214
34_0_34A,8903,34,true,1585435310,103,9,280.03,14484,277.59,282.04,False,0,43.7261336,-79.3142873
34_0_34A,8903,34,true,1585435309,103,9,280.03,14484,277.59,282.04,False,0,43.7261336,-79.3142873
34_0_34A,8903,34,true,1585435340,96,0,280.03,14484,277.59,282.04,False,0,43.7261043,-79.3141805
34_0_34A,8903,34,true,1585435339,96,0,280.03,14484,277.59,282.04,False,0,43.7261043,-79.3141805
34_0_34A,8903,34,true,1585435370,96,0,280.03,14484,277.59,282.04,False,0,43.7261043,-79.3141805
34_0_34A,8903,34,true,1585435400,96,0,280.03,14484,277.59,282.04,False,0,43.7261043,-79.3141805
34_0_34A,8903,34,true,1585435430,100,24,280.03,14484,277.59,282.04,False,0,43.7259148,-79.3128016
34_0_34A,8903,34,true,1585435459,102,31,280.03,14484,277.59,282.04,False,0,43.7254489,-79.3096869
34_0_34A,8903,34,true,1585435460,102,31,280.03,14484,277.59,282.04,False,0,43.7254489,-79.3096869
34_0_34A,8903,34,true,1585435490,101,19,280,14484,277.59,282.04,False,0,43.7249375,-79.3068203
34_0_34A,8903,34,true,1585435489,101,19,280,14484,277.59,282.04,False,0,43.7249375,-79.3068203
34_0_34A,8903,34,true,1585435520,100,18,280,14484,277.59,282.04,False,0,43.7249389,-79.3068079
34_0_34A,8903,34,true,1585435550,90,19,280,14484,277.59,282.04,False,0,43.7246831,-79.304047
34_0_34A,8903,34,true,1585435549,90,19,280,14484,277.59,282.04,False,0,43.7246831,-79.304047
34_0_34A,8903,34,true,1585435580,81,16,280,14484,277.59,282.04,False,0,43.7246828,-79.3026299
34_0_34A,8903,34,true,1585435579,81,16,280,14484,277.59,282.04,False,0,43.7246828,-79.3026299
34_0_34A,8903,34,true,1585435610,80,13,280,14484,277.59,282.04,False,0,43.7247258,-79.3018035
34_0_34A,8903,34,true,1585435640,65,0,280,14484,277.59,282.04,False,0,43.7248062,-79.301434
34_0_34A,8903,34,true,1585435670,74,21,280,14484,277.59,282.04,False,0,43.7248977,-79.3008784
34_0_34A,8903,34,true,1585435700,74,2,280.02,14484,277.59,282.04,False,0,43.7254019,-79.2985259
34_0_34A,8903,34,true,1585435699,74,2,280.02,14484,277.59,282.04,False,0,43.7254019,-79.2985259
34_0_34A,8903,34,true,1585435730,72,5,280.02,14484,277.59,282.04,False,0,43.7254447,-79.298336
34_0_34A,8903,34,true,1585435760,76,0,280.02,14484,277.59,282.04,False,0,43.7254791,-79.2981848
34_0_34A,8903,34,true,1585435790,70,26,280.02,14484,277.59,282.04,False,0,43.7259161,-79.2958583
34_0_34A,8903,34,true,1585435820,72,16,280,14484,277.59,282.04,False,0,43.7266251,-79.2925738
34_0_34A,8903,34,true,1585435850,73,19,280,14484,277.59,282.04,False,0,43.726773,-79.2918486
34_0_34A,8903,34,true,1585435851,73,19,280,14484,277.59,282.04,False,0,43.726773,-79.2918486
34_0_34A,8903,34,true,1585435880,73,0,280,14484,277.59,282.04,False,0,43.7269599,-79.2912826
34_0_34A,8903,34,true,1585435910,72,20,280,14484,277.59,282.04,False,0,43.7274788,-79.2889147
34_0_34A,8903,34,true,1585435940,73,22,280,14484,277.59,282.04,False,0,43.7280443,-79.2866946
34_0_34A,8903,34,true,1585435941,73,22,280,14484,277.59,282.04,False,0,43.7280443,-79.2866946
34_0_34A,8903,34,true,1585435970,72,20,280,14484,277.59,282.04,False,0,43.7285132,-79.2844937
34_0_34A,8903,34,true,1585436000,73,20,280,14484,277.59,282.04,False,0,43.7291067,-79.2818941
34_0_34A,8903,34,true,1585436030,72,21,280,14484,277.59,282.04,False,0,43.7292622,-79.2807003
34_0_34A,8903,34,true,1585436060,74,0,280,14484,277.59,282.04,False,0,43.7297157,-79.2788047
34_0_34A,8903,34,true,1585436090,74,0,280,14484,277.59,282.04,False,0,43.7297169,-79.2787857
34_0_34A,8903,34,true,1585436091,74,0,280,14484,277.59,282.04,False,0,43.7297169,-79.2787857
34_0_34A,8903,34,true,1585436120,72,22,280,14484,277.59,282.04,False,0,43.7298372,-79.2780259
34_0_34A,8903,34,true,1585436121,72,22,280,14484,277.59,282.04,False,0,43.7298372,-79.2780259
34_0_34A,8903,34,true,1585436150,73,0,280,14484,277.59,282.04,False,0,43.7302349,-79.2765498
34_0_34A,8903,34,true,1585436180,73,22,280,14484,277.59,282.04,False,0,43.7305016,-79.2753413
34_0_34A,8903,34,true,1585436181,73,22,280,14484,277.59,282.04,False,0,43.7305016,-79.2753413
34_0_34A,8903,34,true,1585436210,71,28,279.99,14484,277.59,282.04,False,0,43.7313728,-79.2711296
34_0_34A,8903,34,true,1585436211,71,28,279.99,14484,277.59,282.04,False,0,43.7313728,-79.2711296
34_0_34A,8903,34,true,1585436240,71,10,279.99,14484,277.59,282.04,False,0,43.7319071,-79.2688339
34_0_34A,8903,34,true,1585436271,72,0,279.99,14484,277.59,282.04,False,0,43.7319163,-79.2687747
34_0_34A,8903,34,true,1585436270,72,0,279.99,14484,277.59,282.04,False,0,43.7319163,-79.2687747
34_0_34A,8903,34,true,1585436300,73,20,279.99,14484,277.59,282.04,False,0,43.732211,-79.267723
34_0_34A,8903,34,true,1585436301,73,20,279.99,14484,277.59,282.04,False,0,43.732211,-79.267723
34_0_34A,8903,34,true,1585436330,61,24,279.99,14484,277.59,282.04,False,0,43.7324449,-79.2655331
34_0_34A,8903,34,true,1585436331,61,24,279.99,14484,277.59,282.04,False,0,43.7324449,-79.2655331
34_0_34A,8903,34,true,1585436360,74,0,279.98,14484,277.59,282.04,False,0,43.7327588,-79.2645705
34_0_34A,8903,34,true,1585436361,74,0,279.98,14484,277.59,282.04,False,0,43.7327588,-79.2645705
34_0_34A,8903,34,true,1585436390,53,8,280,14484,277.59,282.04,False,0,43.7328962,-79.263961
34_0_34A,8903,34,true,1585436420,72,0,280,14484,277.59,282.04,False,0,43.7329262,-79.2638285
34_0_34A,8903,34,true,1585436450,72,0,280,14484,277.59,282.04,False,0,43.7329262,-79.2638285
34_0_34A,8903,34,true,1585436451,72,0,280,14484,277.59,282.04,False,0,43.7329262,-79.2638285
34_0_34A,8903,34,true,1585436481,72,0,280,14484,277.59,282.04,False,0,43.7329262,-79.2638285
34_0_34A,8903,34,true,1585436480,72,0,280,14484,277.59,282.04,False,0,43.7329262,-79.2638285
34_0_34A,8903,34,true,1585436510,72,0,280,14484,277.59,282.04,False,0,43.7329262,-79.2638285
34_0_34A,8903,34,true,1585436511,72,0,280,14484,277.59,282.04,False,0,43.7329262,-79.2638285
34_0_34A,8903,34,true,1585436540,72,0,280,14484,277.59,282.04,False,0,43.7329262,-79.2638285
34_0_34A,8903,34,true,1585436541,72,0,280,14484,277.59,282.04,False,0,43.7329262,-79.2638285
34_0_34A,8903,34,true,1585436570,72,0,280,14484,277.59,282.04,False,0,43.7329262,-79.2638285
34_0_34A,8903,34,true,1585436571,72,0,280,14484,277.59,282.04,False,0,43.7329262,-79.2638285
34_0_34A,8903,34,true,1585436600,72,0,280,14484,277.59,282.04,False,0,43.7329262,-79.2638285
34_0_34A,8903,34,true,1585436601,72,0,280,14484,277.59,282.04,False,0,43.7329262,-79.2638285
34_0_34A,8903,34,true,1585436632,72,0,280,14484,277.59,282.04,False,0,43.7329262,-79.2638285
34_0_34A,8903,34,true,1585436633,72,0,280,14484,277.59,282.04,False,0,43.7329262,-79.2638285
34_0_34A,8903,34,true,1585436660,246,11,280,14484,277.59,282.04,False,0,43.732809,-79.2632179
34_0_34A,8903,34,true,1585439541,76,17,279.53,14484,277.59,281.48,False,0,43.7066307,-79.3988265
34_0_34A,8903,34,true,1585439571,77,13,279.53,14484,277.59,281.48,False,0,43.7067756,-79.3981094
34_0_34A,8903,34,true,1585439572,77,13,279.53,14484,277.59,281.48,False,0,43.7067756,-79.3981094
34_0_34A,8903,34,true,1585439601,73,15,279.53,14484,277.59,281.48,False,0,43.7070541,-79.39682
34_0_34A,8903,34,true,1585439631,70,21,279.49,14484,277.59,281.15,False,0,43.7074165,-79.3949966
34_0_34A,8903,34,true,1585439661,76,18,279.49,14484,277.59,281.15,False,0,43.707695,-79.3933868
34_0_34A,8903,34,true,1585439662,76,18,279.49,14484,277.59,281.15,False,0,43.707695,-79.3933868
34_0_34A,8903,34,true,1585439691,74,0,279.49,14484,277.59,281.15,False,0,43.707756,-79.3929367
34_0_34A,8903,34,true,1585439721,78,17,279.49,14484,277.59,281.15,False,0,43.7081411,-79.3914333
34_0_34A,8903,34,true,1585439751,74,0,279.49,14484,277.59,281.15,False,0,43.7083079,-79.3906302
34_0_34A,8903,34,true,1585439752,74,0,279.49,14484,277.59,281.15,False,0,43.7083079,-79.3906302
34_0_34A,8903,34,true,1585439781,74,0,279.49,14484,277.59,281.15,False,0,43.7083079,-79.3906302
34_0_34A,8903,34,true,1585439811,74,13,279.49,14484,277.59,281.15,False,0,43.7084407,-79.3899752
34_0_34A,8903,34,true,1585439812,74,13,279.49,14484,277.59,281.15,False,0,43.7084407,-79.3899752
34_0_34A,8903,34,true,1585439841,73,23,279.49,14484,277.59,281.15,False,0,43.708897,-79.3874887
34_0_34A,8903,34,true,1585439871,75,27,279.53,14484,277.59,281.48,False,0,43.7095855,-79.3842607
34_0_34A,8903,34,true,1585439901,72,25,279.53,14484,277.59,281.48,False,0,43.7100044,-79.3821311
34_0_34A,8903,34,true,1585439931,78,22,279.53,14484,277.59,281.48,False,0,43.7106972,-79.3787055
34_0_34A,8903,34,true,1585439962,75,0,279.53,14484,277.59,281.48,False,0,43.7109247,-79.3776132
34_0_34A,8903,34,true,1585439961,75,0,279.47,14484,277.59,281.15,False,0,43.7109247,-79.3776132
34_0_34A,8903,34,true,1585439992,73,19,279.47,14484,277.59,281.15,False,0,43.7110413,-79.3769921
34_0_34A,8903,34,true,1585439991,73,19,279.47,14484,277.59,281.15,False,0,43.7110413,-79.3769921
34_0_34A,8903,34,true,1585440021,75,19,279.47,14484,277.59,281.15,False,0,43.7113165,-79.3755476
34_0_34A,8903,34,true,1585440022,75,19,279.47,14484,277.59,281.15,False,0,43.7113165,-79.3755476
34_0_34A,8903,34,true,1585440051,74,24,279.45,14484,277.59,281.15,False,0,43.7119317,-79.3728482
34_0_34A,8903,34,true,1585440081,75,24,279.45,14484,277.59,281.15,False,0,43.7123336,-79.3703613
34_0_34A,8903,34,true,1585440111,73,26,279.45,14484,277.59,281.15,False,0,43.7130432,-79.3671312
34_0_34A,8903,34,true,1585440112,73,26,279.45,14484,277.59,281.15,False,0,43.7130432,-79.3671312
34_0_34A,8903,34,true,1585440141,74,0,279.45,14484,277.59,281.15,False,0,43.7133017,-79.3657908
34_0_34A,8903,34,true,1585440172,73,16,279.45,14484,277.59,281.15,False,0,43.7134316,-79.3651809
34_0_34A,8903,34,true,1585440171,73,16,279.45,14484,277.59,281.15,False,0,43.7134316,-79.3651809
34_0_34A,8903,34,true,1585440202,74,25,279.45,14484,277.59,281.15,False,0,43.7137732,-79.3634206
34_0_34A,8903,34,true,1585440201,74,25,279.45,14484,277.59,281.15,False,0,43.7137732,-79.3634206
34_0_34A,8903,34,true,1585440231,74,0,279.45,14484,277.59,281.15,False,0,43.7139879,-79.3623361
34_0_34A,8903,34,true,1585440261,76,19,279.45,14484,277.59,281.15,False,0,43.7143548,-79.3605231
34_0_34A,8903,34,true,1585440291,67,19,279.45,14484,277.59,281.15,False,0,43.714695,-79.359387
34_0_34A,8903,34,true,1585440292,67,19,279.45,14484,277.59,281.15,False,0,43.714695,-79.359387
34_0_34A,8903,34,true,1585440322,75,26,279.47,14484,277.59,281.15,False,0,43.7152494,-79.3568753
34_0_34A,8903,34,true,1585440321,75,26,279.47,14484,277.59,281.15,False,0,43.7152494,-79.3568753
34_0_34A,8903,34,true,1585440351,66,28,279.49,14484,277.59,281.15,False,0,43.7158576,-79.3539449
34_0_34A,8903,34,true,1585440352,66,28,279.49,14484,277.59,281.15,False,0,43.7158576,-79.3539449
34_0_34A,8903,34,true,1585440381,68,30,279.49,14484,277.59,281.15,False,0,43.7164662,-79.3517853
34_0_34A,8903,34,true,1585440411,64,31,279.49,14484,277.59,281.15,False,0,43.7174668,-79.3486501
34_0_34A,8903,34,true,1585440412,64,31,279.49,14484,277.59,281.15,False,0,43.7174668,-79.3486501
34_0_34A,8903,34,true,1585440441,70,34,279.49,14484,277.59,281.15,False,0,43.7184626,-79.3453272
34_0_34A,8903,34,true,1585440442,70,34,279.49,14484,277.59,281.15,False,0,43.7184626,-79.3453272
34_0_34A,8903,34,true,1585440471,66,29,279.44,14484,277.59,281.15,False,0,43.719182,-79.3430908
34_0_34A,8903,34,true,1585440501,67,19,279.44,14484,277.59,281.15,False,0,43.7204251,-79.3390769
34_0_34A,8903,34,true,1585440502,67,19,279.44,14484,277.59,281.15,False,0,43.7204251,-79.3390769
34_0_34A,8903,34,true,1585440531,78,0,279.44,14484,277.59,281.15,False,0,43.7205491,-79.3386824
34_0_34A,8903,34,true,1585440532,78,0,279.44,14484,277.59,281.15,False,0,43.7205491,-79.3386824
34_0_34A,8903,34,true,1585440562,67,21,279.44,14484,277.59,281.15,False,0,43.7206028,-79.3376335
34_0_34A,8903,34,true,1585440561,67,21,279.44,14484,277.59,281.15,False,0,43.7206028,-79.3376335
34_0_34A,8903,34,true,1585440591,64,28,279.44,14484,277.59,281.15,False,0,43.7215504,-79.3354244
34_0_34A,8903,34,true,1585440622,67,25,279.42,14484,277.59,281.15,False,0,43.7224401,-79.3322452
34_0_34A,8903,34,true,1585440621,67,25,279.42,14484,277.59,281.15,False,0,43.7224401,-79.3322452
34_0_34A,8903,34,true,1585440651,69,0,279.42,14484,277.59,281.15,False,0,43.7226149,-79.3319043
34_0_34A,8903,34,true,1585440681,69,0,279.42,14484,277.59,281.15,False,0,43.7226149,-79.3319043
34_0_34A,8903,34,true,1585440711,71,26,279.42,14484,277.59,281.15,False,0,43.7232335,-79.3295389
34_0_34A,8903,34,true,1585440712,71,26,279.42,14484,277.59,281.15,False,0,43.7232335,-79.3295389
34_0_34A,8903,34,true,1585440742,71,28,279.42,14484,277.59,281.15,False,0,43.7239806,-79.3268644
34_0_34A,8903,34,true,1585440741,71,28,279.42,14484,277.59,281.15,False,0,43.7239806,-79.3268644
34_0_34A,8903,34,true,1585440771,68,28,279.42,14484,277.59,281.15,False,0,43.7247846,-79.3237863
34_0_34A,8903,34,true,1585440772,68,28,279.42,14484,277.59,281.15,False,0,43.7247846,-79.3237863
34_0_34A,8903,34,true,1585440801,71,33,279.42,14484,277.59,281.15,False,0,43.725677,-79.3203744
34_0_34A,8903,34,true,1585440831,81,26,279.42,14484,277.59,281.15,False,0,43.7262309,-79.3173051
34_0_34A,8903,34,true,1585440861,100,21,279.42,14484,277.59,281.15,False,0,43.7261333,-79.3142852
34_0_34A,8903,34,true,1585440862,100,21,279.42,14484,277.59,281.15,False,0,43.7261333,-79.3142852
34_0_34A,8903,34,true,1585440891,36,0,279.42,14484,277.59,281.15,False,0,43.7259193,-79.3137045
34_0_34A,8903,34,true,1585440892,36,0,279.42,14484,277.59,281.15,False,0,43.7259193,-79.3137045
34_0_34A,8903,34,true,1585440921,36,0,279.42,14484,277.59,281.15,False,0,43.7259193,-79.3137045
34_0_34A,8903,34,true,1585440922,36,0,279.42,14484,277.59,281.15,False,0,43.7259193,-79.3137045
34_0_34A,8903,34,true,1585440951,36,0,279.42,14484,277.59,281.15,False,0,43.7259193,-79.3137045
34_0_34A,8903,34,true,1585440981,100,24,279.42,14484,277.59,281.15,False,0,43.7258301,-79.3122916
34_0_34A,8903,34,true,1585440982,100,24,279.42,14484,277.59,281.15,False,0,43.7258301,-79.3122916
34_0_34A,8903,34,true,1585441011,102,32,279.42,14484,277.59,281.15,False,0,43.7253203,-79.3088221
34_0_34A,8903,34,true,1585441012,102,32,279.42,14484,277.59,281.15,False,0,43.7253203,-79.3088221
34_0_34A,8903,34,true,1585441041,101,33,279.38,14484,277.59,281.15,False,0,43.7248236,-79.3055512
34_0_34A,8903,34,true,1585441042,101,33,279.38,14484,277.59,281.15,False,0,43.7248236,-79.3055512
34_0_34A,8903,34,true,1585441071,87,15,279.4,14484,277.59,281.15,False,0,43.7246828,-79.3026299
34_0_34A,8903,34,true,1585441072,87,15,279.4,14484,277.59,281.15,False,0,43.7246828,-79.3026299
34_0_34A,8903,34,true,1585441101,90,0,279.4,14484,277.59,281.15,False,0,43.72467,-79.302536
34_0_34A,8903,34,true,1585441131,65,0,279.4,14484,277.59,281.15,False,0,43.7247972,-79.3015034
34_0_34A,8903,34,true,1585441132,65,0,279.4,14484,277.59,281.15,False,0,43.7247972,-79.3015034
34_0_34A,8903,34,true,1585441162,81,19,279.4,14484,277.59,281.15,False,0,43.7248743,-79.3010132
34_0_34A,8903,34,true,1585441161,81,19,279.4,14484,277.59,281.15,False,0,43.7248743,-79.3010132
34_0_34A,8903,34,true,1585441192,76,0,279.4,14484,277.59,281.15,False,0,43.7249334,-79.3006759
34_0_34A,8903,34,true,1585441191,76,0,279.4,14484,277.59,281.15,False,0,43.7249334,-79.3006759
34_0_34A,8903,34,true,1585441221,71,25,279.42,14484,277.59,281.15,False,0,43.7254747,-79.2982039
34_0_34A,8903,34,true,1585441222,71,25,279.42,14484,277.59,281.15,False,0,43.7254747,-79.2982039
34_0_34A,8903,34,true,1585441251,72,6,279.42,14484,277.59,281.15,False,0,43.7256576,-79.297437
34_0_34A,8903,34,true,1585441252,72,6,279.42,14484,277.59,281.15,False,0,43.7256576,-79.297437
34_0_34A,8903,34,true,1585441282,76,0,279.42,14484,277.59,281.15,False,0,43.7256576,-79.297437
34_0_34A,8903,34,true,1585441281,76,0,279.42,14484,277.59,281.15,False,0,43.7256576,-79.297437
34_0_34A,8903,34,true,1585441311,73,26,279.42,14484,277.59,281.15,False,0,43.7258974,-79.2959264
34_0_34A,8903,34,true,1585441312,73,26,279.42,14484,277.59,281.15,False,0,43.7258974,-79.2959264
34_0_34A,8903,34,true,1585441341,74,29,279.39,14484,277.59,281.15,False,0,43.7266055,-79.2926996
34_0_34A,8903,34,true,1585441342,74,29,279.39,14484,277.59,281.15,False,0,43.7266055,-79.2926996
34_0_34A,8903,34,true,1585441372,73,0,279.39,14484,277.59,281.15,False,0,43.726949,-79.2914115
34_0_34A,8903,34,true,1585441402,73,0,279.39,14484,277.59,281.15,False,0,43.726949,-79.2914115
34_0_34A,8903,34,true,1585441401,73,0,279.39,14484,277.59,281.15,False,0,43.726949,-79.2914115
34_0_34A,8903,34,true,1585441431,73,0,279.39,14484,277.59,281.15,False,0,43.7271143,-79.2904953
34_0_34A,8903,34,true,1585441432,73,0,279.39,14484,277.59,281.15,False,0,43.7271143,-79.2904953
34_0_34A,8903,34,true,1585441462,72,23,279.39,14484,277.59,281.15,False,0,43.7274866,-79.2888592
34_0_34A,8903,34,true,1585441461,72,23,279.39,14484,277.59,281.15,False,0,43.7274866,-79.2888592
34_0_34A,8903,34,true,1585441492,73,0,279.39,14484,277.59,281.15,False,0,43.7276344,-79.287857
34_0_34A,8903,34,true,1585441491,73,0,279.39,14484,277.59,281.15,False,0,43.7276344,-79.287857
34_0_34A,8903,34,true,1585441521,72,25,279.39,14484,277.59,281.15,False,0,43.7281787,-79.2859492
34_0_34A,8903,34,true,1585441551,73,25,279.39,14484,277.59,281.15,False,0,43.7286729,-79.2834233
34_0_34A,8903,34,true,1585441552,73,25,279.39,14484,277.59,281.15,False,0,43.7286729,-79.2834233
34_0_34A,8903,34,true,1585441582,73,26,279.39,14484,277.59,281.15,False,0,43.7292737,-79.2806831
34_0_34A,8903,34,true,1585441581,73,26,279.39,14484,277.59,281.15,False,0,43.7292737,-79.2806831
34_0_34A,8903,34,true,1585441611,76,24,279.39,14484,277.59,281.15,False,0,43.7298468,-79.2780115
34_0_34A,8903,34,true,1585441612,76,24,279.39,14484,277.59,281.15,False,0,43.7298468,-79.2780115
34_0_34A,8903,34,true,1585441642,72,26,279.39,14484,277.59,281.15,False,0,43.7304936,-79.2753783
34_0_34A,8903,34,true,1585441641,72,26,279.39,14484,277.59,281.15,False,0,43.7304936,-79.2753783
34_0_34A,8903,34,true,1585441672,71,21,279.11,14484,277.59,280.37,False,0,43.7310584,-79.2729003
34_0_34A,8903,34,true,1585441701,71,4,279.11,14484,277.59,280.37,False,0,43.7312736,-79.2712783
34_0_34A,8903,34,true,1585441702,71,4,279.11,14484,277.59,280.37,False,0,43.7312736,-79.2712783
34_0_34A,8903,34,true,1585441731,72,27,279.11,14484,277.59,280.37,False,0,43.7318181,-79.269396
34_0_34A,8903,34,true,1585441732,72,27,279.11,14484,277.59,280.37,False,0,43.7318181,-79.269396
34_0_34A,8903,34,true,1585441764,70,0,279.11,14484,277.59,280.37,False,0,43.7320847,-79.2680878
34_0_34A,8903,34,true,1585441765,70,0,279.11,14484,277.59,280.37,False,0,43.7320847,-79.2680878
34_0_34A,8903,34,true,1585441792,70,0,279.11,14484,277.59,280.37,False,0,43.7320847,-79.2680878
34_0_34A,8903,34,true,1585441791,70,0,279.11,14484,277.59,280.37,False,0,43.7320847,-79.2680878
34_0_34A,8903,34,true,1585441822,70,0,279.11,14484,277.59,280.37,False,0,43.7320847,-79.2680878
34_0_34A,8903,34,true,1585441821,70,0,279.11,14484,277.59,280.37,False,0,43.7320847,-79.2680878
34_0_34A,8903,34,true,1585441852,96,21,279.11,14484,277.59,280.37,False,0,43.7324133,-79.2666696
34_0_34A,8903,34,true,1585441851,96,21,279.11,14484,277.59,280.37,False,0,43.7324133,-79.2666696
34_0_34A,8903,34,true,1585441881,74,0,279,14484,277.59,279.82,False,0,43.7327601,-79.2645647
34_0_34A,8903,34,true,1585441882,74,0,279,14484,277.59,279.82,False,0,43.7327601,-79.2645647
34_0_34A,8903,34,true,1585441912,72,0,279,14484,277.59,279.82,False,0,43.7329359,-79.2637855
34_0_34A,8903,34,true,1585441911,72,0,279,14484,277.59,279.82,False,0,43.7329359,-79.2637855
34_0_34A,8903,34,true,1585441942,72,0,279,14484,277.59,279.82,False,0,43.7329359,-79.2637855
34_0_34A,8903,34,true,1585441941,72,0,279,14484,277.59,279.82,False,0,43.7329359,-79.2637855
34_0_34A,8903,34,true,1585441971,51,5,279,14484,277.59,279.82,False,0,43.7329521,-79.2637138
34_0_34A,8903,34,true,1585441972,51,5,279,14484,277.59,279.82,False,0,43.7329521,-79.2637138
34_0_34A,8903,34,true,1585442002,291,16,279,14484,277.59,279.82,False,0,43.7335466,-79.2634783
34_0_34A,8903,34,true,1585444733,355,8,279.01,14484,277.59,280.37,False,0,43.7062149,-79.4001083
34_0_34A,8903,34,true,1585444734,355,8,279.01,14484,277.59,280.37,False,0,43.7062149,-79.4001083
34_0_34A,8903,34,true,1585444763,216,0,279.01,14484,277.59,280.37,False,0,43.7062149,-79.4001083
34_0_34A,8903,34,true,1585444764,216,0,279.01,14484,277.59,280.37,False,0,43.7062149,-79.4001083
34_0_34A,8903,34,true,1585444793,14,7,279.01,14484,277.59,280.37,False,0,43.7062301,-79.4001083
34_0_34A,8903,34,true,1585444823,75,13,279.01,14484,277.59,280.37,False,0,43.7066307,-79.3988265
34_0_34A,8903,34,true,1585444824,75,13,279.01,14484,277.59,280.37,False,0,43.7066307,-79.3988265
34_0_34A,8903,34,true,1585444853,76,21,278.97,14484,277.59,280.37,False,0,43.7070236,-79.3969497
34_0_34A,8903,34,true,1585444854,76,21,278.97,14484,277.59,280.37,False,0,43.7070236,-79.3969497
34_0_34A,8903,34,true,1585444884,73,22,278.97,14484,277.59,280.37,False,0,43.7075958,-79.3941192
34_0_34A,8903,34,true,1585444883,73,22,278.97,14484,277.59,280.37,False,0,43.7075958,-79.3941192
34_0_34A,8903,34,true,1585444914,74,0,278.97,14484,277.59,280.37,False,0,43.707756,-79.3929367
34_0_34A,8903,34,true,1585444913,74,0,278.97,14484,277.59,280.37,False,0,43.707756,-79.3929367
34_0_34A,8903,34,true,1585444944,68,19,278.97,14484,277.59,280.37,False,0,43.7078247,-79.3927635
34_0_34A,8903,34,true,1585444943,68,19,278.97,14484,277.59,280.37,False,0,43.7078247,-79.3927635
34_0_34A,8903,34,true,1585444973,74,23,278.97,14484,277.59,280.37,False,0,43.7082523,-79.3908953
34_0_34A,8903,34,true,1585444974,74,23,278.97,14484,277.59,280.37,False,0,43.7082523,-79.3908953
34_0_34A,8903,34,true,1585445005,74,23,278.97,14484,277.59,280.37,False,0,43.7087651,-79.3883045
34_0_34A,8903,34,true,1585445033,75,6,278.97,14484,277.59,280.37,False,0,43.7092225,-79.3859797
34_0_34A,8903,34,true,1585445034,75,6,278.97,14484,277.59,280.37,False,0,43.7092225,-79.3859797
34_0_34A,8903,34,true,1585445063,74,14,278.97,14484,277.59,280.37,False,0,43.7095301,-79.3845226
34_0_34A,8903,34,true,1585445064,74,14,278.97,14484,277.59,280.37,False,0,43.7095301,-79.3845226
34_0_34A,8903,34,true,1585445093,74,28,278.97,14484,277.59,280.37,False,0,43.7103813,-79.3803421
34_0_34A,8903,34,true,1585445124,74,7,278.97,14484,277.59,280.37,False,0,43.7108459,-79.3779792
34_0_34A,8903,34,true,1585445123,74,7,278.97,14484,277.59,280.37,False,0,43.7108459,-79.3779792
34_0_34A,8903,34,true,1585445153,75,0,278.97,14484,277.59,280.37,False,0,43.7108876,-79.3777893
34_0_34A,8903,34,true,1585445154,75,0,278.97,14484,277.59,280.37,False,0,43.7108876,-79.3777893
34_0_34A,8903,34,true,1585445183,72,19,278.97,14484,277.59,280.37,False,0,43.7109821,-79.3773439
34_0_34A,8903,34,true,1585445184,72,19,278.97,14484,277.59,280.37,False,0,43.7109821,-79.3773439
34_0_34A,8903,34,true,1585445213,73,35,278.93,14484,277.59,280.37,False,0,43.7115077,-79.3747647
34_0_34A,8903,34,true,1585445214,73,35,278.93,14484,277.59,280.37,False,0,43.7115077,-79.3747647
34_0_34A,8903,34,true,1585445244,74,39,278.93,14484,277.59,280.37,False,0,43.7123351,-79.3703541
34_0_34A,8903,34,true,1585445243,74,39,278.93,14484,277.59,280.37,False,0,43.7123351,-79.3703541
34_0_34A,8903,34,true,1585445273,75,0,278.93,14484,277.59,280.37,False,0,43.7124557,-79.3697586
34_0_34A,8903,34,true,1585445303,73,44,278.93,14484,277.59,280.37,False,0,43.7130409,-79.3671367
34_0_34A,8903,34,true,1585445304,73,44,278.93,14484,277.59,280.37,False,0,43.7130409,-79.3671367
34_0_34A,8903,34,true,1585445333,75,0,278.93,14484,277.59,280.37,False,0,43.713517,-79.3649103
34_0_34A,8903,34,true,1585445334,75,0,278.93,14484,277.59,280.37,False,0,43.713517,-79.3649103
34_0_34A,8903,34,true,1585445364,75,0,278.93,14484,277.59,280.37,False,0,43.713517,-79.3649103
34_0_34A,8903,34,true,1585445363,75,0,278.93,14484,277.59,280.37,False,0,43.713517,-79.3649103
34_0_34A,8903,34,true,1585445394,75,13,278.93,14484,277.59,280.37,False,0,43.7135491,-79.3647703
34_0_34A,8903,34,true,1585445393,75,13,278.93,14484,277.59,280.37,False,0,43.7135491,-79.3647703
34_0_34A,8903,34,true,1585445424,74,31,278.93,14484,277.59,280.37,False,0,43.7142537,-79.3611369
34_0_34A,8903,34,true,1585445423,74,31,278.93,14484,277.59,280.37,False,0,43.7142537,-79.3611369
34_0_34A,8903,34,true,1585445453,69,33,278.92,14484,277.59,280.37,False,0,43.7151307,-79.3574965
34_0_34A,8903,34,true,1585445454,69,33,278.92,14484,277.59,280.37,False,0,43.7151307,-79.3574965
34_0_34A,8903,34,true,1585445484,74,29,278.93,14484,277.59,280.37,False,0,43.7157327,-79.3544446
34_0_34A,8903,34,true,1585445483,74,29,278.93,14484,277.59,280.37,False,0,43.7157327,-79.3544446
34_0_34A,8903,34,true,1585445513,68,27,278.93,14484,277.59,280.37,False,0,43.7165956,-79.3513813
34_0_34A,8903,34,true,1585445544,63,30,278.93,14484,277.59,280.37,False,0,43.7174398,-79.3487403
34_0_34A,8903,34,true,1585445543,63,30,278.93,14484,277.59,280.37,False,0,43.7174398,-79.3487403
34_0_34A,8903,34,true,1585445573,70,31,278.93,14484,277.59,280.37,False,0,43.718456,-79.345348
34_0_34A,8903,34,true,1585445574,70,31,278.93,14484,277.59,280.37,False,0,43.718456,-79.345348
34_0_34A,8903,34,true,1585445604,69,31,278.94,14484,277.59,280.37,False,0,43.719405,-79.342342
34_0_34A,8903,34,true,1585445603,69,31,278.94,14484,277.59,280.37,False,0,43.719405,-79.342342
34_0_34A,8903,34,true,1585445634,68,17,278.94,14484,277.59,280.37,False,0,43.7203781,-79.339246
34_0_34A,8903,34,true,1585445633,68,17,278.94,14484,277.59,280.37,False,0,43.7203781,-79.339246
34_0_34A,8903,34,true,1585445664,78,0,278.94,14484,277.59,280.37,False,0,43.7205314,-79.3387374
34_0_34A,8903,34,true,1585445663,78,0,278.94,14484,277.59,280.37,False,0,43.7205314,-79.3387374
34_0_34A,8903,34,true,1585445693,78,0,278.94,14484,277.59,280.37,False,0,43.7205314,-79.3387374
34_0_34A,8903,34,true,1585445694,78,0,278.94,14484,277.59,280.37,False,0,43.7205314,-79.3387374
34_0_34A,8903,34,true,1585445723,78,0,278.94,14484,277.59,280.37,False,0,43.7205314,-79.3387374
34_0_34A,8903,34,true,1585445724,78,0,278.94,14484,277.59,280.37,False,0,43.7205314,-79.3387374
34_0_34A,8903,34,true,1585445753,64,25,278.94,14484,277.59,280.37,False,0,43.7211546,-79.3366837
34_0_34A,8903,34,true,1585445754,64,25,278.94,14484,277.59,280.37,False,0,43.7211546,-79.3366837
34_0_34A,8903,34,true,1585445784,66,25,278.94,14484,277.59,280.37,False,0,43.7221199,-79.3335442
34_0_34A,8903,34,true,1585445783,66,25,278.94,14484,277.59,280.37,False,0,43.7221199,-79.3335442
34_0_34A,8903,34,true,1585445813,66,28,278.94,14484,277.59,280.37,False,0,43.7227002,-79.3316199
34_0_34A,8903,34,true,1585445814,66,28,278.94,14484,277.59,280.37,False,0,43.7227002,-79.3316199
34_0_34A,8903,34,true,1585445844,70,30,278.94,14484,277.59,280.37,False,0,43.7237615,-79.3277051
34_0_34A,8903,34,true,1585445843,70,30,278.94,14484,277.59,280.37,False,0,43.7237615,-79.3277051
34_0_34A,8903,34,true,1585445875,70,0,278.94,14484,277.59,280.37,False,0,43.724286,-79.3256961
34_0_34A,8903,34,true,1585445874,70,0,278.94,14484,277.59,280.37,False,0,43.724286,-79.3256961
34_0_34A,8903,34,true,1585445903,70,21,278.94,14484,277.59,280.37,False,0,43.7244363,-79.3251148
34_0_34A,8903,34,true,1585445904,70,21,278.94,14484,277.59,280.37,False,0,43.7244363,-79.3251148
34_0_34A,8903,34,true,1585445933,70,33,278.86,14484,277.59,279.82,False,0,43.7252611,-79.3219807
34_0_34A,8903,34,true,1585445934,70,33,278.86,14484,277.59,279.82,False,0,43.7252611,-79.3219807
34_0_34A,8903,34,true,1585445963,76,33,278.86,14484,277.59,279.82,False,0,43.7260347,-79.3182793
34_0_34A,8903,34,true,1585445964,76,33,278.86,14484,277.59,279.82,False,0,43.7260347,-79.3182793
34_0_34A,8903,34,true,1585445994,101,24,278.86,14484,277.59,279.82,False,0,43.7261316,-79.3142727
34_0_34A,8903,34,true,1585445993,101,24,278.86,14484,277.59,279.82,False,0,43.7261316,-79.3142727
34_0_34A,8903,34,true,1585446023,102,38,278.86,14484,277.59,279.82,False,0,43.7256357,-79.3110567
34_0_34A,8903,34,true,1585446024,102,38,278.86,14484,277.59,279.82,False,0,43.7256357,-79.3110567
34_0_34A,8903,34,true,1585446054,100,35,278.86,14484,277.59,279.82,False,0,43.7249398,-79.3067996
34_0_34A,8903,34,true,1585446053,100,35,278.86,14484,277.59,279.82,False,0,43.7249398,-79.3067996
34_0_34A,8903,34,true,1585446083,89,30,278.86,14484,277.59,279.82,False,0,43.7246799,-79.3030746
34_0_34A,8903,34,true,1585446084,89,30,278.86,14484,277.59,279.82,False,0,43.7246799,-79.3030746
34_0_34A,8903,34,true,1585446114,90,0,278.86,14484,277.59,279.82,False,0,43.7246788,-79.3026
34_0_34A,8903,34,true,1585446113,90,0,278.86,14484,277.59,279.82,False,0,43.7246788,-79.3026
34_0_34A,8903,34,true,1585446143,90,0,278.87,14484,277.59,279.82,False,0,43.7246788,-79.3026
34_0_34A,8903,34,true,1585446144,90,0,278.87,14484,277.59,279.82,False,0,43.7246788,-79.3026
34_0_34A,8903,34,true,1585446173,65,0,278.87,14484,277.59,279.82,False,0,43.7247714,-79.3016866
34_0_34A,8903,34,true,1585446174,65,0,278.87,14484,277.59,279.82,False,0,43.7247714,-79.3016866
34_0_34A,8903,34,true,1585446624,73,0,278.92,14484,278.15,279.82,False,0,43.7270825,-79.2905791
34_0_34A,8903,34,true,1585446623,73,0,278.92,14484,278.15,279.82,False,0,43.7270825,-79.2905791
34_0_34A,8903,34,true,1585446653,73,0,278.92,14484,278.15,279.82,False,0,43.7270825,-79.2905791
34_0_34A,8903,34,true,1585446654,73,0,278.92,14484,278.15,279.82,False,0,43.7270825,-79.2905791
34_0_34A,8903,34,true,1585446683,73,0,278.92,14484,278.15,279.82,False,0,43.7270825,-79.2905791
34_0_34A,8903,34,true,1585446684,73,0,278.92,14484,278.15,279.82,False,0,43.7270825,-79.2905791
34_0_34A,8903,34,true,1585446714,73,26,278.92,14484,278.15,279.82,False,0,43.7274924,-79.2888185
34_0_34A,8903,34,true,1585446744,72,35,278.92,14484,278.15,279.82,False,0,43.7282017,-79.2856941
34_0_34A,8903,34,true,1585446743,72,35,278.92,14484,278.15,279.82,False,0,43.7282017,-79.2856941
34_0_34A,8903,34,true,1585446774,77,20,278.92,14484,278.15,279.82,False,0,43.7291351,-79.2817686
34_0_34A,8903,34,true,1585446773,77,20,278.92,14484,278.15,279.82,False,0,43.7291351,-79.2817686
34_0_34A,8903,34,true,1585446803,74,0,278.92,14484,278.15,279.82,False,0,43.7291709,-79.2815988
34_0_34A,8903,34,true,1585446804,74,0,278.92,14484,278.15,279.82,False,0,43.7291709,-79.2815988
34_0_34A,8903,34,true,1585446833,73,13,278.92,14484,278.15,279.82,False,0,43.7292089,-79.281417
34_0_34A,8903,34,true,1585446834,73,13,278.92,14484,278.15,279.82,False,0,43.7292089,-79.281417
34_0_34A,8903,34,true,1585446864,73,31,278.92,14484,278.15,279.82,False,0,43.7297187,-79.2787551
34_0_34A,8903,34,true,1585446894,72,11,278.92,14484,278.15,279.82,False,0,43.7299281,-79.2778302
34_0_34A,8903,34,true,1585446893,72,11,278.92,14484,278.15,279.82,False,0,43.7299281,-79.2778302
34_0_34A,8903,34,true,1585446924,74,28,278.9,14484,277.59,279.82,False,0,43.7306724,-79.2745817
34_0_34A,8903,34,true,1585446923,74,28,278.9,14484,277.59,279.82,False,0,43.7306724,-79.2745817
34_0_34A,8903,34,true,1585446954,73,0,278.9,14484,277.59,279.82,False,0,43.7312736,-79.2712783
34_0_34A,8903,34,true,1585446953,73,0,278.9,14484,277.59,279.82,False,0,43.7312736,-79.2712783
34_0_34A,8903,34,true,1585446984,71,27,278.9,14484,277.59,279.82,False,0,43.7316256,-79.2703451
34_0_34A,8903,34,true,1585446983,71,27,278.9,14484,277.59,279.82,False,0,43.7316256,-79.2703451
34_0_34A,8903,34,true,1585447014,73,13,278.9,14484,277.59,279.82,False,0,43.7320098,-79.2682037
34_0_34A,8903,34,true,1585447013,73,13,278.9,14484,277.59,279.82,False,0,43.7320098,-79.2682037
34_0_34A,8903,34,true,1585447044,70,0,278.9,14484,277.59,279.82,False,0,43.7321332,-79.2680027
34_0_34A,8903,34,true,1585447043,70,0,278.9,14484,277.59,279.82,False,0,43.7321332,-79.2680027
34_0_34A,8903,34,true,1585447074,70,0,278.9,14484,277.59,279.82,False,0,43.7321332,-79.2680027
34_0_34A,8903,34,true,1585447103,73,22,278.9,14484,277.59,279.82,False,0,43.732407,-79.266935
34_0_34A,8903,34,true,1585447104,73,22,278.9,14484,277.59,279.82,False,0,43.732407,-79.266935
34_0_34A,8903,34,true,1585447134,68,19,278.9,14484,277.59,279.82,False,0,43.7326316,-79.2651901
34_0_34A,8903,34,true,1585447164,68,11,278.9,14484,277.59,279.82,False,0,43.7329165,-79.2638715
34_0_34A,8903,34,true,1585447163,68,11,278.9,14484,277.59,279.82,False,0,43.7329165,-79.2638715
34_0_34A,8903,34,true,1585447196,72,0,278.9,14484,277.59,279.82,False,0,43.7329867,-79.2635592
34_0_34A,8903,34,true,1585447195,72,0,278.9,14484,277.59,279.82,False,0,43.7329867,-79.2635592
34_0_34A,8903,34,true,1585447224,72,0,278.9,14484,277.59,279.82,False,0,43.7329867,-79.2635592
34_0_34A,8903,34,true,1585447223,72,0,278.9,14484,277.59,279.82,False,0,43.7329867,-79.2635592
34_0_34A,8903,34,true,1585447254,72,0,278.9,14484,277.59,279.82,False,0,43.7329867,-79.2635592
34_0_34A,8903,34,true,1585447253,72,0,278.9,14484,277.59,279.82,False,0,43.7329867,-79.2635592
34_0_34A,8903,34,true,1585447284,72,0,278.9,14484,277.59,279.82,False,0,43.7329867,-79.2635592
34_0_34A,8903,34,true,1585447314,54,5,278.9,14484,277.59,279.82,False,0,43.7330163,-79.2634241
34_0_34A,8903,34,true,1585447344,337,17,278.9,14484,277.59,279.82,False,0,43.7334416,-79.2632883
34_0_34A,8903,34,true,1585449622,216,0,278.82,12874,277.59,279.82,False,0,43.7062149,-79.4001083
34_0_34A,8903,34,true,1585449621,216,0,278.82,12874,277.59,279.82,False,0,43.7062149,-79.4001083
34_0_34A,8903,34,true,1585449651,74,20,278.82,12874,277.59,279.82,False,0,43.7064895,-79.3995513
34_0_34A,8903,34,true,1585449652,74,20,278.82,12874,277.59,279.82,False,0,43.7064895,-79.3995513
34_0_34A,8903,34,true,1585449682,75,11,278.82,12874,277.59,279.82,False,0,43.7066802,-79.39859
34_0_34A,8903,34,true,1585449681,75,11,278.82,12874,277.59,279.82,False,0,43.7066802,-79.39859
34_0_34A,8903,34,true,1585449712,76,0,278.82,12874,277.59,279.82,False,0,43.706829,-79.3978729
34_0_34A,8903,34,true,1585449711,76,0,278.82,12874,277.59,279.82,False,0,43.706829,-79.3978729
34_0_34A,8903,34,true,1585449742,74,16,278.82,12874,277.59,279.82,False,0,43.7071456,-79.39608
34_0_34A,8903,34,true,1585449771,78,24,278.78,12874,277.59,279.82,False,0,43.707695,-79.3933868
34_0_34A,8903,34,true,1585449772,78,24,278.78,12874,277.59,279.82,False,0,43.707695,-79.3933868
34_0_34A,8903,34,true,1585449802,74,0,278.78,12874,277.59,279.82,False,0,43.707756,-79.3929367
34_0_34A,8903,34,true,1585449801,74,0,278.78,12874,277.59,279.82,False,0,43.707756,-79.3929367
34_0_34A,8903,34,true,1585449831,74,0,278.78,12874,277.59,279.82,False,0,43.707756,-79.3929367
34_0_34A,8903,34,true,1585449832,74,0,278.78,12874,277.59,279.82,False,0,43.707756,-79.3929367
34_0_34A,8903,34,true,1585449862,73,15,278.78,12874,277.59,279.82,False,0,43.7082057,-79.3911211
34_0_34A,8903,34,true,1585449861,73,15,278.78,12874,277.59,279.82,False,0,43.7082057,-79.3911211
34_0_34A,8903,34,true,1585449892,68,22,278.78,12874,277.59,279.82,False,0,43.7086,-79.3891266
34_0_34A,8903,34,true,1585449891,68,22,278.78,12874,277.59,279.82,False,0,43.7086,-79.3891266
34_0_34A,8903,34,true,1585449922,74,0,278.78,12874,277.59,279.82,False,0,43.7088394,-79.3876647
34_0_34A,8903,34,true,1585449921,74,0,278.78,12874,277.59,279.82,False,0,43.7088394,-79.3876647
34_0_34A,8903,34,true,1585449952,74,21,278.78,12874,277.59,279.82,False,0,43.7091725,-79.3861378
34_0_34A,8903,34,true,1585449951,74,21,278.78,12874,277.59,279.82,False,0,43.7091725,-79.3861378
34_0_34A,8903,34,true,1585449982,72,29,278.76,12874,277.59,279.82,False,0,43.7100021,-79.3821365
34_0_34A,8903,34,true,1585449981,72,29,278.76,12874,277.59,279.82,False,0,43.7100021,-79.3821365
34_0_34A,8903,34,true,1585450012,74,30,278.76,12874,277.59,279.82,False,0,43.7104915,-79.3795596
34_0_34A,8903,34,true,1585450011,74,30,278.76,12874,277.59,279.82,False,0,43.7104915,-79.3795596
34_0_34A,8903,34,true,1585450042,75,0,278.76,12874,277.59,279.82,False,0,43.7109329,-79.3775756
34_0_34A,8903,34,true,1585450041,75,0,278.76,12874,277.59,279.82,False,0,43.7109329,-79.3775756
34_0_34A,8903,34,true,1585450071,75,0,278.76,12874,277.59,279.82,False,0,43.7109329,-79.3775756
34_0_34A,8903,34,true,1585450072,75,0,278.76,12874,277.59,279.82,False,0,43.7109329,-79.3775756
34_0_34A,8903,34,true,1585450102,75,0,278.76,12874,277.59,279.82,False,0,43.7109329,-79.3775756
34_0_34A,8903,34,true,1585450132,74,35,278.76,12874,277.59,279.82,False,0,43.7112247,-79.3759111
34_0_34A,8903,34,true,1585450164,74,42,278.74,12874,277.59,279.82,False,0,43.7121256,-79.3714077
34_0_34A,8903,34,true,1585450163,74,42,278.74,12874,277.59,279.82,False,0,43.7121256,-79.3714077
34_0_34A,8903,34,true,1585450192,73,25,278.74,12874,277.59,279.82,False,0,43.7128569,-79.3679467
34_0_34A,8903,34,true,1585450191,73,25,278.74,12874,277.59,279.82,False,0,43.7128569,-79.3679467
34_0_34A,8903,34,true,1585450222,73,16,278.74,12874,277.59,279.82,False,0,43.7130363,-79.3671478
34_0_34A,8903,34,true,1585450252,75,0,278.74,12874,277.59,279.82,False,0,43.7134736,-79.3650485
34_0_34A,8903,34,true,1585450251,75,0,278.74,12874,277.59,279.82,False,0,43.7134736,-79.3650485
34_0_34A,8903,34,true,1585450282,75,0,278.74,12874,277.59,279.82,False,0,43.7134736,-79.3650485
34_0_34A,8903,34,true,1585450313,74,40,278.76,12874,277.04,280.37,False,0,43.7139749,-79.362365
34_0_34A,8903,34,true,1585450341,74,0,278.76,12874,277.04,280.37,False,0,43.7144584,-79.3599014
34_0_34A,8903,34,true,1585450342,74,0,278.76,12874,277.04,280.37,False,0,43.7144584,-79.3599014
34_0_34A,8903,34,true,1585450372,69,34,278.76,12874,277.04,280.37,False,0,43.7148578,-79.3586785
34_0_34A,8903,34,true,1585450371,69,34,278.76,12874,277.04,280.37,False,0,43.7148578,-79.3586785
34_0_34A,8903,34,true,1585450402,76,39,278.75,12874,277.59,279.82,False,0,43.7156706,-79.354717
34_0_34A,8903,34,true,1585450432,71,24,278.75,12874,277.59,279.82,False,0,43.716852,-79.3506229
34_0_34A,8903,34,true,1585450433,71,24,278.75,12874,277.59,279.82,False,0,43.716852,-79.3506229
34_0_34A,8903,34,true,1585450462,66,0,278.75,12874,277.59,279.82,False,0,43.7169799,-79.3502633
34_0_34A,8903,34,true,1585450492,63,42,278.75,12874,277.59,279.82,False,0,43.7174408,-79.3487368
34_0_34A,8903,34,true,1585450522,63,43,278.79,12874,277.04,280.37,False,0,43.7188458,-79.3441266
34_0_34A,8903,34,true,1585450552,67,29,278.79,12874,277.04,280.37,False,0,43.7201229,-79.3400654
34_0_34A,8903,34,true,1585450551,67,29,278.79,12874,277.04,280.37,False,0,43.7201229,-79.3400654
34_0_34A,8903,34,true,1585450582,78,0,278.79,12874,277.04,280.37,False,0,43.7204711,-79.3389266
34_0_34A,8903,34,true,1585450581,78,0,278.79,12874,277.04,280.37,False,0,43.7204711,-79.3389266
34_0_34A,8903,34,true,1585450612,78,0,278.79,12874,277.04,280.37,False,0,43.7204711,-79.3389266
34_0_34A,8903,34,true,1585450644,66,35,278.79,12874,277.04,280.37,False,0,43.7206954,-79.337476
34_0_34A,8903,34,true,1585450672,66,32,278.76,12874,277.59,279.82,False,0,43.7220954,-79.3336257
34_0_34A,8903,34,true,1585450671,66,32,278.76,12874,277.59,279.82,False,0,43.7220954,-79.3336257
34_0_34A,8903,34,true,1585450702,65,38,278.76,12874,277.59,279.82,False,0,43.7227876,-79.3313286
34_0_34A,8903,34,true,1585450732,70,49,278.83,12874,277.59,280.37,False,0,43.7242275,-79.3259166
34_0_34A,8903,34,true,1585450731,70,49,278.83,12874,277.59,280.37,False,0,43.7242275,-79.3259166
34_0_34A,8903,34,true,1585450762,70,0,278.82,12874,277.59,280.37,False,0,43.7247709,-79.3238364
34_0_34A,8903,34,true,1585450792,68,9,278.82,12874,277.59,280.37,False,0,43.7247876,-79.3237755
34_0_34A,8903,34,true,1585450791,68,9,278.82,12874,277.59,280.37,False,0,43.7247876,-79.3237755
34_0_34A,8903,34,true,1585450822,70,38,278.84,12874,277.59,280.37,False,0,43.7258973,-79.3195354
34_0_34A,8903,34,true,1585450852,77,23,278.84,12874,277.59,280.37,False,0,43.7261917,-79.3179244
34_0_34A,8903,34,true,1585450882,101,19,278.82,12874,277.59,280.37,False,0,43.7261327,-79.3142811
34_0_34A,8903,34,true,1585450912,36,0,278.82,12874,277.59,280.37,False,0,43.7259167,-79.313723
34_0_34A,8903,34,true,1585450942,36,0,278.82,12874,277.59,280.37,False,0,43.7259167,-79.313723
34_0_34A,8903,34,true,1585450972,102,46,278.82,12874,277.59,280.37,False,0,43.725643,-79.3111093
34_0_34A,8903,34,true,1585451002,100,39,278.81,12874,277.59,280.37,False,0,43.7249402,-79.3067955
34_0_34A,8903,34,true,1585451032,88,13,278.82,12874,277.59,280.37,False,0,43.7246953,-79.3027616
34_0_34A,8903,34,true,1585451031,88,13,278.82,12874,277.59,280.37,False,0,43.7246953,-79.3027616
34_0_34A,8903,34,true,1585451062,90,0,278.82,12874,277.59,280.37,False,0,43.7246905,-79.3026858
34_0_34A,8903,34,true,1585451092,72,36,278.82,12874,277.59,280.37,False,0,43.725143,-79.2996493
34_0_34A,8903,34,true,1585451122,76,0,278.82,12874,277.59,280.37,False,0,43.7256454,-79.2974904
34_0_34A,8903,34,true,1585451123,76,0,278.82,12874,277.59,280.37,False,0,43.7256454,-79.2974904
34_0_34A,8903,34,true,1585451152,73,32,278.82,12874,277.59,280.37,False,0,43.7256498,-79.2968104
34_0_34A,8903,34,true,1585451182,72,34,278.82,12874,277.59,280.37,False,0,43.7266268,-79.2925627
34_0_34A,8903,34,true,1585451212,73,6,278.82,12874,277.59,280.37,False,0,43.7269419,-79.2915159
34_0_34A,8903,34,true,1585451213,73,6,278.82,12874,277.59,280.37,False,0,43.7269419,-79.2915159
34_0_34A,8903,34,true,1585451242,73,0,278.82,12874,277.59,280.37,False,0,43.7270711,-79.2906093
34_0_34A,8903,34,true,1585451272,73,23,278.82,12874,277.59,280.37,False,0,43.7273465,-79.2898136
34_0_34A,8903,34,true,1585451273,73,23,278.82,12874,277.59,280.37,False,0,43.7273465,-79.2898136
34_0_34A,8903,34,true,1585451302,73,0,278.82,12874,277.59,280.37,False,0,43.7278036,-79.2876043
34_0_34A,8903,34,true,1585451332,71,38,278.84,12874,277.59,280.37,False,0,43.7283723,-79.284932
34_0_34A,8903,34,true,1585451333,71,38,278.84,12874,277.59,280.37,False,0,43.7283723,-79.284932
34_0_34A,8903,34,true,1585451363,74,29,278.84,12874,277.59,280.37,False,0,43.7292097,-79.2814134
34_0_34A,8903,34,true,1585451362,74,29,278.84,12874,277.59,280.37,False,0,43.7292097,-79.2814134
34_0_34A,8903,34,true,1585451392,74,0,278.84,12874,277.59,280.37,False,0,43.7291908,-79.2808074
34_0_34A,8903,34,true,1585451422,73,30,278.84,12874,277.59,280.37,False,0,43.7297182,-79.2787628
34_0_34A,8903,34,true,1585451452,73,16,278.84,12874,277.59,280.37,False,0,43.7300753,-79.2772842
34_0_34A,8903,34,true,1585451482,73,0,278.84,12874,277.59,280.37,False,0,43.730365,-79.275951
34_0_34A,8903,34,true,1585451513,73,24,278.84,12874,277.59,280.37,False,0,43.730547,-79.2751372
34_0_34A,8903,34,true,1585451512,73,24,278.84,12874,277.59,280.37,False,0,43.730547,-79.2751372
34_0_34A,8903,34,true,1585451542,72,26,278.87,12874,277.59,280.37,False,0,43.7312593,-79.2719039
34_0_34A,8903,34,true,1585451543,72,26,278.87,12874,277.59,280.37,False,0,43.7312593,-79.2719039
34_0_34A,8903,34,true,1585451572,71,34,278.87,12874,277.59,280.37,False,0,43.7317013,-79.2700258
34_0_34A,8903,34,true,1585451602,71,7,278.87,12874,277.59,280.37,False,0,43.7320098,-79.2682037
34_0_34A,8903,34,true,1585451603,71,7,278.87,12874,277.59,280.37,False,0,43.7320098,-79.2682037
34_0_34A,8903,34,true,1585451632,70,0,278.87,12874,277.59,280.37,False,0,43.7320195,-79.2681887
34_0_34A,8903,34,true,1585451662,70,0,278.87,12874,277.59,280.37,False,0,43.7320195,-79.2681887
34_0_34A,8903,34,true,1585451663,70,0,278.87,12874,277.59,280.37,False,0,43.7320195,-79.2681887
34_0_34A,8903,34,true,1585451693,92,23,278.87,12874,277.59,280.37,False,0,43.7324353,-79.2667275
34_0_34A,8903,34,true,1585451692,92,23,278.87,12874,277.59,280.37,False,0,43.7324353,-79.2667275
34_0_34A,8903,34,true,1585451722,74,1,278.84,12874,277.59,280.37,False,0,43.7327594,-79.2645676
34_0_34A,8903,34,true,1585451754,72,0,278.84,12874,277.59,280.37,False,0,43.7329432,-79.2637532
34_0_34A,8903,34,true,1585451755,72,0,278.84,12874,277.59,280.37,False,0,43.7329432,-79.2637532
34_0_34A,8903,34,true,1585451782,58,8,278.84,12874,277.59,280.37,False,0,43.7329658,-79.2636529
34_0_34A,8903,34,true,1585451783,58,8,278.84,12874,277.59,280.37,False,0,43.7329658,-79.2636529
34_0_34A,8903,34,true,1585451812,306,17,278.84,12874,277.59,280.37,False,0,43.733575,-79.26343
34_0_34A,8903,34,true,1585454124,0,16,278.67,14484,277.04,280.37,False,0,43.7058563,-79.4000854
34_0_34A,8903,34,true,1585454154,69,25,278.67,14484,277.04,280.37,False,0,43.7064895,-79.3995513
34_0_34A,8903,34,true,1585454153,69,25,278.67,14484,277.04,280.37,False,0,43.7064895,-79.3995513
34_0_34A,8903,34,true,1585454184,75,19,278.67,14484,277.04,280.37,False,0,43.706726,-79.3983535
34_0_34A,8903,34,true,1585454214,76,7,278.67,14484,277.04,280.37,False,0,43.7071456,-79.39608
34_0_34A,8903,34,true,1585454244,76,0,278.67,14484,277.04,280.37,False,0,43.7071456,-79.39608
34_0_34A,8903,34,true,1585454274,76,0,278.63,14484,277.04,280.37,False,0,43.7071456,-79.39608
34_0_34A,8903,34,true,1585454304,74,9,278.63,14484,277.04,280.37,False,0,43.7071762,-79.3958358
34_0_34A,8903,34,true,1585454334,76,0,278.63,14484,277.04,280.37,False,0,43.7072067,-79.3956069
34_0_34A,8903,34,true,1585454364,76,0,278.63,14484,277.04,280.37,False,0,43.7072067,-79.3956069
34_0_34A,8903,34,true,1585454394,76,0,278.63,14484,277.04,280.37,False,0,43.7072067,-79.3956069
34_0_34A,8903,34,true,1585454424,77,2,278.63,14484,277.04,280.37,False,0,43.7072067,-79.3956069
34_0_34A,8903,34,true,1585454454,76,0,278.63,14484,277.04,280.37,False,0,43.7072067,-79.3956069
34_0_34A,8903,34,true,1585454485,76,4,278.64,14484,277.04,280.37,False,0,43.707756,-79.3929367
34_0_34A,8903,34,true,1585454484,76,4,278.64,14484,277.04,280.37,False,0,43.707756,-79.3929367
34_0_34A,8903,34,true,1585454515,74,0,278.64,14484,277.04,280.37,False,0,43.707756,-79.3929367
34_0_34A,8903,34,true,1585454514,74,0,278.64,14484,277.04,280.37,False,0,43.707756,-79.3929367
34_0_34A,8903,34,true,1585454544,73,19,278.64,14484,277.04,280.37,False,0,43.7077999,-79.392826
34_0_34A,8903,34,true,1585454574,75,29,278.64,14484,277.04,280.37,False,0,43.7084575,-79.3898867
34_0_34A,8903,34,true,1585454604,71,35,278.64,14484,277.04,280.37,False,0,43.7091742,-79.3861329
34_0_34A,8903,34,true,1585454634,74,39,278.66,14484,277.04,280.37,False,0,43.7100139,-79.3821081
34_0_34A,8903,34,true,1585454635,74,39,278.66,14484,277.04,280.37,False,0,43.7100139,-79.3821081
34_0_34A,8903,34,true,1585454664,75,29,278.66,14484,277.04,280.37,False,0,43.7107548,-79.3783867
34_0_34A,8903,34,true,1585454665,75,29,278.66,14484,277.04,280.37,False,0,43.7107548,-79.3783867
34_0_34A,8903,34,true,1585454694,72,42,278.66,14484,277.04,280.37,False,0,43.7115844,-79.3744637
34_0_34A,8903,34,true,1585454725,74,46,278.66,14484,277.04,280.37,False,0,43.7125429,-79.3695551
34_0_34A,8903,34,true,1585454724,74,46,278.66,14484,277.04,280.37,False,0,43.7125429,-79.3695551
34_0_34A,8903,34,true,1585454754,74,0,278.66,14484,277.04,280.37,False,0,43.7129791,-79.3672861
34_0_34A,8903,34,true,1585454755,74,0,278.66,14484,277.04,280.37,False,0,43.7129791,-79.3672861
34_0_34A,8903,34,true,1585454784,73,33,278.66,14484,277.04,280.37,False,0,43.7132723,-79.3659786
34_0_34A,8903,34,true,1585454814,74,42,278.67,14484,277.04,280.37,False,0,43.7139846,-79.3623433
34_0_34A,8903,34,true,1585454844,73,9,278.67,14484,277.04,280.37,False,0,43.7145071,-79.3598202
34_0_34A,8903,34,true,1585454845,73,9,278.67,14484,277.04,280.37,False,0,43.7145071,-79.3598202
34_0_34A,8903,34,true,1585454874,69,37,278.68,14484,277.04,280.37,False,0,43.7151285,-79.3575076
34_0_34A,8903,34,true,1585454875,69,37,278.68,14484,277.04,280.37,False,0,43.7151285,-79.3575076
34_0_34A,8903,34,true,1585454904,62,43,278.68,14484,277.04,280.37,False,0,43.7160498,-79.3532055
34_0_34A,8903,34,true,1585454934,65,36,278.68,14484,277.04,280.37,False,0,43.7169717,-79.3496567
34_0_34A,8903,34,true,1585454965,71,41,278.68,14484,277.04,280.37,False,0,43.7183997,-79.3455304
34_0_34A,8903,34,true,1585454964,71,41,278.68,14484,277.04,280.37,False,0,43.7183997,-79.3455304
34_0_34A,8903,34,true,1585454994,69,38,278.74,14484,277.04,280.37,False,0,43.7196898,-79.3413607
34_0_34A,8903,34,true,1585454995,69,38,278.74,14484,277.04,280.37,False,0,43.7196898,-79.3413607
34_0_34A,8903,34,true,1585455025,66,2,278.74,14484,277.04,280.37,False,0,43.7205356,-79.3387245
34_0_34A,8903,34,true,1585455024,66,2,278.74,14484,277.04,280.37,False,0,43.7205356,-79.3387245
34_0_34A,8903,34,true,1585455055,78,0,278.74,14484,277.04,280.37,False,0,43.7205356,-79.3387245
34_0_34A,8903,34,true,1585455054,78,0,278.74,14484,277.04,280.37,False,0,43.7205356,-79.3387245
34_0_34A,8903,34,true,1585455084,78,0,278.74,14484,277.04,280.37,False,0,43.7205356,-79.3387245
34_0_34A,8903,34,true,1585455085,78,0,278.74,14484,277.04,280.37,False,0,43.7205356,-79.3387245
34_0_34A,8903,34,true,1585455114,67,38,278.74,14484,277.04,280.37,False,0,43.7206062,-79.3376277
34_0_34A,8903,34,true,1585455115,67,38,278.74,14484,277.04,280.37,False,0,43.7206062,-79.3376277
34_0_34A,8903,34,true,1585455144,64,43,278.76,14484,277.04,280.37,False,0,43.7218378,-79.3344795
34_0_34A,8903,34,true,1585455145,64,43,278.76,14484,277.04,280.37,False,0,43.7218378,-79.3344795
34_0_34A,8903,34,true,1585455174,69,0,278.76,14484,277.04,280.37,False,0,43.7225993,-79.3319563
34_0_34A,8903,34,true,1585455175,69,0,278.76,14484,277.04,280.37,False,0,43.7225993,-79.3319563
34_0_34A,8903,34,true,1585455204,69,0,278.76,14484,277.04,280.37,False,0,43.7225993,-79.3319563
34_0_34A,8903,34,true,1585455205,69,0,278.76,14484,277.04,280.37,False,0,43.7225993,-79.3319563
34_0_34A,8903,34,true,1585455234,73,42,278.76,14484,277.04,280.37,False,0,43.7238727,-79.3272819
34_0_34A,8903,34,true,1585455235,73,42,278.76,14484,277.04,280.37,False,0,43.7238727,-79.3272819
34_0_34A,8903,34,true,1585455264,69,41,278.78,14484,277.59,280.37,False,0,43.7251004,-79.3226572
34_0_34A,8903,34,true,1585455265,69,41,278.78,14484,277.59,280.37,False,0,43.7251004,-79.3226572
34_0_34A,8903,34,true,1585455295,76,32,278.78,14484,277.59,280.37,False,0,43.7260395,-79.3182727
34_0_34A,8903,34,true,1585455294,76,32,278.78,14484,277.59,280.37,False,0,43.7260395,-79.3182727
34_0_34A,8903,34,true,1585455324,100,24,278.78,14484,277.59,280.37,False,0,43.7261405,-79.3143372
34_0_34A,8903,34,true,1585455325,100,24,278.78,14484,277.59,280.37,False,0,43.7261405,-79.3143372
34_0_34A,8903,34,true,1585455355,36,0,278.78,14484,277.59,280.37,False,0,43.7259079,-79.3137858
34_0_34A,8903,34,true,1585455354,36,0,278.78,14484,277.59,280.37,False,0,43.7259079,-79.3137858
34_0_34A,8903,34,true,1585455385,36,0,278.78,14484,277.59,280.37,False,0,43.7259079,-79.3137858
34_0_34A,8903,34,true,1585455384,36,0,278.78,14484,277.59,280.37,False,0,43.7259079,-79.3137858
34_0_34A,8903,34,true,1585455414,102,45,278.78,14484,277.59,280.37,False,0,43.7256069,-79.3108372
34_0_34A,8903,34,true,1585455415,102,45,278.78,14484,277.59,280.37,False,0,43.7256069,-79.3108372
34_0_34A,8903,34,true,1585455444,101,39,278.77,14484,277.59,280.37,False,0,43.7249398,-79.3067996
34_0_34A,8903,34,true,1585455445,101,39,278.77,14484,277.59,280.37,False,0,43.7249398,-79.3067996
34_0_34A,8903,34,true,1585455474,86,5,278.77,14484,277.59,280.37,False,0,43.7246833,-79.3026336
34_0_34A,8903,34,true,1585455475,86,5,278.77,14484,277.59,280.37,False,0,43.7246833,-79.3026336
34_0_34A,8903,34,true,1585455504,81,27,278.77,14484,277.59,280.37,False,0,43.7246562,-79.3019355
34_0_34A,8903,34,true,1585455505,81,27,278.77,14484,277.59,280.37,False,0,43.7246562,-79.3019355
34_0_34A,8903,34,true,1585455534,71,33,278.77,14484,277.59,280.37,False,0,43.7254735,-79.2982091
34_0_34A,8903,34,true,1585455535,71,33,278.77,14484,277.59,280.37,False,0,43.7254735,-79.2982091
34_0_34A,8903,34,true,1585455564,76,0,278.77,14484,277.59,280.37,False,0,43.7256524,-79.2974599
34_0_34A,8903,34,true,1585455565,76,0,278.77,14484,277.59,280.37,False,0,43.7256524,-79.2974599
34_0_34A,8903,34,true,1585455596,76,0,278.77,14484,277.59,280.37,False,0,43.7256524,-79.2974599
34_0_34A,8903,34,true,1585455597,76,0,278.77,14484,277.59,280.37,False,0,43.7256524,-79.2974599
34_0_34A,8903,34,true,1585455624,72,38,278.77,14484,277.59,280.37,False,0,43.7260242,-79.2954717
34_0_34A,8903,34,true,1585455625,72,38,278.77,14484,277.59,280.37,False,0,43.7260242,-79.2954717
34_0_34A,8903,34,true,1585455655,72,10,278.79,14484,277.59,280.37,False,0,43.7269429,-79.291501
34_0_34A,8903,34,true,1585455654,72,10,278.79,14484,277.59,280.37,False,0,43.7269429,-79.291501
34_0_34A,8903,34,true,1585455685,73,0,278.79,14484,277.59,280.37,False,0,43.7269442,-79.2914823
34_0_34A,8903,34,true,1585455684,73,0,278.79,14484,277.59,280.37,False,0,43.7269442,-79.2914823
34_0_34A,8903,34,true,1585455715,73,0,278.79,14484,277.59,280.37,False,0,43.7270914,-79.2905556
34_0_34A,8903,34,true,1585455714,73,0,278.79,14484,277.59,280.37,False,0,43.7270914,-79.2905556
34_0_34A,8903,34,true,1585455745,72,12,278.79,14484,277.59,280.37,False,0,43.727141,-79.2904249
34_0_34A,8903,34,true,1585455744,72,12,278.79,14484,277.59,280.37,False,0,43.727141,-79.2904249
34_0_34A,8903,34,true,1585455774,73,16,278.79,14484,277.59,280.37,False,0,43.7277325,-79.2877393
34_0_34A,8903,34,true,1585455775,73,16,278.79,14484,277.59,280.37,False,0,43.7277325,-79.2877393
34_0_34A,8903,34,true,1585455804,73,35,278.78,14484,277.59,280.37,False,0,43.7288205,-79.2827081
34_0_34A,8903,34,true,1585455805,73,35,278.78,14484,277.59,280.37,False,0,43.7288205,-79.2827081
34_0_34A,8903,34,true,1585455834,71,33,278.78,14484,277.59,280.37,False,0,43.729612,-79.2795544
34_0_34A,8903,34,true,1585455835,71,33,278.78,14484,277.59,280.37,False,0,43.729612,-79.2795544
34_0_34A,8903,34,true,1585455864,73,0,278.78,14484,277.59,280.37,False,0,43.7298922,-79.2779334
34_0_34A,8903,34,true,1585455865,73,0,278.78,14484,277.59,280.37,False,0,43.7298922,-79.2779334
34_0_34A,8903,34,true,1585455895,73,0,278.78,14484,277.59,280.37,False,0,43.7298922,-79.2779334
34_0_34A,8903,34,true,1585455894,73,0,278.78,14484,277.59,280.37,False,0,43.7298922,-79.2779334
34_0_34A,8903,34,true,1585455924,72,33,278.78,14484,277.59,280.37,False,0,43.7302719,-79.2763723
34_0_34A,8903,34,true,1585455925,72,33,278.78,14484,277.59,280.37,False,0,43.7302719,-79.2763723
34_0_34A,8903,34,true,1585455954,71,36,278.79,14484,277.59,280.37,False,0,43.7311241,-79.2725968
34_0_34A,8903,34,true,1585455955,71,36,278.79,14484,277.59,280.37,False,0,43.7311241,-79.2725968
34_0_34A,8903,34,true,1585455984,72,0,278.79,14484,277.59,280.37,False,0,43.7313296,-79.2711944
34_0_34A,8903,34,true,1585455985,72,0,278.79,14484,277.59,280.37,False,0,43.7313296,-79.2711944
34_0_34A,8903,34,true,1585456015,70,3,278.79,14484,277.59,280.37,False,0,43.731355,-79.2711563
34_0_34A,8903,34,true,1585456014,70,3,278.79,14484,277.59,280.37,False,0,43.731355,-79.2711563
34_0_34A,8903,34,true,1585456045,72,30,278.79,14484,277.59,280.37,False,0,43.7319094,-79.2688191
34_0_34A,8903,34,true,1585456044,72,30,278.79,14484,277.59,280.37,False,0,43.7319094,-79.2688191
34_0_34A,8903,34,true,1585456074,70,0,278.79,14484,277.59,280.37,False,0,43.7321332,-79.2680027
34_0_34A,8903,34,true,1585456075,70,0,278.79,14484,277.59,280.37,False,0,43.7321332,-79.2680027
34_0_34A,8903,34,true,1585456104,70,0,278.79,14484,277.59,280.37,False,0,43.7321332,-79.2680027
34_0_34A,8903,34,true,1585456105,70,0,278.79,14484,277.59,280.37,False,0,43.7321332,-79.2680027
34_0_34A,8903,34,true,1585456135,70,0,278.79,14484,277.59,280.37,False,0,43.7321332,-79.2680027
34_0_34A,8903,34,true,1585456134,70,0,278.79,14484,277.59,280.37,False,0,43.7321332,-79.2680027
34_0_34A,8903,34,true,1585456165,106,26,278.79,14484,277.59,280.37,False,0,43.7324277,-79.2655674
34_0_34A,8903,34,true,1585456164,106,26,278.79,14484,277.59,280.37,False,0,43.7324277,-79.2655674
34_0_34A,8903,34,true,1585456195,69,15,278.79,14484,277.59,280.37,False,0,43.7329424,-79.2637568
34_0_34A,8903,34,true,1585456194,69,15,278.79,14484,277.59,280.37,False,0,43.7329424,-79.2637568
34_0_34A,8903,34,true,1585456224,62,17,278.79,14484,277.59,280.37,False,0,43.7330757,-79.2632109
34_0_34A,8903,34,true,1585456225,62,17,278.79,14484,277.59,280.37,False,0,43.7330757,-79.2632109
34_0_34A,8903,34,true,1585456255,243,28,278.79,14484,277.59,280.37,False,0,43.7334136,-79.2640151
34_0_34A,8903,34,true,1585456254,243,28,278.79,14484,277.59,280.37,False,0,43.7334136,-79.2640151
34_0_34A,8903,34,true,1585458505,69,23,278.67,14484,277.04,280.37,False,0,43.7064895,-79.3995513
34_0_34A,8903,34,true,1585458506,69,23,278.67,14484,277.04,280.37,False,0,43.7064895,-79.3995513
34_0_34A,8903,34,true,1585458535,76,0,278.67,14484,277.04,280.37,False,0,43.7066802,-79.39859
34_0_34A,8903,34,true,1585458536,76,0,278.67,14484,277.04,280.37,False,0,43.7066802,-79.39859
34_0_34A,8903,34,true,1585458566,76,0,278.67,14484,277.04,280.37,False,0,43.7066802,-79.39859
34_0_34A,8903,34,true,1585458565,76,0,278.67,14484,277.04,280.37,False,0,43.7066802,-79.39859
34_0_34A,8903,34,true,1585458596,74,25,278.67,14484,277.04,280.37,False,0,43.7070541,-79.39682
34_0_34A,8903,34,true,1585458595,74,25,278.67,14484,277.04,280.37,False,0,43.7070541,-79.39682
34_0_34A,8903,34,true,1585458626,78,27,278.69,14484,277.04,280.37,False,0,43.707695,-79.3933868
34_0_34A,8903,34,true,1585458625,78,27,278.69,14484,277.04,280.37,False,0,43.707695,-79.3933868
34_0_34A,8903,34,true,1585458655,74,0,278.69,14484,277.04,280.37,False,0,43.707756,-79.3929367
34_0_34A,8903,34,true,1585458656,74,0,278.69,14484,277.04,280.37,False,0,43.707756,-79.3929367
34_0_34A,8903,34,true,1585458685,75,29,278.69,14484,277.04,280.37,False,0,43.7080944,-79.3916522
34_0_34A,8903,34,true,1585458715,74,0,278.69,14484,277.04,280.37,False,0,43.7082733,-79.390795
34_0_34A,8903,34,true,1585458716,74,0,278.69,14484,277.04,280.37,False,0,43.7082733,-79.390795
34_0_34A,8903,34,true,1585458745,74,0,278.69,14484,277.04,280.37,False,0,43.7082733,-79.390795
34_0_34A,8903,34,true,1585458746,74,0,278.69,14484,277.04,280.37,False,0,43.7082733,-79.390795
34_0_34A,8903,34,true,1585458775,70,26,278.69,14484,277.04,280.37,False,0,43.7085946,-79.3891581
34_0_34A,8903,34,true,1585458776,70,26,278.69,14484,277.04,280.37,False,0,43.7085946,-79.3891581
34_0_34A,8903,34,true,1585458805,72,38,278.69,14484,277.04,280.37,False,0,43.7091708,-79.3861428
34_0_34A,8903,34,true,1585458806,72,38,278.69,14484,277.04,280.37,False,0,43.7091708,-79.3861428
34_0_34A,8903,34,true,1585458835,74,39,278.7,14484,277.04,280.37,False,0,43.7103858,-79.3803195
34_0_34A,8903,34,true,1585458836,74,39,278.7,14484,277.04,280.37,False,0,43.7103858,-79.3803195
34_0_34A,8903,34,true,1585458865,76,14,278.7,14484,277.04,280.37,False,0,43.7109042,-79.3777105
34_0_34A,8903,34,true,1585458866,76,14,278.7,14484,277.04,280.37,False,0,43.7109042,-79.3777105
34_0_34A,8903,34,true,1585458895,75,0,278.7,14484,277.04,280.37,False,0,43.7109207,-79.3776316
34_0_34A,8903,34,true,1585458896,75,0,278.7,14484,277.04,280.37,False,0,43.7109207,-79.3776316
34_0_34A,8903,34,true,1585458925,71,40,278.7,14484,277.04,280.37,False,0,43.7112343,-79.3758725
34_0_34A,8903,34,true,1585458926,71,40,278.7,14484,277.04,280.37,False,0,43.7112343,-79.3758725
34_0_34A,8903,34,true,1585458955,74,48,278.68,14484,277.04,280.37,False,0,43.7123404,-79.370329
34_0_34A,8903,34,true,1585458956,74,48,278.68,14484,277.04,280.37,False,0,43.7123404,-79.370329
34_0_34A,8903,34,true,1585458986,74,43,278.68,14484,277.04,280.37,False,0,43.7132747,-79.3659636
34_0_34A,8903,34,true,1585458985,74,43,278.68,14484,277.04,280.37,False,0,43.7132747,-79.3659636
34_0_34A,8903,34,true,1585459015,77,39,278.69,14484,277.04,280.37,False,0,43.7143234,-79.3607142
34_0_34A,8903,34,true,1585459016,77,39,278.69,14484,277.04,280.37,False,0,43.7143234,-79.3607142
34_0_34A,8903,34,true,1585459045,72,33,278.71,14484,277.04,280.37,False,0,43.7151666,-79.3573137
34_0_34A,8903,34,true,1585459075,63,40,278.71,14484,277.04,280.37,False,0,43.7159839,-79.3534414
34_0_34A,8903,34,true,1585459106,67,23,278.71,14484,277.04,280.37,False,0,43.7169354,-79.3503904
34_0_34A,8903,34,true,1585459136,66,34,278.71,14484,277.04,280.37,False,0,43.7177737,-79.347566
34_0_34A,8903,34,true,1585459165,65,37,278.73,14484,277.04,280.37,False,0,43.7190385,-79.3435252
34_0_34A,8903,34,true,1585459166,65,37,278.73,14484,277.04,280.37,False,0,43.7190385,-79.3435252
34_0_34A,8903,34,true,1585459196,67,36,278.73,14484,277.04,280.37,False,0,43.7202621,-79.3396492
34_0_34A,8903,34,true,1585459195,67,36,278.73,14484,277.04,280.37,False,0,43.7202621,-79.3396492
34_0_34A,8903,34,true,1585459225,64,39,278.73,14484,277.04,280.37,False,0,43.7213197,-79.336176
34_0_34A,8903,34,true,1585459226,64,39,278.73,14484,277.04,280.37,False,0,43.7213197,-79.336176
34_0_34A,8903,34,true,1585459255,67,35,278.75,14484,277.04,280.37,False,0,43.7224342,-79.3322549
34_0_34A,8903,34,true,1585459256,67,35,278.75,14484,277.04,280.37,False,0,43.7224342,-79.3322549
34_0_34A,8903,34,true,1585459307,70,33,278.75,14484,277.04,280.37,False,0,43.7233845,-79.3288162
34_0_34A,8903,34,true,1585459338,70,38,278.77,14484,277.59,280.37,False,0,43.7251935,-79.3222906
34_0_34A,8903,34,true,1585459337,70,38,278.77,14484,277.59,280.37,False,0,43.7251935,-79.3222906
34_0_34A,8903,34,true,1585459368,77,16,278.77,14484,277.59,280.37,False,0,43.72603,-79.3182859
34_0_34A,8903,34,true,1585459367,77,16,278.77,14484,277.59,280.37,False,0,43.72603,-79.3182859
34_0_34A,8903,34,true,1585459398,89,35,278.77,14484,277.59,280.37,False,0,43.7262643,-79.3159432
34_0_34A,8903,34,true,1585459397,89,35,278.77,14484,277.59,280.37,False,0,43.7262643,-79.3159432
34_0_34A,8903,34,true,1585459427,102,11,278.77,14484,277.59,280.37,False,0,43.725924,-79.3136712
34_0_34A,8903,34,true,1585459428,102,11,278.77,14484,277.59,280.37,False,0,43.725924,-79.3136712
34_0_34A,8903,34,true,1585459457,36,0,278.77,14484,277.59,280.37,False,0,43.7259266,-79.3136527
34_0_34A,8903,34,true,1585459458,36,0,278.77,14484,277.59,280.37,False,0,43.7259266,-79.3136527
34_0_34A,8903,34,true,1585459488,102,37,278.77,14484,277.59,280.37,False,0,43.7256069,-79.3108372
34_0_34A,8903,34,true,1585459487,102,37,278.77,14484,277.59,280.37,False,0,43.7256069,-79.3108372
34_0_34A,8903,34,true,1585459518,100,35,278.77,14484,277.59,280.37,False,0,43.7249393,-79.3068038
34_0_34A,8903,34,true,1585459517,100,35,278.77,14484,277.59,280.37,False,0,43.7249393,-79.3068038
34_0_34A,8903,34,true,1585459547,88,24,278.78,14484,277.59,280.37,False,0,43.7246812,-79.3030369
34_0_34A,8903,34,true,1585459548,88,24,278.78,14484,277.59,280.37,False,0,43.7246812,-79.3030369
34_0_34A,8903,34,true,1585459577,81,32,278.78,14484,277.59,280.37,False,0,43.7248857,-79.3009482
34_0_34A,8903,34,true,1585459578,81,32,278.78,14484,277.59,280.37,False,0,43.7248857,-79.3009482
34_0_34A,8903,34,true,1585459607,73,9,278.78,14484,277.59,280.37,False,0,43.7256503,-79.2974688
34_0_34A,8903,34,true,1585459608,73,9,278.78,14484,277.59,280.37,False,0,43.7256503,-79.2974688
34_0_34A,8903,34,true,1585459638,76,0,278.78,14484,277.59,280.37,False,0,43.7256503,-79.2974688
34_0_34A,8903,34,true,1585459637,76,0,278.78,14484,277.59,280.37,False,0,43.7256503,-79.2974688
34_0_34A,8903,34,true,1585459667,71,38,278.78,14484,277.59,280.37,False,0,43.7260271,-79.295461
34_0_34A,8903,34,true,1585459668,71,38,278.78,14484,277.59,280.37,False,0,43.7260271,-79.295461
34_0_34A,8903,34,true,1585459698,73,32,278.78,14484,277.59,280.37,False,0,43.7267797,-79.2918365
34_0_34A,8903,34,true,1585459697,73,32,278.78,14484,277.59,280.37,False,0,43.7267797,-79.2918365
34_0_34A,8903,34,true,1585459728,73,28,278.78,14484,277.59,280.37,False,0,43.7275426,-79.2884856
34_0_34A,8903,34,true,1585459727,73,28,278.78,14484,277.59,280.37,False,0,43.7275426,-79.2884856
34_0_34A,8903,34,true,1585459758,73,0,278.78,14484,277.59,280.37,False,0,43.7278314,-79.2875324
34_0_34A,8903,34,true,1585459757,73,0,278.78,14484,277.59,280.37,False,0,43.7278314,-79.2875324
34_0_34A,8903,34,true,1585459787,73,0,278.78,14484,277.59,280.37,False,0,43.7278314,-79.2875324
34_0_34A,8903,34,true,1585459788,73,0,278.78,14484,277.59,280.37,False,0,43.7278314,-79.2875324
34_0_34A,8903,34,true,1585459818,73,0,278.78,14484,277.59,280.37,False,0,43.7278314,-79.2875324
34_0_34A,8903,34,true,1585459817,73,0,278.78,14484,277.59,280.37,False,0,43.7278314,-79.2875324
34_0_34A,8903,34,true,1585459848,71,31,278.79,14484,277.59,280.37,False,0,43.7283755,-79.2849279
34_0_34A,8903,34,true,1585459847,71,31,278.79,14484,277.59,280.37,False,0,43.7283755,-79.2849279
34_0_34A,8903,34,true,1585459878,74,28,278.79,14484,277.59,280.37,False,0,43.7292089,-79.281417
34_0_34A,8903,34,true,1585459907,69,34,278.79,14484,277.59,280.37,False,0,43.729582,-79.2796977
34_0_34A,8903,34,true,1585459908,69,34,278.79,14484,277.59,280.37,False,0,43.729582,-79.2796977
34_0_34A,8903,34,true,1585459938,73,0,278.79,14484,277.59,280.37,False,0,43.7298013,-79.2780797
34_0_34A,8903,34,true,1585459937,73,0,278.79,14484,277.59,280.37,False,0,43.7298013,-79.2780797
34_0_34A,8903,34,true,1585459968,73,0,278.79,14484,277.59,280.37,False,0,43.7298013,-79.2780797
34_0_34A,8903,34,true,1585459967,73,0,278.79,14484,277.59,280.37,False,0,43.7298013,-79.2780797
34_0_34A,8903,34,true,1585459998,72,30,278.79,14484,277.59,280.37,False,0,43.7302769,-79.2763501
34_0_34A,8903,34,true,1585460028,73,0,278.79,14484,277.59,280.37,False,0,43.7304021,-79.2757863
34_0_34A,8903,34,true,1585460027,73,0,278.79,14484,277.59,280.37,False,0,43.7304021,-79.2757863
34_0_34A,8903,34,true,1585460058,71,36,278.8,14484,277.59,280.37,False,0,43.7311286,-79.2725753
34_0_34A,8903,34,true,1585460088,72,34,278.8,14484,277.59,280.37,False,0,43.7317047,-79.2700119
34_0_34A,8903,34,true,1585460117,70,0,278.8,14484,277.59,280.37,False,0,43.7321209,-79.2680318
34_0_34A,8903,34,true,1585460118,70,0,278.8,14484,277.59,280.37,False,0,43.7321209,-79.2680318
34_0_34A,8903,34,true,1585460147,93,22,278.8,14484,277.59,280.37,False,0,43.7323717,-79.266558
34_0_34A,8903,34,true,1585460177,62,4,278.81,14484,277.59,280.37,False,0,43.7327935,-79.2644162
34_0_34A,8903,34,true,1585460207,72,0,278.81,14484,277.59,280.37,False,0,43.732927,-79.2638249
34_0_34A,8903,34,true,1585460237,205,9,278.81,14484,277.59,280.37,False,0,43.7325316,-79.2629333
