dir,id,route,predable,time,hdg,spd,temp,vis,t_min,t_max,snow,rain,lat,lon
34_1_34B,8791,34,true,1585433719,225,14,280.22,14484,277.59,283.15,False,0,43.7328091,-79.2632161
34_1_34B,8791,34,true,1585433720,225,14,280.22,14484,277.59,283.15,False,0,43.7328091,-79.2632161
34_1_34B,8791,34,true,1585433749,216,0,280.22,14484,277.59,283.15,False,0,43.732275,-79.2636799
34_1_34B,8791,34,true,1585433750,216,0,280.22,14484,277.59,283.15,False,0,43.732275,-79.2636799
34_1_34B,8791,34,true,1585433779,247,7,280.22,14484,277.59,283.15,False,0,43.732245,-79.2637566
34_1_34B,8791,34,true,1585433780,247,7,280.22,14484,277.59,283.15,False,0,43.732245,-79.2637566
34_1_34B,8791,34,true,1585433809,216,0,280.22,14484,277.59,283.15,False,0,43.7324638,-79.2641983
34_1_34B,8791,34,true,1585433810,216,0,280.22,14484,277.59,283.15,False,0,43.7324638,-79.2641983
34_1_34B,8791,34,true,1585433839,216,0,280.22,14484,277.59,283.15,False,0,43.7324638,-79.2641983
34_1_34B,8791,34,true,1585433840,216,0,280.22,14484,277.59,283.15,False,0,43.7324638,-79.2641983
34_1_34B,8791,34,true,1585433869,335,11,280.22,14484,277.59,283.15,False,0,43.7325668,-79.2639389
34_1_34B,8791,34,true,1585433870,335,11,280.22,14484,277.59,283.15,False,0,43.7325668,-79.2639389
34_1_34B,8791,34,true,1585433899,216,0,280.22,14484,277.59,283.15,False,0,43.7323951,-79.2641983
34_1_34B,8791,34,true,1585433900,216,0,280.22,14484,277.59,283.15,False,0,43.7323951,-79.2641983
34_1_34B,8791,34,true,1585433929,159,14,280.22,14484,277.59,283.15,False,0,43.7327283,-79.26296
34_1_34B,8791,34,true,1585433930,159,14,280.22,14484,277.59,283.15,False,0,43.7327283,-79.26296
34_1_34B,8791,34,true,1585433960,340,9,280.22,14484,277.59,283.15,False,0,43.7322349,-79.263916
34_1_34B,8791,34,true,1585433959,340,9,280.22,14484,277.59,283.15,False,0,43.7322349,-79.263916
34_1_34B,8791,34,true,1585433989,216,0,280.22,14484,277.59,283.15,False,0,43.7323036,-79.2636871
34_1_34B,8791,34,true,1585433990,216,0,280.22,14484,277.59,283.15,False,0,43.7323036,-79.2636871
34_1_34B,8791,34,true,1585434019,216,0,280.22,14484,277.59,283.15,False,0,43.7323036,-79.2636871
34_1_34B,8791,34,true,1585434020,216,0,280.22,14484,277.59,283.15,False,0,43.7323036,-79.2636871
34_1_34B,8791,34,true,1585434049,64,5,280.22,14484,277.59,283.15,False,0,43.7323722,-79.2634582
34_1_34B,8791,34,true,1585434050,64,5,280.22,14484,277.59,283.15,False,0,43.7323722,-79.2634582
34_1_34B,8791,34,true,1585434080,244,29,280.22,14484,277.59,283.15,False,0,43.7334327,-79.2639389
34_1_34B,8791,34,true,1585434079,244,29,280.22,14484,277.59,283.15,False,0,43.7334327,-79.2639389
34_1_34B,8791,34,true,1585434109,253,0,280.22,14484,277.59,283.15,False,0,43.7330398,-79.2661209
34_1_34B,8791,34,true,1585434110,253,0,280.22,14484,277.59,283.15,False,0,43.7330398,-79.2661209
34_1_34B,8791,34,true,1585434139,256,24,280.22,14484,277.59,283.15,False,0,43.7324409,-79.2673187
34_1_34B,8791,34,true,1585434140,256,24,280.22,14484,277.59,283.15,False,0,43.7324409,-79.2673187
34_1_34B,8791,34,true,1585434170,252,29,280.24,14484,277.59,283.15,False,0,43.7316398,-79.2707977
34_1_34B,8791,34,true,1585434169,252,29,280.24,14484,277.59,283.15,False,0,43.7316398,-79.2707977
34_1_34B,8791,34,true,1585434200,246,24,280.24,14484,277.59,283.15,False,0,43.7310256,-79.2733078
34_1_34B,8791,34,true,1585434199,246,24,280.24,14484,277.59,283.15,False,0,43.7310256,-79.2733078
34_1_34B,8791,34,true,1585434229,252,29,280.24,14484,277.59,283.15,False,0,43.7307783,-79.2741572
34_1_34B,8791,34,true,1585434230,252,29,280.24,14484,277.59,283.15,False,0,43.7307783,-79.2741572
34_1_34B,8791,34,true,1585434260,252,33,280.21,14484,277.59,283.15,False,0,43.7300628,-79.2776954
34_1_34B,8791,34,true,1585434259,252,33,280.21,14484,277.59,283.15,False,0,43.7300628,-79.2776954
34_1_34B,8791,34,true,1585434289,254,9,280.21,14484,277.59,283.15,False,0,43.7294955,-79.2800842
34_1_34B,8791,34,true,1585434290,254,9,280.21,14484,277.59,283.15,False,0,43.7294955,-79.2800842
34_1_34B,8791,34,true,1585434319,254,0,280.23,14484,277.59,283.15,False,0,43.7294914,-79.2801021
34_1_34B,8791,34,true,1585434320,254,0,280.23,14484,277.59,283.15,False,0,43.7294914,-79.2801021
34_1_34B,8791,34,true,1585434350,251,28,280.23,14484,277.59,283.15,False,0,43.7293545,-79.2811691
34_1_34B,8791,34,true,1585434349,251,28,280.23,14484,277.59,283.15,False,0,43.7293545,-79.2811691
34_1_34B,8791,34,true,1585434379,253,32,280.23,14484,277.59,283.15,False,0,43.7285137,-79.2848548
34_1_34B,8791,34,true,1585434409,254,0,280.23,14484,277.59,283.15,False,0,43.7281118,-79.2866659
34_1_34B,8791,34,true,1585434410,254,0,280.23,14484,277.59,283.15,False,0,43.7281118,-79.2866659
34_1_34B,8791,34,true,1585434439,251,3,280.23,14484,277.59,283.15,False,0,43.7280874,-79.2868893
34_1_34B,8791,34,true,1585434440,251,3,280.23,14484,277.59,283.15,False,0,43.7280874,-79.2868893
34_1_34B,8791,34,true,1585434469,253,22,280.23,14484,277.59,283.15,False,0,43.7273914,-79.2896526
34_1_34B,8791,34,true,1585434470,253,22,280.23,14484,277.59,283.15,False,0,43.7273914,-79.2896526
34_1_34B,8791,34,true,1585434499,252,1,280.23,14484,277.59,283.15,False,0,43.7271625,-79.2910157
34_1_34B,8791,34,true,1585434500,252,1,280.23,14484,277.59,283.15,False,0,43.7271625,-79.2910157
34_1_34B,8791,34,true,1585434530,253,25,280.23,14484,277.59,283.15,False,0,43.7268218,-79.2923972
34_1_34B,8791,34,true,1585434560,253,31,280.24,14484,277.59,283.15,False,0,43.7262153,-79.295073
34_1_34B,8791,34,true,1585434559,253,31,280.24,14484,277.59,283.15,False,0,43.7262153,-79.295073
34_1_34B,8791,34,true,1585434589,253,15,280.24,14484,277.59,283.15,False,0,43.7255138,-79.2980443
34_1_34B,8791,34,true,1585434590,253,15,280.24,14484,277.59,283.15,False,0,43.7255138,-79.2980443
34_1_34B,8791,34,true,1585434619,251,21,280.24,14484,277.59,283.15,False,0,43.7250972,-79.2998699
34_1_34B,8791,34,true,1585434620,251,21,280.24,14484,277.59,283.15,False,0,43.7250972,-79.2998699
34_1_34B,8791,34,true,1585434650,253,0,280.24,14484,277.59,283.15,False,0,43.7250851,-79.300147
34_1_34B,8791,34,true,1585434649,253,0,280.24,14484,277.59,283.15,False,0,43.7250851,-79.300147
34_1_34B,8791,34,true,1585434679,253,0,280.24,14484,277.59,283.15,False,0,43.7250851,-79.300147
34_1_34B,8791,34,true,1585434680,253,0,280.24,14484,277.59,283.15,False,0,43.7250851,-79.300147
34_1_34B,8791,34,true,1585434709,255,27,280.04,14484,277.59,282.04,False,0,43.7249797,-79.3006773
34_1_34B,8791,34,true,1585434710,255,27,280.04,14484,277.59,282.04,False,0,43.7249797,-79.3006773
34_1_34B,8791,34,true,1585434739,261,8,280.04,14484,277.59,282.04,False,0,43.7247418,-79.301909
34_1_34B,8791,34,true,1585434740,261,8,280.04,14484,277.59,282.04,False,0,43.7247418,-79.301909
34_1_34B,8791,34,true,1585434770,280,39,280.15,14484,277.59,282.59,False,0,43.7248045,-79.305432
34_1_34B,8791,34,true,1585434769,280,39,280.15,14484,277.59,282.59,False,0,43.7248045,-79.305432
34_1_34B,8791,34,true,1585434800,284,42,280.23,14484,277.59,283.15,False,0,43.7252331,-79.3082569
34_1_34B,8791,34,true,1585434799,284,42,280.23,14484,277.59,283.15,False,0,43.7252331,-79.3082569
34_1_34B,8791,34,true,1585434830,282,0,280.23,14484,277.59,283.15,False,0,43.7258415,-79.3123425
34_1_34B,8791,34,true,1585434829,282,0,280.23,14484,277.59,283.15,False,0,43.7258415,-79.3123425
34_1_34B,8791,34,true,1585434860,281,16,280.23,14484,277.59,283.15,False,0,43.7258764,-79.3125571
34_1_34B,8791,34,true,1585434859,281,16,280.23,14484,277.59,283.15,False,0,43.7258764,-79.3125571
34_1_34B,8791,34,true,1585434890,268,38,280.17,14484,277.59,282.59,False,0,43.7262782,-79.3163262
34_1_34B,8791,34,true,1585434889,268,38,280.17,14484,277.59,282.59,False,0,43.7262782,-79.3163262
34_1_34B,8791,34,true,1585434919,252,32,280.17,14484,277.59,282.59,False,0,43.725947,-79.3192848
34_1_34B,8791,34,true,1585434920,252,32,280.17,14484,277.59,282.59,False,0,43.725947,-79.3192848
34_1_34B,8791,34,true,1585434949,251,42,280.14,14484,277.59,282.59,False,0,43.7248257,-79.3236305
34_1_34B,8791,34,true,1585434950,251,42,280.14,14484,277.59,282.59,False,0,43.7248257,-79.3236305
34_1_34B,8791,34,true,1585434980,249,22,280.02,14484,277.59,282.04,False,0,43.7238293,-79.3278209
34_1_34B,8791,34,true,1585434979,249,22,280.02,14484,277.59,282.04,False,0,43.7238293,-79.3278209
34_1_34B,8791,34,true,1585435009,248,38,280.02,14484,277.59,282.04,False,0,43.7230377,-79.3308177
34_1_34B,8791,34,true,1585435010,248,38,280.02,14484,277.59,282.04,False,0,43.7230377,-79.3308177
34_1_34B,8791,34,true,1585435039,244,0,280.02,14484,277.59,282.04,False,0,43.7228736,-79.331572
34_1_34B,8791,34,true,1585435040,244,0,280.02,14484,277.59,282.04,False,0,43.7228736,-79.331572
34_1_34B,8791,34,true,1585435070,247,15,280.02,14484,277.59,282.04,False,0,43.7227839,-79.331708
34_1_34B,8791,34,true,1585435069,247,15,280.02,14484,277.59,282.04,False,0,43.7227839,-79.331708
34_1_34B,8791,34,true,1585435100,246,35,279.99,14484,277.04,282.04,False,0,43.7216222,-79.335186
34_1_34B,8791,34,true,1585435099,246,35,279.99,14484,277.04,282.04,False,0,43.7216222,-79.335186
34_1_34B,8791,34,true,1585435130,250,16,279.99,14484,277.04,282.04,False,0,43.7206229,-79.3384427
34_1_34B,8791,34,true,1585435129,250,16,279.99,14484,277.04,282.04,False,0,43.7206229,-79.3384427
34_1_34B,8791,34,true,1585435160,349,24,279.99,14484,277.04,282.04,False,0,43.7222059,-79.3393668
34_1_34B,8791,34,true,1585435159,349,24,279.99,14484,277.04,282.04,False,0,43.7222059,-79.3393668
34_1_34B,8791,34,true,1585435190,344,0,279.99,14484,277.04,282.04,False,0,43.7228246,-79.3395021
34_1_34B,8791,34,true,1585435189,344,0,279.99,14484,277.04,282.04,False,0,43.7228246,-79.3395021
34_1_34B,8791,34,true,1585435219,344,0,279.99,14484,277.04,282.04,False,0,43.7228246,-79.3395021
34_1_34B,8791,34,true,1585435220,344,0,279.99,14484,277.04,282.04,False,0,43.7228246,-79.3395021
34_1_34B,8791,34,true,1585435250,344,0,279.99,14484,277.04,282.04,False,0,43.7228246,-79.3395021
34_1_34B,8791,34,true,1585435249,344,0,279.99,14484,277.04,282.04,False,0,43.7228246,-79.3395021
34_1_34B,8791,34,true,1585435280,344,0,279.99,14484,277.04,282.04,False,0,43.7228246,-79.3395021
34_1_34B,8791,34,true,1585435279,344,0,279.99,14484,277.04,282.04,False,0,43.7228246,-79.3395021
34_1_34B,8791,34,true,1585435310,344,0,279.99,14484,277.04,282.04,False,0,43.7228246,-79.3395021
34_1_34B,8791,34,true,1585435309,344,0,279.99,14484,277.04,282.04,False,0,43.7228246,-79.3395021
34_1_34B,8791,34,true,1585435339,79,0,279.99,14484,277.04,282.04,False,0,43.7230918,-79.3390521
34_1_34B,8791,34,true,1585435340,79,0,279.99,14484,277.04,282.04,False,0,43.7230918,-79.3390521
34_1_34B,8791,34,true,1585435370,79,0,279.99,14484,277.04,282.04,False,0,43.7230918,-79.3390521
34_1_34B,8791,34,true,1585435369,79,0,279.99,14484,277.04,282.04,False,0,43.7230918,-79.3390521
34_1_34B,8791,34,true,1585435400,79,0,279.99,14484,277.04,282.04,False,0,43.7230918,-79.3390521
34_1_34B,8791,34,true,1585435399,79,0,279.99,14484,277.04,282.04,False,0,43.7230918,-79.3390521
34_1_34B,8791,34,true,1585435430,79,0,279.99,14484,277.04,282.04,False,0,43.7230918,-79.3390521
34_1_34B,8791,34,true,1585435459,79,0,279.99,14484,277.04,282.04,False,0,43.7230918,-79.3390521
34_1_34B,8791,34,true,1585435460,79,0,279.99,14484,277.04,282.04,False,0,43.7230918,-79.3390521
34_1_34B,8791,34,true,1585435490,79,0,279.99,14484,277.04,282.04,False,0,43.7230918,-79.3390521
34_1_34B,8791,34,true,1585435489,79,0,279.99,14484,277.04,282.04,False,0,43.7230918,-79.3390521
34_1_34B,8791,34,true,1585435520,79,0,279.99,14484,277.04,282.04,False,0,43.7230918,-79.3390521
34_1_34B,8791,34,true,1585435519,79,0,279.99,14484,277.04,282.04,False,0,43.7230918,-79.3390521
34_1_34B,8791,34,true,1585435550,79,0,279.99,14484,277.04,282.04,False,0,43.7230918,-79.3390521
34_1_34B,8791,34,true,1585435549,79,0,279.99,14484,277.04,282.04,False,0,43.7230918,-79.3390521
34_1_34B,8791,34,true,1585435580,79,0,279.99,14484,277.04,282.04,False,0,43.7230918,-79.3390521
34_1_34B,8791,34,true,1585435579,79,0,279.99,14484,277.04,282.04,False,0,43.7230918,-79.3390521
34_1_34B,8791,34,true,1585435850,78,25,279.99,14484,277.04,282.04,False,0,43.7233283,-79.33733
