dir,id,route,predable,time,hdg,spd,temp,vis,t_min,t_max,snow,rain,lat,lon
34_0_34B,8644,34,true,1585433570,70,40,280.24,14484,277.59,283.15,False,0,43.7269325,-79.3296737
34_0_34B,8644,34,true,1585433569,70,40,280.24,14484,277.59,283.15,False,0,43.7269325,-79.3296737
34_0_34B,8644,34,true,1585433599,66,0,280.24,14484,277.59,283.15,False,0,43.7273101,-79.3279113
34_0_34B,8644,34,true,1585433600,66,0,280.24,14484,277.59,283.15,False,0,43.7273101,-79.3279113
34_0_34B,8644,34,true,1585433629,0,36,280.24,14484,277.59,283.15,False,0,43.7286643,-79.3283309
34_0_34B,8644,34,true,1585433630,0,36,280.24,14484,277.59,283.15,False,0,43.7286643,-79.3283309
34_0_34B,8644,34,true,1585433659,249,15,280.24,14484,277.59,283.15,False,0,43.7302818,-79.3284606
34_0_34B,8644,34,true,1585433660,249,15,280.24,14484,277.59,283.15,False,0,43.7302818,-79.3284606
34_0_34B,8644,34,true,1585433689,172,32,280.24,14484,277.59,283.15,False,0,43.7283554,-79.3283081
34_0_34B,8644,34,true,1585433690,172,32,280.24,14484,277.59,283.15,False,0,43.7283554,-79.3283081
34_0_34B,8644,34,true,1585433719,125,0,280.24,14484,277.59,283.15,False,0,43.7276496,-79.3279418
34_0_34B,8644,34,true,1585433720,125,0,280.24,14484,277.59,283.15,False,0,43.7276496,-79.3279418
34_0_34B,8644,34,true,1585433750,153,4,280.24,14484,277.59,283.15,False,0,43.7276496,-79.3279418
34_0_34B,8644,34,true,1585433749,153,4,280.24,14484,277.59,283.15,False,0,43.7276496,-79.3279418
34_0_34B,8644,34,true,1585433780,146,43,280.24,14484,277.59,283.15,False,0,43.7250595,-79.3258438
34_0_34B,8644,34,true,1585433779,146,43,280.24,14484,277.59,283.15,False,0,43.7250595,-79.3258438
34_0_34B,8644,34,true,1585433809,11,31,280.13,14484,277.59,283.15,False,0,43.7246971,-79.3241195
34_0_34B,8644,34,true,1585433810,11,31,280.13,14484,277.59,283.15,False,0,43.7246971,-79.3241195
34_0_34B,8644,34,true,1585433839,71,43,280.05,14484,277.59,282.59,False,0,43.7253341,-79.3216934
34_0_34B,8644,34,true,1585433840,71,43,280.05,14484,277.59,282.59,False,0,43.7253341,-79.3216934
34_0_34B,8644,34,true,1585433869,88,42,280.05,14484,277.59,282.59,False,0,43.726284,-79.3162841
34_0_34B,8644,34,true,1585433870,88,42,280.05,14484,277.59,282.59,False,0,43.726284,-79.3162841
34_0_34B,8644,34,true,1585433899,96,0,280.2,14484,277.59,283.15,False,0,43.7261428,-79.3143539
34_0_34B,8644,34,true,1585433900,96,0,280.2,14484,277.59,283.15,False,0,43.7261428,-79.3143539
34_0_34B,8644,34,true,1585433930,102,2,280.2,14484,277.59,283.15,False,0,43.7261428,-79.3143539
34_0_34B,8644,34,true,1585433929,102,2,280.2,14484,277.59,283.15,False,0,43.7261428,-79.3143539
34_0_34B,8644,34,true,1585433959,102,40,280.2,14484,277.59,283.15,False,0,43.7257194,-79.3116073
34_0_34B,8644,34,true,1585433960,102,40,280.2,14484,277.59,283.15,False,0,43.7257194,-79.3116073
34_0_34B,8644,34,true,1585433990,95,0,280.18,14484,277.59,283.15,False,0,43.7249488,-79.3067169
34_0_34B,8644,34,true,1585433989,95,0,280.18,14484,277.59,283.15,False,0,43.7249488,-79.3067169
34_0_34B,8644,34,true,1585434019,100,42,280.19,14484,277.59,283.15,False,0,43.7247533,-79.3048915
34_0_34B,8644,34,true,1585434020,100,42,280.19,14484,277.59,283.15,False,0,43.7247533,-79.3048915
34_0_34B,8644,34,true,1585434049,90,0,280.19,14484,277.59,283.15,False,0,43.7246819,-79.3034667
34_0_34B,8644,34,true,1585434050,90,0,280.19,14484,277.59,283.15,False,0,43.7246819,-79.3034667
34_0_34B,8644,34,true,1585434080,90,0,280.19,14484,277.59,283.15,False,0,43.7246819,-79.3034667
34_0_34B,8644,34,true,1585434079,90,0,280.19,14484,277.59,283.15,False,0,43.7246819,-79.3034667
34_0_34B,8644,34,true,1585434109,90,0,280.19,14484,277.59,283.15,False,0,43.7246513,-79.3023986
34_0_34B,8644,34,true,1585434110,90,0,280.19,14484,277.59,283.15,False,0,43.7246513,-79.3023986
34_0_34B,8644,34,true,1585434139,65,0,280.19,14484,277.59,283.15,False,0,43.7247886,-79.3015645
34_0_34B,8644,34,true,1585434140,65,0,280.19,14484,277.59,283.15,False,0,43.7247886,-79.3015645
34_0_34B,8644,34,true,1585434170,65,0,280.19,14484,277.59,283.15,False,0,43.7247886,-79.3015645
34_0_34B,8644,34,true,1585434169,65,0,280.19,14484,277.59,283.15,False,0,43.7247886,-79.3015645
34_0_34B,8644,34,true,1585434200,71,38,280.24,14484,277.59,283.15,False,0,43.7252332,-79.299239
34_0_34B,8644,34,true,1585434199,71,38,280.24,14484,277.59,283.15,False,0,43.7252332,-79.299239
34_0_34B,8644,34,true,1585434229,74,7,280.24,14484,277.59,283.15,False,0,43.7254719,-79.298216
34_0_34B,8644,34,true,1585434230,74,7,280.24,14484,277.59,283.15,False,0,43.7254719,-79.298216
34_0_34B,8644,34,true,1585434260,76,0,280.24,14484,277.59,283.15,False,0,43.7254759,-79.2981986
34_0_34B,8644,34,true,1585434259,76,0,280.24,14484,277.59,283.15,False,0,43.7254759,-79.2981986
34_0_34B,8644,34,true,1585434289,72,44,280.24,14484,277.59,283.15,False,0,43.7260953,-79.2952153
34_0_34B,8644,34,true,1585434290,72,44,280.24,14484,277.59,283.15,False,0,43.7260953,-79.2952153
34_0_34B,8644,34,true,1585434320,73,0,280.23,14484,277.59,283.15,False,0,43.7266867,-79.2921549
34_0_34B,8644,34,true,1585434319,73,0,280.23,14484,277.59,283.15,False,0,43.7266867,-79.2921549
34_0_34B,8644,34,true,1585434349,73,0,280.23,14484,277.59,283.15,False,0,43.7266867,-79.2921549
34_0_34B,8644,34,true,1585434350,73,0,280.23,14484,277.59,283.15,False,0,43.7266867,-79.2921549
34_0_34B,8644,34,true,1585434379,73,0,280.23,14484,277.59,283.15,False,0,43.7266867,-79.2921549
34_0_34B,8644,34,true,1585434380,73,0,280.23,14484,277.59,283.15,False,0,43.7266867,-79.2921549
34_0_34B,8644,34,true,1585434409,73,0,280.23,14484,277.59,283.15,False,0,43.726964,-79.2912368
34_0_34B,8644,34,true,1585434410,73,0,280.23,14484,277.59,283.15,False,0,43.726964,-79.2912368
34_0_34B,8644,34,true,1585434439,71,35,280.23,14484,277.59,283.15,False,0,43.727127,-79.2904618
34_0_34B,8644,34,true,1585434440,71,35,280.23,14484,277.59,283.15,False,0,43.727127,-79.2904618
34_0_34B,8644,34,true,1585434469,71,22,280.23,14484,277.59,283.15,False,0,43.7275443,-79.2884745
34_0_34B,8644,34,true,1585434470,71,22,280.23,14484,277.59,283.15,False,0,43.7275443,-79.2884745
34_0_34B,8644,34,true,1585434500,72,42,280.23,14484,277.59,283.15,False,0,43.7283935,-79.2849062
34_0_34B,8644,34,true,1585434499,72,42,280.23,14484,277.59,283.15,False,0,43.7283935,-79.2849062
34_0_34B,8644,34,true,1585434530,74,44,280.23,14484,277.59,283.15,False,0,43.7292852,-79.2806658
34_0_34B,8644,34,true,1585434560,74,0,280.23,14484,277.59,283.15,False,0,43.7296955,-79.2791002
34_0_34B,8644,34,true,1585434559,74,0,280.23,14484,277.59,283.15,False,0,43.7296955,-79.2791002
34_0_34B,8644,34,true,1585434589,73,27,280.23,14484,277.59,283.15,False,0,43.7301229,-79.2770692
34_0_34B,8644,34,true,1585434590,73,27,280.23,14484,277.59,283.15,False,0,43.7301229,-79.2770692
34_0_34B,8644,34,true,1585434619,71,31,280.23,14484,277.59,283.15,False,0,43.7303762,-79.2759009
34_0_34B,8644,34,true,1585434620,71,31,280.23,14484,277.59,283.15,False,0,43.7303762,-79.2759009
34_0_34B,8644,34,true,1585434650,73,0,280.24,14484,277.59,283.15,False,0,43.7306826,-79.27393
34_0_34B,8644,34,true,1585434649,73,0,280.24,14484,277.59,283.15,False,0,43.7306826,-79.27393
34_0_34B,8644,34,true,1585434680,73,0,280.24,14484,277.59,283.15,False,0,43.7311767,-79.2723386
34_0_34B,8644,34,true,1585434679,73,0,280.24,14484,277.59,283.15,False,0,43.7311767,-79.2723386
34_0_34B,8644,34,true,1585434710,69,12,280.24,14484,277.59,283.15,False,0,43.731259,-79.271923
34_0_34B,8644,34,true,1585434711,69,12,280.24,14484,277.59,283.15,False,0,43.731259,-79.271923
34_0_34B,8644,34,true,1585434740,72,0,280.24,14484,277.59,283.15,False,0,43.7318689,-79.2690712
