dir,id,route,predable,time,hdg,spd,temp,vis,t_min,t_max,snow,rain,lat,lon
34_1_34C,8868,34,true,1585433570,254,7,280.06,14484,276.48,283.15,False,0,43.7135848,-79.3646774
34_1_34C,8868,34,true,1585433569,254,7,280.06,14484,276.48,283.15,False,0,43.7135848,-79.3646774
34_1_34C,8868,34,true,1585433599,254,0,280.04,14484,276.48,283.15,False,0,43.713581,-79.3652038
34_1_34C,8868,34,true,1585433600,254,0,280.04,14484,276.48,283.15,False,0,43.713581,-79.3652038
34_1_34C,8868,34,true,1585433629,253,35,280.04,14484,276.48,283.15,False,0,43.7128696,-79.368396
34_1_34C,8868,34,true,1585433630,253,35,280.04,14484,276.48,283.15,False,0,43.7128696,-79.368396
34_1_34C,8868,34,true,1585433659,254,32,280.04,14484,276.48,283.15,False,0,43.7122872,-79.3713011
34_1_34C,8868,34,true,1585433660,254,32,280.04,14484,276.48,283.15,False,0,43.7122872,-79.3713011
34_1_34C,8868,34,true,1585433689,252,26,280.03,14484,276.48,283.15,False,0,43.711494,-79.3755148
34_1_34C,8868,34,true,1585433690,252,26,280.03,14484,276.48,283.15,False,0,43.711494,-79.3755148
34_1_34C,8868,34,true,1585433719,253,0,280.03,14484,276.48,283.15,False,0,43.7112426,-79.3768234
34_1_34C,8868,34,true,1585433720,253,0,280.03,14484,276.48,283.15,False,0,43.7112426,-79.3768234
34_1_34C,8868,34,true,1585433750,253,0,280.03,14484,276.48,283.15,False,0,43.7112426,-79.3768234
34_1_34C,8868,34,true,1585433749,253,0,280.03,14484,276.48,283.15,False,0,43.7112426,-79.3768234
34_1_34C,8868,34,true,1585433780,253,16,280.03,14484,276.48,283.15,False,0,43.7111663,-79.3769378
34_1_34C,8868,34,true,1585433779,253,16,280.03,14484,276.48,283.15,False,0,43.7111663,-79.3769378
34_1_34C,8868,34,true,1585433809,254,38,280.03,14484,276.48,283.15,False,0,43.7104498,-79.3802452
34_1_34C,8868,34,true,1585433810,254,38,280.03,14484,276.48,283.15,False,0,43.7104498,-79.3802452
34_1_34C,8868,34,true,1585433839,253,15,280.03,14484,276.48,283.15,False,0,43.7100529,-79.3822696
34_1_34C,8868,34,true,1585433840,253,15,280.03,14484,276.48,283.15,False,0,43.7100529,-79.3822696
34_1_34C,8868,34,true,1585433869,253,33,280.02,14484,276.48,283.15,False,0,43.7091952,-79.386143
34_1_34C,8868,34,true,1585433870,253,33,280.02,14484,276.48,283.15,False,0,43.7091952,-79.386143
34_1_34C,8868,34,true,1585433899,254,26,280.02,14484,276.48,283.15,False,0,43.7090478,-79.3871023
34_1_34C,8868,34,true,1585433900,254,26,280.02,14484,276.48,283.15,False,0,43.7090478,-79.3871023
34_1_34C,8868,34,true,1585433930,253,24,280.02,14484,276.48,283.15,False,0,43.7085675,-79.3893055
34_1_34C,8868,34,true,1585433929,253,24,280.02,14484,276.48,283.15,False,0,43.7085675,-79.3893055
34_1_34C,8868,34,true,1585433959,255,26,280.02,14484,276.48,283.15,False,0,43.7080637,-79.3920173
34_1_34C,8868,34,true,1585433960,255,26,280.02,14484,276.48,283.15,False,0,43.7080637,-79.3920173
34_1_34C,8868,34,true,1585433990,255,24,280.02,14484,276.48,283.15,False,0,43.7075327,-79.3946336
34_1_34C,8868,34,true,1585433989,255,24,280.02,14484,276.48,283.15,False,0,43.7075327,-79.3946336
34_1_34C,8868,34,true,1585434019,253,4,280.01,14484,276.48,283.15,False,0,43.707412,-79.3953709
34_1_34C,8868,34,true,1585434020,253,4,280.01,14484,276.48,283.15,False,0,43.707412,-79.3953709
34_1_34C,8868,34,true,1585434049,254,22,280.01,14484,276.48,283.15,False,0,43.7068513,-79.3977665
34_1_34C,8868,34,true,1585434050,254,22,280.01,14484,276.48,283.15,False,0,43.7068513,-79.3977665
34_1_34C,8868,34,true,1585434080,253,0,280.01,14484,276.48,283.15,False,0,43.7064136,-79.3999209
34_1_34C,8868,34,true,1585434079,253,0,280.01,14484,276.48,283.15,False,0,43.7064136,-79.3999209
34_1_34C,8868,34,true,1585434109,165,17,280.01,14484,276.48,283.15,False,0,43.7057882,-79.4001062
34_1_34C,8868,34,true,1585434110,165,17,280.01,14484,276.48,283.15,False,0,43.7057882,-79.4001062
34_1_34C,8868,34,true,1585434139,160,14,279.93,14484,276.48,283.15,False,0,43.7047468,-79.3993621
34_1_34C,8868,34,true,1585434140,160,14,279.93,14484,276.48,283.15,False,0,43.7047468,-79.3993621
34_1_34C,8868,34,true,1585434170,8,0,279.93,14484,276.48,283.15,False,0,43.7042828,-79.3985623
34_1_34C,8868,34,true,1585434169,8,0,279.93,14484,276.48,283.15,False,0,43.7042828,-79.3985623
34_1_34C,8868,34,true,1585434200,8,0,279.93,14484,276.48,283.15,False,0,43.7042828,-79.3985623
34_1_34C,8868,34,true,1585434229,8,0,279.93,14484,276.48,283.15,False,0,43.7042828,-79.3985623
34_1_34C,8868,34,true,1585434230,8,0,279.93,14484,276.48,283.15,False,0,43.7042828,-79.3985623
34_1_34C,8868,34,true,1585434379,8,0,279.93,14484,276.48,283.15,False,0,43.7042828,-79.3985623
34_1_34C,8868,34,true,1585434469,8,0,280.08,14484,277.59,282.59,False,0,43.7042828,-79.3985623
34_1_34C,8868,34,true,1585434530,8,0,280.08,14484,277.59,282.59,False,0,43.7042828,-79.3985623
34_1_34C,8868,34,true,1585434560,8,0,280.08,14484,277.59,282.59,False,0,43.7042828,-79.3985623
34_1_34C,8868,34,true,1585434589,8,0,280.08,14484,277.59,282.59,False,0,43.7042828,-79.3985623
34_1_34C,8868,34,true,1585434619,8,0,280.08,14484,277.59,282.59,False,0,43.7042828,-79.3985623
34_1_34C,8868,34,true,1585434650,8,0,280.08,14484,277.59,282.59,False,0,43.7042828,-79.3985623
34_1_34C,8868,34,true,1585434680,8,0,280.08,14484,277.59,282.59,False,0,43.7042828,-79.3985623
34_1_34C,8868,34,true,1585434710,8,0,280.08,14484,277.59,282.59,False,0,43.7042828,-79.3985623
34_1_34C,8868,34,true,1585434770,8,0,280.08,14484,277.59,282.59,False,0,43.7042828,-79.3985623
34_1_34C,8868,34,true,1585436481,188,0,279.87,14484,277.04,282.04,False,0,43.7131866,-79.3268416
34_1_34C,8868,34,true,1585436480,188,0,279.87,14484,277.04,282.04,False,0,43.7131866,-79.3268416
34_1_34C,8868,34,true,1585436511,118,0,279.87,14484,277.04,282.04,False,0,43.7128933,-79.3265483
34_1_34C,8868,34,true,1585436510,118,0,279.87,14484,277.04,282.04,False,0,43.7128933,-79.3265483
34_1_34C,8868,34,true,1585436541,118,0,279.87,14484,277.04,282.04,False,0,43.7128933,-79.3265466
34_1_34C,8868,34,true,1585436540,118,0,279.87,14484,277.04,282.04,False,0,43.7128933,-79.3265466
34_1_34C,8868,34,true,1585436570,118,0,279.87,14484,277.04,282.04,False,0,43.7128933,-79.3265466
34_1_34C,8868,34,true,1585436571,118,0,279.87,14484,277.04,282.04,False,0,43.7128933,-79.3265466
34_1_34C,8868,34,true,1585436600,118,0,279.87,14484,277.04,282.04,False,0,43.7128933,-79.3265466
34_1_34C,8868,34,true,1585436601,118,0,279.87,14484,277.04,282.04,False,0,43.7128933,-79.3265466
34_1_34C,8868,34,true,1585436632,118,0,279.87,14484,277.04,282.04,False,0,43.7128933,-79.3265466
34_1_34C,8868,34,true,1585436633,118,0,279.87,14484,277.04,282.04,False,0,43.7128933,-79.3265466
34_1_34C,8868,34,true,1585436660,118,0,279.87,14484,277.04,282.04,False,0,43.7128933,-79.3265466
34_1_34C,8868,34,true,1585436661,118,0,279.87,14484,277.04,282.04,False,0,43.7128933,-79.3265466
34_1_34C,8868,34,true,1585436690,118,0,279.87,14484,277.04,282.04,False,0,43.7128933,-79.3265466
34_1_34C,8868,34,true,1585436691,118,0,279.87,14484,277.04,282.04,False,0,43.7128933,-79.3265466
34_1_34C,8868,34,true,1585436721,118,0,279.87,14484,277.04,282.04,False,0,43.7128933,-79.3265466
34_1_34C,8868,34,true,1585436720,118,0,279.87,14484,277.04,282.04,False,0,43.7128933,-79.3265466
34_1_34C,8868,34,true,1585436750,118,0,279.87,14484,277.04,282.04,False,0,43.7128933,-79.3265466
34_1_34C,8868,34,true,1585436751,118,0,279.87,14484,277.04,282.04,False,0,43.7128933,-79.3265466
34_1_34C,8868,34,true,1585436781,118,0,279.87,14484,277.04,282.04,False,0,43.7128933,-79.3265466
34_1_34C,8868,34,true,1585436780,118,0,279.87,14484,277.04,282.04,False,0,43.7128933,-79.3265466
34_1_34C,8868,34,true,1585436811,118,0,279.87,14484,277.04,282.04,False,0,43.7128933,-79.3265466
34_1_34C,8868,34,true,1585436810,118,0,279.87,14484,277.04,282.04,False,0,43.7128933,-79.3265466
34_1_34C,8868,34,true,1585436840,118,0,279.87,14484,277.04,282.04,False,0,43.7128933,-79.3265466
34_1_34C,8868,34,true,1585436841,118,0,279.87,14484,277.04,282.04,False,0,43.7128933,-79.3265466
34_1_34C,8868,34,true,1585436870,118,0,279.87,14484,277.04,282.04,False,0,43.7128933,-79.3265466
34_1_34C,8868,34,true,1585436871,118,0,279.87,14484,277.04,282.04,False,0,43.7128933,-79.3265466
34_1_34C,8868,34,true,1585436900,118,0,279.87,14484,277.04,282.04,False,0,43.7128933,-79.3265466
34_1_34C,8868,34,true,1585436901,118,0,279.87,14484,277.04,282.04,False,0,43.7128933,-79.3265466
34_1_34C,8868,34,true,1585436931,118,0,279.83,14484,277.04,282.04,False,0,43.7128933,-79.3265466
34_1_34C,8868,34,true,1585436930,118,0,279.83,14484,277.04,282.04,False,0,43.7128933,-79.3265466
34_1_34C,8868,34,true,1585436961,118,0,279.83,14484,277.04,282.04,False,0,43.7128933,-79.3265466
34_1_34C,8868,34,true,1585436960,118,0,279.83,14484,277.04,282.04,False,0,43.7128933,-79.3265466
34_1_34C,8868,34,true,1585436991,118,0,279.83,14484,277.04,282.04,False,0,43.7128933,-79.3265466
34_1_34C,8868,34,true,1585436990,118,0,279.83,14484,277.04,282.04,False,0,43.7128933,-79.3265466
34_1_34C,8868,34,true,1585437021,118,0,279.83,14484,277.04,282.04,False,0,43.7128933,-79.3265466
34_1_34C,8868,34,true,1585437051,118,0,279.83,14484,277.04,282.04,False,0,43.7128933,-79.3265466
34_1_34C,8868,34,true,1585437050,118,0,279.83,14484,277.04,282.04,False,0,43.7128933,-79.3265466
34_1_34C,8868,34,true,1585437081,118,0,279.83,14484,277.04,282.04,False,0,43.7128933,-79.3265466
34_1_34C,8868,34,true,1585437080,118,0,279.83,14484,277.04,282.04,False,0,43.7128933,-79.3265466
34_1_34C,8868,34,true,1585437110,118,0,279.83,14484,277.04,282.04,False,0,43.7128933,-79.3265466
34_1_34C,8868,34,true,1585437111,118,0,279.83,14484,277.04,282.04,False,0,43.7128933,-79.3265466
34_1_34C,8868,34,true,1585437141,118,0,279.83,14484,277.04,282.04,False,0,43.7128933,-79.3265466
34_1_34C,8868,34,true,1585437140,118,0,279.83,14484,277.04,282.04,False,0,43.7128933,-79.3265466
34_1_34C,8868,34,true,1585437170,118,0,279.83,14484,277.04,282.04,False,0,43.7128933,-79.3265466
34_1_34C,8868,34,true,1585437171,118,0,279.83,14484,277.04,282.04,False,0,43.7128933,-79.3265466
34_1_34C,8868,34,true,1585437201,118,0,279.83,14484,277.04,282.04,False,0,43.7128933,-79.3265466
34_1_34C,8868,34,true,1585437200,118,0,279.83,14484,277.04,282.04,False,0,43.7128933,-79.3265466
34_1_34C,8868,34,true,1585437231,118,0,279.83,14484,277.04,282.04,False,0,43.7128933,-79.3265466
34_1_34C,8868,34,true,1585437230,118,0,279.83,14484,277.04,282.04,False,0,43.7128933,-79.3265466
34_1_34C,8868,34,true,1585437261,118,0,279.83,14484,277.04,282.04,False,0,43.7129211,-79.3265304
34_1_34C,8868,34,true,1585437291,118,0,279.83,14484,277.04,282.04,False,0,43.7129211,-79.3265304
34_1_34C,8868,34,true,1585437290,118,0,279.83,14484,277.04,282.04,False,0,43.7129211,-79.3265304
34_1_34C,8868,34,true,1585437321,118,0,279.83,14484,277.04,282.04,False,0,43.7129211,-79.3265304
34_1_34C,8868,34,true,1585437320,118,0,279.83,14484,277.04,282.04,False,0,43.7129211,-79.3265304
34_1_34C,8868,34,true,1585437351,118,0,279.83,14484,277.04,282.04,False,0,43.7129211,-79.3265304
34_1_34C,8868,34,true,1585437350,118,0,279.83,14484,277.04,282.04,False,0,43.7129211,-79.3265304
34_1_34C,8868,34,true,1585437381,118,0,279.83,14484,277.04,282.04,False,0,43.7129211,-79.3265304
34_1_34C,8868,34,true,1585437380,118,0,279.83,14484,277.04,282.04,False,0,43.7129211,-79.3265304
34_1_34C,8868,34,true,1585437410,118,0,279.83,14484,277.04,282.04,False,0,43.7129211,-79.3265304
34_1_34C,8868,34,true,1585437411,118,0,279.83,14484,277.04,282.04,False,0,43.7129211,-79.3265304
34_1_34C,8868,34,true,1585437441,118,0,279.83,14484,277.04,282.04,False,0,43.7129211,-79.3265304
34_1_34C,8868,34,true,1585437440,118,0,279.83,14484,277.04,282.04,False,0,43.7129211,-79.3265304
34_1_34C,8868,34,true,1585437470,118,0,279.83,14484,277.04,282.04,False,0,43.7129211,-79.3265304
34_1_34C,8868,34,true,1585437471,118,0,279.83,14484,277.04,282.04,False,0,43.7129211,-79.3265304
34_1_34C,8868,34,true,1585437501,118,0,279.83,14484,277.04,282.04,False,0,43.7129211,-79.3265304
34_1_34C,8868,34,true,1585437531,106,13,279.69,14484,277.04,282.04,False,0,43.7128829,-79.3264617
34_1_34C,8868,34,true,1585437530,106,13,279.69,14484,277.04,282.04,False,0,43.7128829,-79.3264617
34_1_34C,8868,34,true,1585437561,216,0,279.7,14484,277.04,282.04,False,0,43.7123565,-79.3247222
34_1_34C,8868,34,true,1585437560,216,0,279.7,14484,277.04,282.04,False,0,43.7123565,-79.3247222
34_1_34C,8868,34,true,1585437591,354,34,279.7,14484,277.04,282.04,False,0,43.7134552,-79.3243331
34_1_34C,8868,34,true,1585437590,354,34,279.7,14484,277.04,282.04,False,0,43.7134552,-79.3243331
34_1_34C,8868,34,true,1585437621,347,30,279.66,14484,277.59,281.48,False,0,43.7158775,-79.3248138
34_1_34C,8868,34,true,1585437620,347,30,279.66,14484,277.59,281.48,False,0,43.7158775,-79.3248138
34_1_34C,8868,34,true,1585437651,324,31,279.83,14484,277.59,282.04,False,0,43.7180252,-79.3268127
34_1_34C,8868,34,true,1585437681,216,0,279.67,14484,277.59,281.48,False,0,43.7193298,-79.3275604
34_1_34C,8868,34,true,1585437680,216,0,279.67,14484,277.59,281.48,False,0,43.7193298,-79.3275604
34_1_34C,8868,34,true,1585437711,13,41,279.67,14484,277.59,281.48,False,0,43.7214827,-79.3278645
34_1_34C,8868,34,true,1585437710,13,41,279.67,14484,277.59,281.48,False,0,43.7214827,-79.3278645
34_1_34C,8868,34,true,1585437740,57,26,279.66,14484,277.59,281.48,False,0,43.7232648,-79.3245918
34_1_34C,8868,34,true,1585437741,57,26,279.66,14484,277.59,281.48,False,0,43.7232648,-79.3245918
34_1_34C,8868,34,true,1585437771,328,30,279.85,14484,277.59,282.04,False,0,43.7251311,-79.3258373
34_1_34C,8868,34,true,1585437770,328,30,279.85,14484,277.59,282.04,False,0,43.7251311,-79.3258373
34_1_34C,8868,34,true,1585437800,341,28,279.85,14484,277.59,282.04,False,0,43.7274223,-79.3278267
34_1_34C,8868,34,true,1585437801,341,28,279.85,14484,277.59,282.04,False,0,43.7274223,-79.3278267
34_1_34C,8868,34,true,1585437830,305,0,279.85,14484,277.59,282.04,False,0,43.7282406,-79.328207
34_1_34C,8868,34,true,1585437831,305,0,279.85,14484,277.59,282.04,False,0,43.7282406,-79.328207
34_1_34C,8868,34,true,1585437861,0,24,279.75,14484,278.15,281.48,False,0,43.7296052,-79.3284063
34_1_34C,8868,34,true,1585437860,0,24,279.75,14484,278.15,281.48,False,0,43.7296052,-79.3284063
34_1_34C,8868,34,true,1585437891,324,15,279.75,14484,278.15,281.48,False,0,43.7301995,-79.3285742
34_1_34C,8868,34,true,1585437890,324,15,279.75,14484,278.15,281.48,False,0,43.7301995,-79.3285742
34_1_34C,8868,34,true,1585437920,159,31,279.75,14484,278.15,281.48,False,0,43.7278125,-79.3280972
34_1_34C,8868,34,true,1585437921,159,31,279.75,14484,278.15,281.48,False,0,43.7278125,-79.3280972
34_1_34C,8868,34,true,1585437951,254,30,279.75,14484,278.15,281.48,False,0,43.7272298,-79.3286157
34_1_34C,8868,34,true,1585437950,254,30,279.75,14484,278.15,281.48,False,0,43.7272298,-79.3286157
34_1_34C,8868,34,true,1585437981,249,35,279.75,14484,278.15,281.48,False,0,43.7264964,-79.331901
34_1_34C,8868,34,true,1585437980,249,35,279.75,14484,278.15,281.48,False,0,43.7264964,-79.331901
34_1_34C,8868,34,true,1585438011,222,39,279.67,14484,277.59,281.48,False,0,43.7240705,-79.3347751
34_1_34C,8868,34,true,1585438041,191,31,279.72,14484,277.04,282.04,False,0,43.722381,-79.3364584
34_1_34C,8868,34,true,1585438040,191,31,279.72,14484,277.04,282.04,False,0,43.722381,-79.3364584
34_1_34C,8868,34,true,1585438071,253,31,279.72,14484,277.04,282.04,False,0,43.7210582,-79.3370222
34_1_34C,8868,34,true,1585438101,245,6,279.72,14484,277.04,282.04,False,0,43.7207369,-79.3380704
34_1_34C,8868,34,true,1585438131,247,0,279.72,14484,277.04,282.04,False,0,43.7207312,-79.3380908
34_1_34C,8868,34,true,1585438161,242,35,279.7,14484,277.04,281.48,False,0,43.7204627,-79.3398666
34_1_34C,8868,34,true,1585438191,243,36,279.7,14484,277.04,281.48,False,0,43.7193679,-79.3424606
34_1_34C,8868,34,true,1585438221,246,41,279.71,14484,277.04,281.48,False,0,43.7180945,-79.3465222
34_1_34C,8868,34,true,1585438220,246,41,279.71,14484,277.04,281.48,False,0,43.7180945,-79.3465222
34_1_34C,8868,34,true,1585438251,245,40,279.71,14484,277.04,281.48,False,0,43.7170493,-79.3502856
34_1_34C,8868,34,true,1585438250,245,40,279.71,14484,277.04,281.48,False,0,43.7170493,-79.3502856
34_1_34C,8868,34,true,1585438281,256,39,279.63,14484,277.04,281.48,False,0,43.715585,-79.355105
34_1_34C,8868,34,true,1585438280,256,39,279.63,14484,277.04,281.48,False,0,43.715585,-79.355105
34_1_34C,8868,34,true,1585438311,251,34,279.68,14484,277.59,281.48,False,0,43.7146744,-79.3594704
34_1_34C,8868,34,true,1585438340,254,30,279.68,14484,277.59,281.48,False,0,43.7138719,-79.3633111
34_1_34C,8868,34,true,1585438341,254,30,279.68,14484,277.59,281.48,False,0,43.7138719,-79.3633111
34_1_34C,8868,34,true,1585438371,254,14,279.68,14484,277.59,281.48,False,0,43.7135972,-79.3646163
34_1_34C,8868,34,true,1585438370,254,14,279.68,14484,277.59,281.48,False,0,43.7135972,-79.3646163
34_1_34C,8868,34,true,1585438401,253,32,279.61,14484,277.04,281.48,False,0,43.7131523,-79.3671184
34_1_34C,8868,34,true,1585438433,254,32,279.61,14484,277.04,281.48,False,0,43.7123673,-79.3708165
34_1_34C,8868,34,true,1585438434,254,32,279.61,14484,277.04,281.48,False,0,43.7123673,-79.3708165
34_1_34C,8868,34,true,1585438461,254,31,279.61,14484,277.04,281.48,False,0,43.7116862,-79.3745036
34_1_34C,8868,34,true,1585438491,253,9,279.65,14484,277.04,281.48,False,0,43.7112426,-79.3768234
34_1_34C,8868,34,true,1585438521,253,0,279.65,14484,277.04,281.48,False,0,43.7112077,-79.3768757
34_1_34C,8868,34,true,1585438551,253,0,279.65,14484,277.04,281.48,False,0,43.7112077,-79.3768757
34_1_34C,8868,34,true,1585438581,254,7,279.65,14484,277.04,281.48,False,0,43.7111707,-79.3769313
34_1_34C,8868,34,true,1585438611,258,35,279.65,14484,277.04,281.48,False,0,43.7104597,-79.3802237
34_1_34C,8868,34,true,1585438641,254,5,279.65,14484,277.04,281.48,False,0,43.7100529,-79.3822696
34_1_34C,8868,34,true,1585438671,255,33,279.71,14484,277.59,281.48,False,0,43.7091955,-79.3861416
34_1_34C,8868,34,true,1585438701,233,23,279.71,14484,277.59,281.48,False,0,43.7085911,-79.3891798
34_1_34C,8868,34,true,1585438731,267,27,279.71,14484,277.59,281.48,False,0,43.7080619,-79.3920326
