dir,id,route,predable,time,hdg,spd,temp,vis,t_min,t_max,snow,rain,lat,lon
34_0_34A,8624,34,true,1585486555,96,11,278.49,9656,276.48,280.37,False,2,43.7042968,-79.3989882
34_0_34A,8624,34,true,1585486585,0,0,278.49,9656,276.48,280.37,False,2,43.7047291,-79.3985919
34_0_34A,8624,34,true,1585486616,0,0,278.49,9656,276.48,280.37,False,2,43.7047291,-79.3985919
34_0_34A,8624,34,true,1585486615,0,0,278.49,9656,276.48,280.37,False,2,43.7047291,-79.3985919
34_0_34A,8624,34,true,1585486646,0,0,278.49,9656,276.48,280.37,False,2,43.7047291,-79.3985919
34_0_34A,8624,34,true,1585486645,0,0,278.49,9656,276.48,280.37,False,2,43.7047291,-79.3985919
34_0_34A,8624,34,true,1585486675,273,15,278.47,8047,276.48,280.37,False,2,43.7054786,-79.3994674
34_0_34A,8624,34,true,1585486676,273,15,278.47,8047,276.48,280.37,False,2,43.7054786,-79.3994674
34_0_34A,8624,34,true,1585486706,71,11,278.47,8047,276.48,280.37,False,2,43.7063522,-79.3999252
34_0_34A,8624,34,true,1585486705,71,11,278.47,8047,276.48,280.37,False,2,43.7063522,-79.3999252
34_0_34A,8624,34,true,1585486736,76,4,278.47,8047,276.48,280.37,False,2,43.7066307,-79.3988265
34_0_34A,8624,34,true,1585486735,76,4,278.47,8047,276.48,280.37,False,2,43.7066307,-79.3988265
34_0_34A,8624,34,true,1585486765,76,0,278.47,8047,276.48,280.37,False,2,43.7066802,-79.39859
34_0_34A,8624,34,true,1585486766,76,0,278.47,8047,276.48,280.37,False,2,43.7066802,-79.39859
34_0_34A,8624,34,true,1585486796,76,24,278.47,8047,276.48,280.37,False,2,43.706974,-79.3971862
34_0_34A,8624,34,true,1585486795,76,24,278.47,8047,276.48,280.37,False,2,43.706974,-79.3971862
34_0_34A,8624,34,true,1585486825,70,22,278.49,8047,276.48,280.37,False,2,43.7074165,-79.3949966
34_0_34A,8624,34,true,1585486826,70,22,278.49,8047,276.48,280.37,False,2,43.7074165,-79.3949966
34_0_34A,8624,34,true,1585486855,74,0,278.49,8047,276.48,280.37,False,2,43.7077255,-79.3931427
34_0_34A,8624,34,true,1585486856,74,0,278.49,8047,276.48,280.37,False,2,43.7077255,-79.3931427
34_0_34A,8624,34,true,1585486886,74,14,278.49,8047,276.48,280.37,False,2,43.7078304,-79.3927491
34_0_34A,8624,34,true,1585486918,75,16,278.49,8047,276.48,280.37,False,2,43.7082681,-79.3908201
34_0_34A,8624,34,true,1585486946,75,11,278.49,8047,276.48,280.37,False,2,43.7083914,-79.3902228
34_0_34A,8624,34,true,1585486945,75,11,278.49,8047,276.48,280.37,False,2,43.7083914,-79.3902228
34_0_34A,8624,34,true,1585486976,74,21,278.49,8047,276.48,280.37,False,2,43.7087643,-79.3883082
34_0_34A,8624,34,true,1585486975,74,21,278.49,8047,276.48,280.37,False,2,43.7087643,-79.3883082
34_0_34A,8624,34,true,1585487005,75,29,278.49,8047,276.48,280.37,False,2,43.7094154,-79.3850672
34_0_34A,8624,34,true,1585487006,75,29,278.49,8047,276.48,280.37,False,2,43.7094154,-79.3850672
34_0_34A,8624,34,true,1585487036,74,28,278.52,9656,276.48,280.37,False,2,43.7100044,-79.3821311
34_0_34A,8624,34,true,1585487066,73,26,278.55,8047,276.48,280.37,False,2,43.7104837,-79.3795873
34_0_34A,8624,34,true,1585487065,73,26,278.55,8047,276.48,280.37,False,2,43.7104837,-79.3795873
34_0_34A,8624,34,true,1585487096,73,4,278.55,8047,276.48,280.37,False,2,43.710974,-79.3773878
34_0_34A,8624,34,true,1585487126,74,19,278.55,8047,276.48,280.37,False,2,43.7110395,-79.3770032
34_0_34A,8624,34,true,1585487155,74,33,278.56,8047,276.48,280.37,False,2,43.7118082,-79.373499
34_0_34A,8624,34,true,1585487156,74,33,278.56,8047,276.48,280.37,False,2,43.7118082,-79.373499
34_0_34A,8624,34,true,1585487186,74,35,278.56,8047,276.48,280.37,False,2,43.7125537,-79.3695304
34_0_34A,8624,34,true,1585487185,74,35,278.56,8047,276.48,280.37,False,2,43.7125537,-79.3695304
34_0_34A,8624,34,true,1585487215,73,26,278.56,8047,276.48,280.37,False,2,43.7132434,-79.366159
34_0_34A,8624,34,true,1585487216,73,26,278.56,8047,276.48,280.37,False,2,43.7132434,-79.366159
34_0_34A,8624,34,true,1585487245,75,0,278.57,8047,276.48,280.37,False,2,43.7135203,-79.3648959
34_0_34A,8624,34,true,1585487246,75,0,278.57,8047,276.48,280.37,False,2,43.7135203,-79.3648959
34_0_34A,8624,34,true,1585487276,75,0,278.57,8047,276.48,280.37,False,2,43.7135203,-79.3648959
34_0_34A,8624,34,true,1585487305,77,28,278.57,8047,276.48,280.37,False,2,43.7139798,-79.3623542
34_0_34A,8624,34,true,1585487306,77,28,278.57,8047,276.48,280.37,False,2,43.7139798,-79.3623542
34_0_34A,8624,34,true,1585487335,76,13,278.57,8047,276.48,280.37,False,2,43.7145412,-79.3597634
34_0_34A,8624,34,true,1585487366,67,0,278.57,8047,276.48,280.37,False,2,43.7145838,-79.3596919
34_0_34A,8624,34,true,1585487396,70,31,278.58,8047,276.48,280.37,False,2,43.7151581,-79.3573574
34_0_34A,8624,34,true,1585487395,70,31,278.58,8047,276.48,280.37,False,2,43.7151581,-79.3573574
34_0_34A,8624,34,true,1585487425,67,36,278.61,8047,276.48,280.37,False,2,43.715881,-79.3538548
34_0_34A,8624,34,true,1585487426,67,36,278.61,8047,276.48,280.37,False,2,43.715881,-79.3538548
34_0_34A,8624,34,true,1585487456,70,26,278.61,8047,276.48,280.37,False,2,43.716938,-79.3503832
34_0_34A,8624,34,true,1585487455,70,26,278.61,8047,276.48,280.37,False,2,43.716938,-79.3503832
34_0_34A,8624,34,true,1585487485,67,39,278.61,8047,276.48,280.37,False,2,43.7179314,-79.3470529
34_0_34A,8624,34,true,1585487515,65,35,278.61,8047,276.48,280.37,False,2,43.719182,-79.3430908
34_0_34A,8624,34,true,1585487546,67,26,278.61,8047,276.48,280.37,False,2,43.7203026,-79.3395087
34_0_34A,8624,34,true,1585487576,78,0,278.61,8047,276.48,280.37,False,2,43.7206053,-79.3384988
34_0_34A,8624,34,true,1585487575,78,0,278.61,8047,276.48,280.37,False,2,43.7206053,-79.3384988
34_0_34A,8624,34,true,1585487606,67,20,278.61,8047,276.48,280.37,False,2,43.7205994,-79.3376394
34_0_34A,8624,34,true,1585487605,67,20,278.61,8047,276.48,280.37,False,2,43.7205994,-79.3376394
34_0_34A,8624,34,true,1585487636,61,19,278.61,8047,276.48,280.37,False,2,43.7209569,-79.3370263
34_0_34A,8624,34,true,1585487635,61,19,278.61,8047,276.48,280.37,False,2,43.7209569,-79.3370263
34_0_34A,8624,34,true,1585487665,67,31,278.65,8047,276.48,280.37,False,2,43.7219335,-79.3341577
34_0_34A,8624,34,true,1585487666,67,31,278.65,8047,276.48,280.37,False,2,43.7219335,-79.3341577
34_0_34A,8624,34,true,1585487696,69,0,278.65,8047,276.48,280.37,False,2,43.7226878,-79.3316615
34_0_34A,8624,34,true,1585487695,69,0,278.65,8047,276.48,280.37,False,2,43.7226878,-79.3316615
34_0_34A,8624,34,true,1585487726,67,28,278.65,8047,276.48,280.37,False,2,43.722797,-79.3312974
34_0_34A,8624,34,true,1585487725,67,28,278.65,8047,276.48,280.37,False,2,43.722797,-79.3312974
34_0_34A,8624,34,true,1585487755,69,2,278.65,8047,276.48,280.37,False,2,43.7232879,-79.3291967
34_0_34A,8624,34,true,1585487756,69,2,278.65,8047,276.48,280.37,False,2,43.7232879,-79.3291967
34_0_34A,8624,34,true,1585487786,69,20,278.65,8047,276.48,280.37,False,2,43.723386,-79.3288132
34_0_34A,8624,34,true,1585487785,69,20,278.65,8047,276.48,280.37,False,2,43.723386,-79.3288132
34_0_34A,8624,34,true,1585487816,69,32,278.65,8047,276.48,280.37,False,2,43.7243227,-79.3253669
34_0_34A,8624,34,true,1585487815,69,32,278.65,8047,276.48,280.37,False,2,43.7243227,-79.3253669
34_0_34A,8624,34,true,1585487846,66,0,278.66,8047,277.04,280.37,False,2,43.7245844,-79.3245634
34_0_34A,8624,34,true,1585487845,66,0,278.66,8047,277.04,280.37,False,2,43.7245844,-79.3245634
34_0_34A,8624,34,true,1585487875,66,0,278.66,8047,277.04,280.37,False,2,43.7245844,-79.3245634
34_0_34A,8624,34,true,1585487876,66,0,278.66,8047,277.04,280.37,False,2,43.7245844,-79.3245634
34_0_34A,8624,34,true,1585487906,69,37,278.67,8047,277.59,280.37,False,2,43.7252429,-79.3220698
34_0_34A,8624,34,true,1585487905,69,37,278.67,8047,277.59,280.37,False,2,43.7252429,-79.3220698
34_0_34A,8624,34,true,1585487936,77,11,278.67,8047,277.59,280.37,False,2,43.7259879,-79.3190733
34_0_34A,8624,34,true,1585487935,77,11,278.67,8047,277.59,280.37,False,2,43.7259879,-79.3190733
34_0_34A,8624,34,true,1585487965,91,29,278.67,8047,277.59,280.37,False,2,43.7262827,-79.3163197
34_0_34A,8624,34,true,1585487966,91,29,278.67,8047,277.59,280.37,False,2,43.7262827,-79.3163197
34_0_34A,8624,34,true,1585487999,101,31,278.68,8047,277.59,280.37,False,2,43.7259266,-79.3136527
34_0_34A,8624,34,true,1585488000,101,31,278.68,8047,277.59,280.37,False,2,43.7259266,-79.3136527
34_0_34A,8624,34,true,1585488025,101,32,278.68,8047,277.59,280.37,False,2,43.7254938,-79.3099933
34_0_34A,8624,34,true,1585488026,101,32,278.68,8047,277.59,280.37,False,2,43.7254938,-79.3099933
34_0_34A,8624,34,true,1585488056,102,33,278.68,8047,277.59,280.37,False,2,43.7248115,-79.3054758
34_0_34A,8624,34,true,1585488086,90,0,278.68,8047,277.59,280.37,False,2,43.7246805,-79.3033777
34_0_34A,8624,34,true,1585488085,90,0,278.68,8047,277.59,280.37,False,2,43.7246805,-79.3033777
34_0_34A,8624,34,true,1585488115,80,15,278.68,8047,277.59,280.37,False,2,43.7247245,-79.3018061
34_0_34A,8624,34,true,1585488116,80,15,278.68,8047,277.59,280.37,False,2,43.7247245,-79.3018061
34_0_34A,8624,34,true,1585488146,65,0,278.68,8047,277.59,280.37,False,2,43.7248015,-79.3014719
34_0_34A,8624,34,true,1585488145,65,0,278.68,8047,277.59,280.37,False,2,43.7248015,-79.3014719
34_0_34A,8624,34,true,1585488176,65,0,278.68,8047,277.59,280.37,False,2,43.7248015,-79.3014719
34_0_34A,8624,34,true,1585488206,72,28,278.69,8047,277.59,280.37,False,2,43.7250549,-79.300063
34_0_34A,8624,34,true,1585488205,72,28,278.69,8047,277.59,280.37,False,2,43.7250549,-79.300063
34_0_34A,8624,34,true,1585488235,76,0,278.69,8047,277.59,280.37,False,2,43.7254856,-79.298157
34_0_34A,8624,34,true,1585488236,76,0,278.69,8047,277.59,280.37,False,2,43.7254856,-79.298157
34_0_34A,8624,34,true,1585488265,76,0,278.69,8047,277.59,280.37,False,2,43.7254856,-79.298157
34_0_34A,8624,34,true,1585488266,76,0,278.69,8047,277.59,280.37,False,2,43.7254856,-79.298157
34_0_34A,8624,34,true,1585488296,70,26,278.69,8047,277.59,280.37,False,2,43.7258964,-79.2959299
34_0_34A,8624,34,true,1585488325,73,21,278.69,8047,277.59,280.37,False,2,43.7265529,-79.2930362
34_0_34A,8624,34,true,1585488326,73,21,278.69,8047,277.59,280.37,False,2,43.7265529,-79.2930362
34_0_34A,8624,34,true,1585488355,73,0,278.69,8047,277.59,280.37,False,2,43.7266931,-79.2921142
34_0_34A,8624,34,true,1585488356,73,0,278.69,8047,277.59,280.37,False,2,43.7266931,-79.2921142
34_0_34A,8624,34,true,1585488386,73,1,278.69,8047,277.59,280.37,False,2,43.726964,-79.2912368
34_0_34A,8624,34,true,1585488385,73,1,278.69,8047,277.59,280.37,False,2,43.726964,-79.2912368
34_0_34A,8624,34,true,1585488416,72,22,278.69,8047,277.59,280.37,False,2,43.7271054,-79.2905187
34_0_34A,8624,34,true,1585488415,72,22,278.69,8047,277.59,280.37,False,2,43.7271054,-79.2905187
34_0_34A,8624,34,true,1585488446,72,24,278.69,8047,277.59,280.37,False,2,43.7275443,-79.2884745
34_0_34A,8624,34,true,1585488476,73,27,278.7,14484,277.59,280.37,False,2,43.7283723,-79.284932
34_0_34A,8624,34,true,1585488475,73,27,278.7,14484,277.59,280.37,False,2,43.7283723,-79.284932
34_0_34A,8624,34,true,1585488506,75,22,278.7,14484,277.59,280.37,False,2,43.7288255,-79.2826994
34_0_34A,8624,34,true,1585488505,75,22,278.7,14484,277.59,280.37,False,2,43.7288255,-79.2826994
34_0_34A,8624,34,true,1585488536,73,13,278.7,14484,277.59,280.37,False,2,43.7290834,-79.2820016
34_0_34A,8624,34,true,1585488535,73,13,278.7,14484,277.59,280.37,False,2,43.7290834,-79.2820016
34_0_34A,8624,34,true,1585488566,74,0,278.7,14484,277.59,280.37,False,2,43.7292308,-79.2813202
34_0_34A,8624,34,true,1585488596,74,25,278.7,14484,277.59,280.37,False,2,43.7295369,-79.279902
34_0_34A,8624,34,true,1585488626,72,26,278.7,14484,277.59,280.37,False,2,43.7301312,-79.2770297
34_0_34A,8624,34,true,1585488625,72,26,278.7,14484,277.59,280.37,False,2,43.7301312,-79.2770297
34_0_34A,8624,34,true,1585488656,72,24,278.71,8047,277.59,280.37,False,2,43.7306708,-79.2745889
34_0_34A,8624,34,true,1585488685,72,18,278.71,8047,277.59,280.37,False,2,43.7311752,-79.272346
34_0_34A,8624,34,true,1585488686,72,18,278.71,8047,277.59,280.37,False,2,43.7311752,-79.272346
34_0_34A,8624,34,true,1585488716,72,29,278.71,8047,277.59,280.37,False,2,43.7317013,-79.2700258
34_0_34A,8624,34,true,1585488715,72,29,278.71,8047,277.59,280.37,False,2,43.7317013,-79.2700258
34_0_34A,8624,34,true,1585488746,97,19,278.74,14484,277.59,280.37,False,2,43.7324122,-79.2669263
34_0_34A,8624,34,true,1585488775,61,7,278.74,14484,277.59,280.37,False,2,43.7326485,-79.2650978
34_0_34A,8624,34,true,1585488776,61,7,278.74,14484,277.59,280.37,False,2,43.7326485,-79.2650978
34_0_34A,8624,34,true,1585488806,53,2,278.68,8047,277.59,280.37,False,2,43.732766,-79.264538
34_0_34A,8624,34,true,1585488836,72,0,278.68,8047,277.59,280.37,False,2,43.73277,-79.2645201
34_0_34A,8624,34,true,1585488866,72,0,278.68,8047,277.59,280.37,False,2,43.73277,-79.2645201
34_0_34A,8624,34,true,1585488896,72,0,278.68,8047,277.59,280.37,False,2,43.73277,-79.2645201
34_0_34A,8624,34,true,1585488926,72,0,278.68,8047,277.59,280.37,False,2,43.73277,-79.2645201
34_0_34A,8624,34,true,1585488958,72,0,278.68,8047,277.59,280.37,False,2,43.73277,-79.2645201
34_0_34A,8624,34,true,1585488957,72,0,278.68,8047,277.59,280.37,False,2,43.73277,-79.2645201
34_0_34A,8624,34,true,1585488986,72,0,278.68,8047,277.59,280.37,False,2,43.73277,-79.2645201
34_0_34A,8624,34,true,1585488985,72,0,278.68,8047,277.59,280.37,False,2,43.73277,-79.2645201
34_0_34A,8624,34,true,1585489016,72,0,278.72,14484,277.59,280.37,False,2,43.73277,-79.2645201
34_0_34A,8624,34,true,1585489046,72,0,278.72,14484,277.59,280.37,False,2,43.73277,-79.2645201
34_0_34A,8624,34,true,1585489076,72,0,278.72,14484,277.59,280.37,False,2,43.73277,-79.2645201
34_0_34A,8624,34,true,1585489106,72,0,278.72,14484,277.59,280.37,False,2,43.73277,-79.2645201
34_0_34A,8624,34,true,1585489136,89,6,278.72,14484,277.59,280.37,False,2,43.7327951,-79.264409
34_0_34A,8624,34,true,1585489166,72,0,278.72,14484,277.59,280.37,False,2,43.7328606,-79.2641187
34_0_34A,8624,34,true,1585489196,72,0,278.72,14484,277.59,280.37,False,2,43.7328606,-79.2641187
34_0_34A,8624,34,true,1585489197,72,0,278.72,14484,277.59,280.37,False,2,43.7328606,-79.2641187
34_0_34A,8624,34,true,1585489226,72,0,278.72,14484,277.59,280.37,False,2,43.7328606,-79.2641187
34_0_34A,8624,34,true,1585489256,72,11,278.72,14484,277.59,280.37,False,2,43.7329585,-79.2636851
34_0_34A,8624,34,true,1585489286,250,21,278.72,14484,277.59,280.37,False,2,43.7332992,-79.2645645
34_0_34A,8624,34,true,1585491927,287,8,278.77,9656,277.04,280.37,False,2,43.7056311,-79.3999291
34_0_34A,8624,34,true,1585491957,357,0,278.77,9656,277.04,280.37,False,2,43.7062301,-79.4001083
34_0_34A,8624,34,true,1585491987,10,8,278.77,9656,277.04,280.37,False,2,43.7062301,-79.4001083
34_0_34A,8624,34,true,1585492017,75,9,278.77,9656,277.04,280.37,False,2,43.7066208,-79.3988791
34_0_34A,8624,34,true,1585492047,76,19,278.79,14484,277.04,280.37,False,2,43.7067128,-79.3984216
34_0_34A,8624,34,true,1585492077,74,25,278.79,14484,277.04,280.37,False,2,43.7072858,-79.3954297
34_0_34A,8624,34,true,1585492107,74,15,278.8,9656,277.04,280.37,False,2,43.7076685,-79.3935746
34_0_34A,8624,34,true,1585492106,74,15,278.8,9656,277.04,280.37,False,2,43.7076685,-79.3935746
34_0_34A,8624,34,true,1585492137,75,16,278.8,9656,277.04,280.37,False,2,43.7078151,-79.3927876
34_0_34A,8624,34,true,1585492167,74,19,278.8,9656,277.04,280.37,False,2,43.7082658,-79.3908308
34_0_34A,8624,34,true,1585492198,74,0,278.8,9656,277.04,280.37,False,2,43.708354,-79.3904062
34_0_34A,8624,34,true,1585492197,74,0,278.8,9656,277.04,280.37,False,2,43.708354,-79.3904062
34_0_34A,8624,34,true,1585492227,74,7,278.8,9656,277.04,280.37,False,2,43.7083695,-79.3903299
34_0_34A,8624,34,true,1585492257,73,25,278.8,9656,277.04,280.37,False,2,43.7089118,-79.3874435
34_0_34A,8624,34,true,1585492258,73,25,278.8,9656,277.04,280.37,False,2,43.7089118,-79.3874435
34_0_34A,8624,34,true,1585492287,74,33,278.93,14484,277.04,280.93,False,2,43.7094387,-79.3849524
34_0_34A,8624,34,true,1585492317,74,31,278.93,14484,277.04,280.93,False,2,43.7102564,-79.3809689
34_0_34A,8624,34,true,1585492347,74,18,278.93,14484,277.04,280.93,False,2,43.7109117,-79.3776746
34_0_34A,8624,34,true,1585492377,75,0,278.93,14484,277.04,280.93,False,2,43.7109859,-79.3773221
34_0_34A,8624,34,true,1585492407,75,0,278.93,14484,277.04,280.93,False,2,43.7109859,-79.3773221
34_0_34A,8624,34,true,1585492437,75,0,278.93,14484,277.04,280.93,False,2,43.7109859,-79.3773221
34_0_34A,8624,34,true,1585492467,72,24,278.93,14484,277.04,280.93,False,2,43.7111433,-79.3762478
34_0_34A,8624,34,true,1585492468,72,24,278.93,14484,277.04,280.93,False,2,43.7111433,-79.3762478
34_0_34A,8624,34,true,1585492497,72,30,278.81,14484,277.04,280.37,False,2,43.7117816,-79.3736279
34_0_34A,8624,34,true,1585492527,75,31,278.81,14484,277.04,280.37,False,2,43.712532,-79.3695805
34_0_34A,8624,34,true,1585492558,74,15,278.81,14484,277.04,280.37,False,2,43.713034,-79.3671533
34_0_34A,8624,34,true,1585492557,74,15,278.81,14484,277.04,280.37,False,2,43.713034,-79.3671533
34_0_34A,8624,34,true,1585492587,72,17,279,14484,277.04,280.93,False,2,43.7131367,-79.3668148
34_0_34A,8624,34,true,1585492588,72,17,279,14484,277.04,280.93,False,2,43.7131367,-79.3668148
34_0_34A,8624,34,true,1585492617,73,28,279.05,14484,277.04,280.93,False,2,43.7138217,-79.3631127
34_0_34A,8624,34,true,1585492618,73,28,279.05,14484,277.04,280.93,False,2,43.7138217,-79.3631127
34_0_34A,8624,34,true,1585492647,76,21,279.05,14484,277.04,280.93,False,2,43.7143566,-79.360512
34_0_34A,8624,34,true,1585492677,70,17,279.05,14484,277.04,280.93,False,2,43.7146902,-79.3594085
34_0_34A,8624,34,true,1585492707,77,27,279.06,14484,277.04,280.93,False,2,43.7153456,-79.3563485
34_0_34A,8624,34,true,1585492737,60,32,279.02,14484,277.04,280.93,False,2,43.7161508,-79.3528621
34_0_34A,8624,34,true,1585492768,65,33,279.02,14484,277.04,280.93,False,2,43.7169717,-79.3496567
34_0_34A,8624,34,true,1585492767,65,33,279.02,14484,277.04,280.93,False,2,43.7169717,-79.3496567
34_0_34A,8624,34,true,1585492798,68,37,279.02,14484,277.04,280.93,False,2,43.7183483,-79.3457003
34_0_34A,8624,34,true,1585492797,68,37,279.02,14484,277.04,280.93,False,2,43.7183483,-79.3457003
34_0_34A,8624,34,true,1585492827,70,35,279.07,14484,277.04,280.93,False,0,43.7194907,-79.3420361
34_0_34A,8624,34,true,1585492858,66,16,279.07,14484,277.04,280.93,False,0,43.720496,-79.3388477
34_0_34A,8624,34,true,1585492857,66,16,279.07,14484,277.04,280.93,False,0,43.720496,-79.3388477
34_0_34A,8624,34,true,1585492887,78,0,279.07,14484,277.04,280.93,False,0,43.7206459,-79.3383636
34_0_34A,8624,34,true,1585492888,78,0,279.07,14484,277.04,280.93,False,0,43.7206459,-79.3383636
34_0_34A,8624,34,true,1585492917,67,25,279.07,14484,277.04,280.93,False,0,43.720613,-79.3376159
34_0_34A,8624,34,true,1585492918,67,25,279.07,14484,277.04,280.93,False,0,43.720613,-79.3376159
34_0_34A,8624,34,true,1585492948,66,33,279.04,14484,277.59,280.93,False,2,43.7217113,-79.3348934
34_0_34A,8624,34,true,1585492947,66,33,279.04,14484,277.59,280.93,False,2,43.7217113,-79.3348934
34_0_34A,8624,34,true,1585492978,67,9,279.04,14484,277.59,280.93,False,2,43.7226961,-79.3316338
34_0_34A,8624,34,true,1585492977,67,9,279.04,14484,277.59,280.93,False,2,43.7226961,-79.3316338
34_0_34A,8624,34,true,1585493007,69,0,279.04,14484,277.59,280.93,False,2,43.7227065,-79.3315991
34_0_34A,8624,34,true,1585493008,69,0,279.04,14484,277.59,280.93,False,2,43.7227065,-79.3315991
34_0_34A,8624,34,true,1585493037,65,27,279.04,14484,277.59,280.93,False,2,43.7229611,-79.3307564
34_0_34A,8624,34,true,1585493038,65,27,279.04,14484,277.59,280.93,False,2,43.7229611,-79.3307564
34_0_34A,8624,34,true,1585493067,70,12,279.04,14484,277.59,280.93,False,2,43.7236302,-79.3282089
34_0_34A,8624,34,true,1585493068,70,12,279.04,14484,277.59,280.93,False,2,43.7236302,-79.3282089
34_0_34A,8624,34,true,1585493097,70,36,279.04,14484,277.59,280.93,False,2,43.7241569,-79.3261604
34_0_34A,8624,34,true,1585493128,66,0,279.04,14484,277.59,280.93,False,2,43.7243937,-79.3252796
34_0_34A,8624,34,true,1585493127,66,0,279.04,14484,277.59,280.93,False,2,43.7243937,-79.3252796
34_0_34A,8624,34,true,1585493157,68,12,279.09,14484,278.15,280.93,False,2,43.7248485,-79.3235563
34_0_34A,8624,34,true,1585493187,71,36,279.14,14484,278.15,280.93,False,2,43.7257199,-79.3201971
34_0_34A,8624,34,true,1585493218,75,18,279.14,14484,278.15,280.93,False,2,43.7260205,-79.3182992
34_0_34A,8624,34,true,1585493217,75,18,279.14,14484,278.15,280.93,False,2,43.7260205,-79.3182992
34_0_34A,8624,34,true,1585493247,97,33,279.1,14484,278.15,280.93,False,2,43.7261316,-79.3142727
34_0_34A,8624,34,true,1585493248,97,33,279.1,14484,278.15,280.93,False,2,43.7261316,-79.3142727
34_0_34A,8624,34,true,1585493277,103,0,279.1,14484,278.15,280.93,False,2,43.7259713,-79.3133568
34_0_34A,8624,34,true,1585493278,103,0,279.1,14484,278.15,280.93,False,2,43.7259713,-79.3133568
34_0_34A,8624,34,true,1585493307,103,0,279.15,14484,278.15,280.93,False,2,43.7259713,-79.3133568
34_0_34A,8624,34,true,1585493308,103,0,279.15,14484,278.15,280.93,False,2,43.7259713,-79.3133568
34_0_34A,8624,34,true,1585493338,101,30,279.15,14484,278.15,280.93,False,2,43.7256802,-79.3113566
34_0_34A,8624,34,true,1585493337,101,30,279.15,14484,278.15,280.93,False,2,43.7256802,-79.3113566
34_0_34A,8624,34,true,1585493367,100,40,279.15,14484,278.15,280.93,False,2,43.7251196,-79.3074995
34_0_34A,8624,34,true,1585493368,100,40,279.15,14484,278.15,280.93,False,2,43.7251196,-79.3074995
34_0_34A,8624,34,true,1585493398,89,31,279.1,14484,278.15,280.93,False,0,43.7246808,-79.302615
34_0_34A,8624,34,true,1585493397,89,31,279.1,14484,278.15,280.93,False,0,43.7246808,-79.302615
34_0_34A,8624,34,true,1585493428,76,0,279.1,14484,278.15,280.93,False,0,43.7248417,-79.3011816
34_0_34A,8624,34,true,1585493427,76,0,279.1,14484,278.15,280.93,False,0,43.7248417,-79.3011816
34_0_34A,8624,34,true,1585495258,73,32,279.28,12874,278.15,280.93,False,2,43.7275466,-79.2884597
34_0_34A,8624,34,true,1585495288,73,0,279.37,12874,278.15,280.93,False,2,43.7279669,-79.2870421
34_0_34A,8624,34,true,1585495318,73,0,279.37,12874,278.15,280.93,False,2,43.7279669,-79.2870421
34_0_34A,8624,34,true,1585495319,73,0,279.37,12874,278.15,280.93,False,2,43.7279669,-79.2870421
34_0_34A,8624,34,true,1585495348,73,44,279.4,12874,278.15,280.93,False,2,43.7286782,-79.283389
34_0_34A,8624,34,true,1585495378,74,0,279.4,12874,278.15,280.93,False,2,43.7294802,-79.2801528
34_0_34A,8624,34,true,1585495408,74,0,279.4,12874,278.15,280.93,False,2,43.7294802,-79.2801528
34_0_34A,8624,34,true,1585495438,74,45,279.4,12874,278.15,280.93,False,2,43.7298563,-79.2779971
34_0_34A,8624,34,true,1585495439,74,45,279.4,12874,278.15,280.93,False,2,43.7298563,-79.2779971
34_0_34A,8624,34,true,1585495468,73,0,279.4,12874,278.15,280.93,False,2,43.7300591,-79.2773558
34_0_34A,8624,34,true,1585495498,73,0,279.4,12874,278.15,280.93,False,2,43.7300591,-79.2773558
34_0_34A,8624,34,true,1585495528,73,34,279.4,12874,278.15,280.93,False,2,43.730411,-79.2757468
34_0_34A,8624,34,true,1585495529,73,34,279.4,12874,278.15,280.93,False,2,43.730411,-79.2757468
34_0_34A,8624,34,true,1585495559,71,37,279.29,12874,278.15,280.93,False,2,43.731259,-79.2719192
34_0_34A,8624,34,true,1585495558,71,37,279.29,12874,278.15,280.93,False,2,43.731259,-79.2719192
34_0_34A,8624,34,true,1585495588,71,18,279.77,9656,278.15,284.26,False,2,43.7315163,-79.2708124
34_0_34A,8624,34,true,1585495618,72,24,279.77,9656,278.15,284.26,False,2,43.7322124,-79.2677179
34_0_34A,8624,34,true,1585495648,106,27,279.77,9656,278.15,284.26,False,2,43.7326671,-79.2650021
34_0_34A,8624,34,true,1585495679,67,22,279.39,12874,278.15,280.93,False,2,43.7329296,-79.2631718
34_0_34A,8624,34,true,1585495678,67,22,279.39,12874,278.15,280.93,False,2,43.7329296,-79.2631718
34_0_34A,8624,34,true,1585495709,270,0,279.39,12874,278.15,280.93,False,2,43.73281,-79.2631884
34_0_34A,8624,34,true,1585495708,270,0,279.39,12874,278.15,280.93,False,2,43.73281,-79.2631884
34_0_34A,8624,34,true,1585495738,270,0,279.39,12874,278.15,280.93,False,2,43.73281,-79.2631884
34_0_34A,8624,34,true,1585495768,270,0,279.39,12874,278.15,280.93,False,2,43.73281,-79.2631884
34_0_34A,8624,34,true,1585498228,74,0,280.24,14484,278.71,282.04,False,2,43.7082786,-79.3907699
34_0_34A,8624,34,true,1585498229,74,0,280.24,14484,278.71,282.04,False,2,43.7082786,-79.3907699
34_0_34A,8624,34,true,1585498259,74,19,280.24,14484,278.71,282.04,False,2,43.7084922,-79.3897018
34_0_34A,8624,34,true,1585498258,74,19,280.24,14484,278.71,282.04,False,2,43.7084922,-79.3897018
34_0_34A,8624,34,true,1585498289,74,20,280.24,14484,278.71,282.04,False,2,43.7087974,-79.3881454
34_0_34A,8624,34,true,1585498319,73,37,280.22,14484,278.71,282.04,False,2,43.7095527,-79.3844223
34_0_34A,8624,34,true,1585498318,73,37,280.22,14484,278.71,282.04,False,2,43.7095527,-79.3844223
34_0_34A,8624,34,true,1585498349,72,30,280.22,14484,278.71,282.04,False,2,43.7101058,-79.381752
34_0_34A,8624,34,true,1585498379,75,18,280.22,14484,278.71,282.04,False,2,43.7107048,-79.3786697
34_0_34A,8624,34,true,1585498378,75,18,280.22,14484,278.71,282.04,False,2,43.7107048,-79.3786697
34_0_34A,8624,34,true,1585498409,75,0,280.22,14484,278.71,282.04,False,2,43.7108192,-79.3780975
34_0_34A,8624,34,true,1585498439,72,26,280.22,14484,278.71,282.04,False,2,43.7108726,-79.377861
34_0_34A,8624,34,true,1585498438,72,26,280.22,14484,278.71,282.04,False,2,43.7108726,-79.377861
34_0_34A,8624,34,true,1585498469,72,41,280.25,14484,278.71,282.04,False,2,43.7115783,-79.3744888
34_0_34A,8624,34,true,1585498468,72,41,280.25,14484,278.71,282.04,False,2,43.7115783,-79.3744888
34_0_34A,8624,34,true,1585498499,73,43,280.25,14484,278.71,282.04,False,2,43.7126502,-79.3691635
34_0_34A,8624,34,true,1585498529,72,31,280.25,14484,278.71,282.04,False,2,43.7132682,-79.3660049
34_0_34A,8624,34,true,1585498559,74,0,280.25,14484,278.71,282.04,False,2,43.7133712,-79.3653717
34_0_34A,8624,34,true,1585498589,75,26,280.25,14484,278.71,282.04,False,2,43.7135581,-79.3647308
34_0_34A,8624,34,true,1585498619,73,36,280.25,14484,278.71,282.04,False,2,43.7141342,-79.3618545
34_0_34A,8624,34,true,1585498618,73,36,280.25,14484,278.71,282.04,False,2,43.7141342,-79.3618545
34_0_34A,8624,34,true,1585498649,74,0,280.25,14484,278.71,282.04,False,2,43.7144584,-79.3599014
34_0_34A,8624,34,true,1585498679,74,0,280.25,14484,278.71,282.04,False,2,43.7144584,-79.3599014
34_0_34A,8624,34,true,1585498709,87,42,280.23,14484,278.71,282.04,False,2,43.7153854,-79.3561172
34_0_34A,8624,34,true,1585498739,68,42,280.26,14484,278.71,282.04,False,2,43.7165412,-79.3515472
34_0_34A,8624,34,true,1585498740,68,42,280.26,14484,278.71,282.04,False,2,43.7165412,-79.3515472
34_0_34A,8624,34,true,1585498769,138,0,280.26,14484,278.71,282.04,False,2,43.716957,-79.3499908
34_0_34A,8624,34,true,1585498799,138,0,280.26,14484,278.71,282.04,False,2,43.716957,-79.3499908
34_0_34A,8624,34,true,1585498829,70,43,280.26,14484,278.71,282.04,False,2,43.7184257,-79.3454437
34_0_34A,8624,34,true,1585498859,66,49,280.61,14484,278.71,286.15,False,2,43.7194175,-79.3423004
34_0_34A,8624,34,true,1585498860,66,49,280.61,14484,278.71,286.15,False,2,43.7194175,-79.3423004
34_0_34A,8624,34,true,1585498889,78,0,280.61,14484,278.71,286.15,False,2,43.7204322,-79.3390502
34_0_34A,8624,34,true,1585498890,78,0,280.61,14484,278.71,286.15,False,2,43.7204322,-79.3390502
34_0_34A,8624,34,true,1585498919,78,0,280.61,14484,278.71,286.15,False,2,43.7204322,-79.3390502
34_0_34A,8624,34,true,1585498949,216,0,280.61,14484,278.71,286.15,False,2,43.7205467,-79.3377304
34_0_34A,8624,34,true,1585498979,65,46,280.61,14484,278.71,286.15,False,2,43.7213876,-79.3359506
34_0_34A,8624,34,true,1585499009,65,0,280.62,14484,278.71,286.15,False,2,43.7222668,-79.3328469
34_0_34A,8624,34,true,1585499010,65,0,280.62,14484,278.71,286.15,False,2,43.7222668,-79.3328469
34_0_34A,8624,34,true,1585499039,71,32,280.62,14484,278.71,286.15,False,2,43.7232335,-79.3295389
34_0_34A,8624,34,true,1585499040,71,32,280.62,14484,278.71,286.15,False,2,43.7232335,-79.3295389
34_0_34A,8624,34,true,1585499069,69,0,280.62,14484,278.71,286.15,False,2,43.7233314,-79.3289184
34_0_34A,8624,34,true,1585499099,71,21,280.62,14484,278.71,286.15,False,2,43.7241564,-79.3261718
34_0_34A,8624,34,true,1585499129,70,37,280.62,14484,278.71,286.15,False,2,43.7243908,-79.3252881
34_0_34A,8624,34,true,1585499159,67,13,280.57,14484,278.71,286.15,False,2,43.7246806,-79.3241854
34_0_34A,8624,34,true,1585499189,73,40,280.78,14484,278.71,286.15,False,2,43.725918,-79.3194416
34_0_34A,8624,34,true,1585499219,76,2,280.78,14484,278.71,286.15,False,2,43.7259698,-79.318792
34_0_34A,8624,34,true,1585499220,76,2,280.78,14484,278.71,286.15,False,2,43.7259698,-79.318792
34_0_34A,8624,34,true,1585499249,92,34,280.78,14484,278.71,286.15,False,2,43.726255,-79.3156356
34_0_34A,8624,34,true,1585499250,92,34,280.78,14484,278.71,286.15,False,2,43.726255,-79.3156356
34_0_34A,8624,34,true,1585499280,96,0,280.66,14484,278.71,282.04,False,2,43.7260526,-79.3140843
34_0_34A,8624,34,true,1585499279,96,0,280.66,14484,278.71,282.04,False,2,43.7260526,-79.3140843
34_0_34A,8624,34,true,1585499322,101,48,280.66,14484,278.71,282.04,False,2,43.7255228,-79.310225
34_0_34A,8624,34,true,1585499352,89,39,280.64,14484,278.71,286.15,False,2,43.724682,-79.3034706
34_0_34A,8624,34,true,1585499381,90,0,280.64,14484,278.71,286.15,False,2,43.7246892,-79.3028552
34_0_34A,8624,34,true,1585499382,90,0,280.64,14484,278.71,286.15,False,2,43.7246892,-79.3028552
34_0_34A,8624,34,true,1585499412,83,19,280.64,14484,278.71,286.15,False,2,43.7246813,-79.3026187
34_0_34A,8624,34,true,1585499411,83,19,280.64,14484,278.71,286.15,False,2,43.7246813,-79.3026187
34_0_34A,8624,34,true,1585499442,65,0,280.64,14484,278.71,286.15,False,2,43.7246681,-79.3019135
34_0_34A,8624,34,true,1585499472,76,0,280.78,14484,278.71,282.04,False,0,43.724875,-79.3010096
34_0_34A,8624,34,true,1585499471,76,0,280.78,14484,278.71,282.04,False,0,43.724875,-79.3010096
34_0_34A,8624,34,true,1585499502,76,0,280.78,14484,278.71,282.04,False,0,43.724875,-79.3010096
34_0_34A,8624,34,true,1585499501,76,0,280.78,14484,278.71,282.04,False,0,43.724875,-79.3010096
34_0_34A,8624,34,true,1585499534,76,33,280.88,14484,280.15,281.48,False,0,43.7250069,-79.3002934
34_0_34A,8624,34,true,1585499561,76,0,280.88,14484,280.15,281.48,False,0,43.7255094,-79.2980567
34_0_34A,8624,34,true,1585499562,76,0,280.88,14484,280.15,281.48,False,0,43.7255094,-79.2980567
34_0_34A,8624,34,true,1585499592,76,0,280.88,14484,280.15,281.48,False,0,43.7255967,-79.297696
34_0_34A,8624,34,true,1585499591,76,0,280.88,14484,280.15,281.48,False,0,43.7255967,-79.297696
34_0_34A,8624,34,true,1585499622,73,38,280.88,14484,280.15,281.48,False,0,43.7256547,-79.2967931
34_0_34A,8624,34,true,1585499621,73,38,280.88,14484,280.15,281.48,False,0,43.7256547,-79.2967931
34_0_34A,8624,34,true,1585499652,72,43,280.86,14484,280.15,281.48,False,0,43.7266286,-79.2925516
34_0_34A,8624,34,true,1585499682,73,0,280.86,14484,280.15,281.48,False,0,43.7270139,-79.2907601
34_0_34A,8624,34,true,1585499712,73,0,280.86,14484,280.15,281.48,False,0,43.7276344,-79.287857
34_0_34A,8624,34,true,1585499711,73,0,280.86,14484,280.15,281.48,False,0,43.7276344,-79.287857
34_0_34A,8624,34,true,1585499742,73,0,280.86,14484,280.15,281.48,False,0,43.7277052,-79.287772
34_0_34A,8624,34,true,1585499741,73,0,280.86,14484,280.15,281.48,False,0,43.7277052,-79.287772
34_0_34A,8624,34,true,1585499772,73,0,280.86,14484,280.15,281.48,False,0,43.7277052,-79.287772
34_0_34A,8624,34,true,1585499771,73,0,280.86,14484,280.15,281.48,False,0,43.7277052,-79.287772
34_0_34A,8624,34,true,1585499802,73,40,280.94,14484,280.15,281.48,False,0,43.7283884,-79.2849122
34_0_34A,8624,34,true,1585499801,73,40,280.94,14484,280.15,281.48,False,0,43.7283884,-79.2849122
34_0_34A,8624,34,true,1585499832,72,42,280.94,14484,280.15,281.48,False,0,43.7286771,-79.2833964
34_0_34A,8624,34,true,1585499831,72,42,281.01,14484,280.15,282.04,False,0,43.7286771,-79.2833964
34_0_34A,8624,34,true,1585499861,74,0,280.94,14484,280.15,281.48,False,0,43.7291221,-79.281826
34_0_34A,8624,34,true,1585499862,74,0,280.94,14484,280.15,281.48,False,0,43.7291221,-79.281826
34_0_34A,8624,34,true,1585499892,75,41,280.94,14484,280.15,281.48,False,0,43.7297182,-79.2787628
34_0_34A,8624,34,true,1585499891,75,41,280.94,14484,280.15,281.48,False,0,43.7297182,-79.2787628
34_0_34A,8624,34,true,1585499922,73,39,280.94,14484,280.15,281.48,False,0,43.7302342,-79.2765535
34_0_34A,8624,34,true,1585499921,73,39,280.94,14484,280.15,281.48,False,0,43.7302342,-79.2765535
34_0_34A,8624,34,true,1585499952,73,36,280.94,14484,280.15,281.48,False,0,43.7305243,-79.2752378
34_0_34A,8624,34,true,1585499951,73,36,280.94,14484,280.15,281.48,False,0,43.7305243,-79.2752378
34_0_34A,8624,34,true,1585499982,73,25,280.87,14484,280.15,281.48,False,0,43.730777,-79.2737984
34_0_34A,8624,34,true,1585499981,73,25,280.87,14484,280.15,281.48,False,0,43.730777,-79.2737984
34_0_34A,8624,34,true,1585500012,73,0,280.87,14484,280.15,281.48,False,0,43.7312736,-79.2712783
34_0_34A,8624,34,true,1585500042,72,44,280.87,14484,280.15,281.48,False,0,43.7317428,-79.2698454
34_0_34A,8624,34,true,1585500072,72,0,280.87,14484,280.15,281.48,False,0,43.7320098,-79.2682037
34_0_34A,8624,34,true,1585500102,76,31,280.87,14484,280.15,281.48,False,0,43.7324324,-79.265558
34_0_34A,8624,34,true,1585500132,72,0,281.03,14484,280.15,282.04,False,0,43.7328533,-79.264151
34_0_34A,8624,34,true,1585500162,66,17,281.03,14484,280.15,282.04,False,0,43.7330004,-79.2634968
34_0_34A,8624,34,true,1585500192,239,10,281.03,14484,280.15,282.04,False,0,43.7322933,-79.263595
34_0_34A,8624,34,true,1585500222,72,0,281.03,14484,280.15,282.04,False,0,43.7321966,-79.2638483
34_0_34A,8624,34,true,1585500252,72,0,281.03,14484,280.15,282.04,False,0,43.7321966,-79.2638483
34_0_34A,8624,34,true,1585500282,72,0,281.03,14484,280.15,282.04,False,0,43.7321966,-79.2638483
34_0_34A,8624,34,true,1585500312,72,0,281.03,14484,280.15,282.04,False,0,43.7321966,-79.2638483
34_0_34A,8624,34,true,1585500342,72,0,281.03,14484,280.15,282.04,False,0,43.7321966,-79.2638483
34_0_34A,8624,34,true,1585500372,72,0,281.03,14484,280.15,282.04,False,0,43.7321966,-79.2638483
34_0_34A,8624,34,true,1585500402,72,0,281.03,14484,280.15,282.04,False,0,43.7321966,-79.2638483
34_0_34A,8624,34,true,1585500432,72,0,281.03,14484,280.15,282.04,False,0,43.7321966,-79.2638483
34_0_34A,8624,34,true,1585500462,72,0,281.03,14484,280.15,282.04,False,0,43.7321966,-79.2638483
34_0_34A,8624,34,true,1585500492,72,0,281.03,14484,280.15,282.04,False,0,43.7324638,-79.2641983
34_0_34A,8624,34,true,1585500522,72,0,281.03,14484,280.15,282.04,False,0,43.7324638,-79.2641983
34_0_34A,8624,34,true,1585500523,72,0,281.03,14484,280.15,282.04,False,0,43.7324638,-79.2641983
34_0_34A,8624,34,true,1585500552,72,0,281.03,14484,280.15,282.04,False,0,43.7324638,-79.2641983
34_0_34A,8624,34,true,1585500582,72,0,281.03,14484,280.15,282.04,False,0,43.7324638,-79.2641983
34_0_34A,8624,34,true,1585500613,72,0,281.03,14484,280.15,282.04,False,0,43.7324638,-79.2641983
34_0_34A,8624,34,true,1585500612,72,0,281.03,14484,280.15,282.04,False,0,43.7324638,-79.2641983
34_0_34A,8624,34,true,1585500642,72,0,281.43,14484,280.15,282.59,False,0,43.7324638,-79.2641983
34_0_34A,8624,34,true,1585500643,72,0,281.43,14484,280.15,282.59,False,0,43.7324638,-79.2641983
34_0_34A,8624,34,true,1585500672,72,0,281.43,14484,280.15,282.59,False,0,43.7324638,-79.2641983
34_0_34A,8624,34,true,1585500702,72,0,281.43,14484,280.15,282.59,False,0,43.7324638,-79.2641983
34_0_34A,8624,34,true,1585500703,72,0,281.43,14484,280.15,282.59,False,0,43.7324638,-79.2641983
34_0_34A,8624,34,true,1585500732,72,0,281.43,14484,280.15,282.59,False,0,43.7324638,-79.2641983
34_0_34A,8624,34,true,1585500762,72,0,281.43,14484,280.15,282.59,False,0,43.7324638,-79.2641983
34_0_34A,8624,34,true,1585500792,72,0,281.43,14484,280.15,282.59,False,0,43.7324638,-79.2641983
34_0_34A,8624,34,true,1585500822,339,9,281.43,14484,280.15,282.59,False,0,43.7322349,-79.263916
34_0_34A,8624,34,true,1585500823,339,9,281.43,14484,280.15,282.59,False,0,43.7322349,-79.263916
34_0_34A,8624,34,true,1585500852,72,0,281.43,14484,280.15,282.59,False,0,43.7323036,-79.2636871
34_0_34A,8624,34,true,1585500853,72,0,281.43,14484,280.15,282.59,False,0,43.7323036,-79.2636871
34_0_34A,8624,34,true,1585500882,339,16,281.43,14484,280.15,282.59,False,0,43.7330818,-79.2631912
34_0_34A,8624,34,true,1585503135,1,7,282.02,14484,280.15,283.71,False,0,43.7045982,-79.3985671
34_0_34A,8624,34,true,1585503163,342,14,282.02,14484,280.15,283.71,False,0,43.704768,-79.3985978
34_0_34A,8624,34,true,1585503193,216,0,282.68,14484,280.93,283.71,False,0,43.7053266,-79.3987583
34_0_34A,8624,34,true,1585503223,259,10,282.68,14484,280.93,283.71,False,0,43.7054283,-79.3990933
34_0_34A,8624,34,true,1585503222,259,10,282.68,14484,280.93,283.71,False,0,43.7054283,-79.3990933
34_0_34A,8624,34,true,1585503253,170,8,282.68,14484,280.93,283.71,False,0,43.705055,-79.399365
34_0_34A,8624,34,true,1585503252,170,8,282.68,14484,280.93,283.71,False,0,43.705055,-79.399365
34_0_34A,8624,34,true,1585503283,216,0,282.02,14484,280.15,283.71,False,0,43.7048466,-79.3992783
34_0_34A,8624,34,true,1585503313,216,0,282.02,14484,280.15,283.71,False,0,43.7048466,-79.3992783
34_0_34A,8624,34,true,1585503312,216,0,282.02,14484,280.15,283.71,False,0,43.7048466,-79.3992783
34_0_34A,8624,34,true,1585503343,216,0,282.02,14484,280.15,283.71,False,0,43.7048466,-79.3992783
34_0_34A,8624,34,true,1585503373,216,0,282.02,14484,280.15,283.71,False,0,43.7048466,-79.3992783
34_0_34A,8624,34,true,1585503403,216,0,282.02,14484,280.15,283.71,False,0,43.7048466,-79.3992783
34_0_34A,8624,34,true,1585503402,216,0,282.02,14484,280.15,283.71,False,0,43.7048466,-79.3992783
34_0_34A,8624,34,true,1585503433,216,0,282.02,14484,280.15,283.71,False,0,43.7048466,-79.3992783
34_0_34A,8624,34,true,1585503463,216,0,282.77,14484,281.48,283.71,False,0,43.7048466,-79.3992783
34_0_34A,8624,34,true,1585503493,216,0,282.77,14484,281.48,283.71,False,0,43.7048466,-79.3992783
34_0_34A,8624,34,true,1585503492,216,0,282.77,14484,281.48,283.71,False,0,43.7048466,-79.3992783
34_0_34A,8624,34,true,1585503523,216,0,282.77,14484,281.48,283.71,False,0,43.7048466,-79.3992783
34_0_34A,8624,34,true,1585503553,216,0,282.77,14484,281.48,283.71,False,0,43.7048466,-79.3992783
34_0_34A,8624,34,true,1585503583,216,0,282.77,14484,281.48,283.71,False,0,43.7048466,-79.3992783
34_0_34A,8624,34,true,1585503613,216,0,282.77,14484,281.48,283.71,False,0,43.7048466,-79.3992783
34_0_34A,8624,34,true,1585503612,216,0,282.77,14484,281.48,283.71,False,0,43.7048466,-79.3992783
34_0_34A,8624,34,true,1585503643,216,0,282.77,14484,281.48,283.71,False,0,43.7048466,-79.3992783
34_0_34A,8624,34,true,1585503673,216,0,282.77,14484,281.48,283.71,False,0,43.7048466,-79.3992783
34_0_34A,8624,34,true,1585503703,216,0,282.77,14484,281.48,283.71,False,0,43.7048466,-79.3992783
34_0_34A,8624,34,true,1585503733,216,0,282.77,14484,281.48,283.71,False,0,43.7048466,-79.3992783
34_0_34A,8624,34,true,1585503763,216,0,282.77,14484,281.48,283.71,False,0,43.7048466,-79.3992783
34_0_34A,8624,34,true,1585503794,216,0,282.77,14484,281.48,283.71,False,0,43.7048466,-79.3992783
34_0_34A,8624,34,true,1585503793,216,0,282.77,14484,281.48,283.71,False,0,43.7048466,-79.3992783
34_0_34A,8624,34,true,1585503823,216,0,282.77,14484,281.48,283.71,False,0,43.7048466,-79.3992783
34_0_34A,8624,34,true,1585503853,216,0,282.77,14484,281.48,283.71,False,0,43.7048466,-79.3992783
34_0_34A,8624,34,true,1585503883,216,0,282.77,14484,281.48,283.71,False,0,43.7048466,-79.3992783
34_0_34A,8624,34,true,1585503913,216,0,282.77,14484,281.48,283.71,False,0,43.7048466,-79.3992783
34_0_34A,8624,34,true,1585503943,164,2,282.77,14484,281.48,283.71,False,0,43.7048433,-79.3992766
34_0_34A,8624,34,true,1585503944,164,2,282.77,14484,281.48,283.71,False,0,43.7048433,-79.3992766
34_0_34A,8624,34,true,1585503973,79,5,282.77,14484,281.48,283.71,False,0,43.704605,-79.3988666
34_0_34A,8624,34,true,1585504003,10,5,282.77,14484,281.48,283.71,False,0,43.7052574,-79.3986129
34_0_34A,8624,34,true,1585504004,10,5,282.77,14484,281.48,283.71,False,0,43.7052574,-79.3986129
34_0_34A,8624,34,true,1585504033,216,0,282.77,14484,281.48,283.71,False,0,43.7052574,-79.3986129
34_0_34A,8624,34,true,1585504034,216,0,282.77,14484,281.48,283.71,False,0,43.7052574,-79.3986129
34_0_34A,8624,34,true,1585504063,216,0,283,14484,281.48,283.71,False,0,43.7052574,-79.3986129
34_0_34A,8624,34,true,1585504093,216,0,283,14484,281.48,283.71,False,0,43.7052574,-79.3986129
34_0_34A,8624,34,true,1585504123,279,12,283,14484,281.48,283.71,False,0,43.7054717,-79.3993564
34_0_34A,8624,34,true,1585504124,279,12,283,14484,281.48,283.71,False,0,43.7054717,-79.3993564
34_0_34A,8624,34,true,1585504153,29,6,283,14484,281.48,283.71,False,0,43.7062301,-79.4001083
34_0_34A,8624,34,true,1585504154,29,6,283,14484,281.48,283.71,False,0,43.7062301,-79.4001083
34_0_34A,8624,34,true,1585504185,77,9,283,14484,281.48,283.71,False,0,43.7065905,-79.3990406
34_0_34A,8624,34,true,1585504186,77,9,283,14484,281.48,283.71,False,0,43.7065905,-79.3990406
34_0_34A,8624,34,true,1585504214,75,4,283,14484,281.48,283.71,False,0,43.7068299,-79.3978688
34_0_34A,8624,34,true,1585504213,75,4,283,14484,281.48,283.71,False,0,43.7068299,-79.3978688
34_0_34A,8624,34,true,1585504243,74,23,283,14484,281.48,283.71,False,0,43.7071276,-79.3962242
34_0_34A,8624,34,true,1585504244,74,23,283,14484,281.48,283.71,False,0,43.7071276,-79.3962242
34_0_34A,8624,34,true,1585504274,78,25,283.06,14484,280.93,283.71,False,0,43.7076728,-79.3935445
34_0_34A,8624,34,true,1585504273,78,25,283.06,14484,280.93,283.71,False,0,43.7076728,-79.3935445
34_0_34A,8624,34,true,1585504303,74,0,283.06,14484,280.93,283.71,False,0,43.707756,-79.3929367
34_0_34A,8624,34,true,1585504304,74,0,283.06,14484,280.93,283.71,False,0,43.707756,-79.3929367
34_0_34A,8624,34,true,1585504333,74,22,283.06,14484,280.93,283.71,False,0,43.7080017,-79.3921005
34_0_34A,8624,34,true,1585504334,74,22,283.06,14484,280.93,283.71,False,0,43.7080017,-79.3921005
34_0_34A,8624,34,true,1585504363,75,15,283.06,14484,280.93,283.71,False,0,43.7082403,-79.3909527
34_0_34A,8624,34,true,1585504393,72,19,283.06,14484,280.93,283.71,False,0,43.7086278,-79.3889666
34_0_34A,8624,34,true,1585504423,74,9,283.06,14484,280.93,283.71,False,0,43.7087613,-79.388323
34_0_34A,8624,34,true,1585504424,74,9,283.06,14484,280.93,283.71,False,0,43.7087613,-79.388323
34_0_34A,8624,34,true,1585504456,74,31,283,14484,281.48,283.71,False,0,43.7094344,-79.3849749
34_0_34A,8624,34,true,1585504483,74,20,283,14484,281.48,283.71,False,0,43.7100099,-79.3821179
34_0_34A,8624,34,true,1585504484,74,20,283,14484,281.48,283.71,False,0,43.7100099,-79.3821179
34_0_34A,8624,34,true,1585504513,73,29,283,14484,281.48,283.71,False,0,43.7104807,-79.3795977
34_0_34A,8624,34,true,1585504514,73,29,283,14484,281.48,283.71,False,0,43.7104807,-79.3795977
34_0_34A,8624,34,true,1585504544,75,0,283,14484,281.48,283.71,False,0,43.7108427,-79.3779936
34_0_34A,8624,34,true,1585504543,75,0,283,14484,281.48,283.71,False,0,43.7108427,-79.3779936
34_0_34A,8624,34,true,1585504573,74,39,283,14484,281.48,283.71,False,0,43.7112317,-79.3758829
34_0_34A,8624,34,true,1585504603,75,44,283.01,14484,281.48,283.71,False,0,43.7123411,-79.3703254
34_0_34A,8624,34,true,1585504604,75,44,283.01,14484,281.48,283.71,False,0,43.7123411,-79.3703254
34_0_34A,8624,34,true,1585504633,71,29,283.01,14484,281.48,283.71,False,0,43.7132888,-79.3658734
34_0_34A,8624,34,true,1585504634,71,29,283.01,14484,281.48,283.71,False,0,43.7132888,-79.3658734
34_0_34A,8624,34,true,1585504663,75,0,282.99,14484,280.93,283.71,False,0,43.7134849,-79.3650126
34_0_34A,8624,34,true,1585504664,75,0,282.99,14484,280.93,283.71,False,0,43.7134849,-79.3650126
34_0_34A,8624,34,true,1585504693,73,28,283.06,14484,280.93,283.71,False,0,43.7137229,-79.3637376
34_0_34A,8624,34,true,1585504723,75,27,283.06,14484,280.93,283.71,False,0,43.7143572,-79.3605083
34_0_34A,8624,34,true,1585504724,75,27,283.06,14484,280.93,283.71,False,0,43.7143572,-79.3605083
34_0_34A,8624,34,true,1585504754,67,0,283.06,14484,280.93,283.71,False,0,43.7145814,-79.3596961
34_0_34A,8624,34,true,1585504753,67,0,283.06,14484,280.93,283.71,False,0,43.7145814,-79.3596961
34_0_34A,8624,34,true,1585504784,67,0,283.06,14484,280.93,283.71,False,0,43.7145814,-79.3596961
34_0_34A,8624,34,true,1585504783,67,0,283.06,14484,280.93,283.71,False,0,43.7145814,-79.3596961
34_0_34A,8624,34,true,1585504814,72,34,283.06,14484,280.93,283.71,False,0,43.7151842,-79.3572228
34_0_34A,8624,34,true,1585504813,72,34,283.06,14484,280.93,283.71,False,0,43.7151842,-79.3572228
34_0_34A,8624,34,true,1585504843,63,35,283.08,14484,280.93,284.26,False,2,43.7159949,-79.3533996
34_0_34A,8624,34,true,1585504844,63,35,283.08,14484,280.93,284.26,False,2,43.7159949,-79.3533996
34_0_34A,8624,34,true,1585504873,70,20,283.08,14484,280.93,284.26,False,2,43.716938,-79.3503832
34_0_34A,8624,34,true,1585504874,70,20,283.08,14484,280.93,284.26,False,2,43.716938,-79.3503832
34_0_34A,8624,34,true,1585504904,62,35,283.08,14484,280.93,284.26,False,2,43.7175238,-79.3484524
34_0_34A,8624,34,true,1585504903,62,35,283.08,14484,280.93,284.26,False,2,43.7175238,-79.3484524
34_0_34A,8624,34,true,1585504933,65,30,282.99,14484,280.93,283.71,False,0,43.7187986,-79.3442757
34_0_34A,8624,34,true,1585504934,65,30,282.99,14484,280.93,283.71,False,0,43.7187986,-79.3442757
34_0_34A,8624,34,true,1585504963,65,40,282.99,14484,280.93,283.71,False,0,43.7195679,-79.3417786
34_0_34A,8624,34,true,1585504964,65,40,282.99,14484,280.93,283.71,False,0,43.7195679,-79.3417786
34_0_34A,8624,34,true,1585504993,65,0,282.99,14484,280.93,283.71,False,0,43.720744,-79.3373951
34_0_34A,8624,34,true,1585505023,66,37,282.99,14484,280.93,283.71,False,0,43.7213654,-79.3360235
34_0_34A,8624,34,true,1585505053,67,39,283.19,14484,280.93,284.26,False,2,43.7224672,-79.3322
34_0_34A,8624,34,true,1585505054,67,39,283.19,14484,280.93,284.26,False,2,43.7224672,-79.3322
34_0_34A,8624,34,true,1585505083,69,0,283.19,14484,280.93,284.26,False,2,43.7226617,-79.3317482
34_0_34A,8624,34,true,1585505113,66,2,283.19,14484,280.93,284.26,False,2,43.722667,-79.3317309
34_0_34A,8624,34,true,1585505144,70,41,283.19,14484,280.93,284.26,False,2,43.7238466,-79.3273821
34_0_34A,8624,34,true,1585505143,70,41,283.19,14484,280.93,284.26,False,2,43.7238466,-79.3273821
34_0_34A,8624,34,true,1585505174,66,0,283.19,14484,280.93,284.26,False,2,43.724348,-79.3253377
34_0_34A,8624,34,true,1585505204,70,52,283.06,14484,280.93,284.26,False,2,43.7254155,-79.321378
34_0_34A,8624,34,true,1585505203,70,52,283.06,14484,280.93,284.26,False,2,43.7254155,-79.321378
34_0_34A,8624,34,true,1585505233,82,39,283.06,14484,280.93,284.26,False,2,43.7262476,-79.3169527
34_0_34A,8624,34,true,1585505234,82,39,283.06,14484,280.93,284.26,False,2,43.7262476,-79.3169527
34_0_34A,8624,34,true,1585505264,103,0,283.19,14484,280.93,284.26,False,2,43.7259418,-79.3135454
34_0_34A,8624,34,true,1585505263,103,0,283.19,14484,280.93,284.26,False,2,43.7259418,-79.3135454
34_0_34A,8624,34,true,1585505294,103,0,283.19,14484,280.93,284.26,False,2,43.7259563,-79.3134529
34_0_34A,8624,34,true,1585505293,103,0,283.19,14484,280.93,284.26,False,2,43.7259563,-79.3134529
34_0_34A,8624,34,true,1585505323,103,0,283.19,14484,280.93,284.26,False,2,43.7259563,-79.3134529
34_0_34A,8624,34,true,1585505324,103,0,283.19,14484,280.93,284.26,False,2,43.7259563,-79.3134529
34_0_34A,8624,34,true,1585505354,101,34,283.19,14484,280.93,284.26,False,2,43.7258972,-79.3126889
34_0_34A,8624,34,true,1585505353,101,34,283.19,14484,280.93,284.26,False,2,43.7258972,-79.3126889
34_0_34A,8624,34,true,1585505384,99,45,283.21,14484,280.93,284.26,False,2,43.7249375,-79.3068203
34_0_34A,8624,34,true,1585505383,99,45,283.21,14484,280.93,284.26,False,2,43.7249375,-79.3068203
34_0_34A,8624,34,true,1585505415,88,24,283.25,14484,280.93,284.26,False,2,43.7246917,-79.3028162
34_0_34A,8624,34,true,1585505444,82,20,283.25,14484,280.93,284.26,False,2,43.7246345,-79.3019759
34_0_34A,8624,34,true,1585505443,82,20,283.25,14484,280.93,284.26,False,2,43.7246345,-79.3019759
34_0_34A,8624,34,true,1585505474,76,0,283.25,14484,280.93,284.26,False,2,43.7248141,-79.3013707
34_0_34A,8624,34,true,1585505473,76,0,283.25,14484,280.93,284.26,False,2,43.7248141,-79.3013707
34_0_34A,8624,34,true,1585505503,72,29,283.25,14484,280.93,284.26,False,2,43.7254698,-79.2982251
34_0_34A,8624,34,true,1585505504,72,29,283.25,14484,280.93,284.26,False,2,43.7254698,-79.2982251
34_0_34A,8624,34,true,1585505533,76,0,283.3,14484,280.93,284.26,False,2,43.7256538,-79.2974535
34_0_34A,8624,34,true,1585505534,76,0,283.25,14484,280.93,284.26,False,2,43.7256538,-79.2974535
34_0_34A,8624,34,true,1585505563,74,28,283.3,14484,280.93,284.26,False,2,43.7256932,-79.2966572
34_0_34A,8624,34,true,1585505564,74,28,283.3,14484,280.93,284.26,False,2,43.7256932,-79.2966572
34_0_34A,8624,34,true,1585505593,73,34,283.3,14484,280.93,284.26,False,2,43.726569,-79.2929326
34_0_34A,8624,34,true,1585505594,73,34,283.3,14484,280.93,284.26,False,2,43.726569,-79.2929326
34_0_34A,8624,34,true,1585505624,72,2,283.3,14484,280.93,284.26,False,2,43.7269401,-79.2909545
34_0_34A,8624,34,true,1585505623,72,2,283.3,14484,280.93,284.26,False,2,43.7269401,-79.2909545
34_0_34A,8624,34,true,1585505653,72,3,283.3,14484,280.93,284.26,False,2,43.7269401,-79.2909545
34_0_34A,8624,34,true,1585505654,72,3,283.3,14484,280.93,284.26,False,2,43.7269401,-79.2909545
34_0_34A,8624,34,true,1585505684,72,9,283.3,14484,280.93,284.26,False,2,43.7272605,-79.2901098
34_0_34A,8624,34,true,1585505683,72,9,283.3,14484,280.93,284.26,False,2,43.7272605,-79.2901098
34_0_34A,8624,34,true,1585505714,72,28,283.3,14484,280.93,284.26,False,2,43.727408,-79.2893956
34_0_34A,8624,34,true,1585505713,72,28,283.3,14484,280.93,284.26,False,2,43.727408,-79.2893956
34_0_34A,8624,34,true,1585505744,73,0,283.3,14484,280.93,284.26,False,2,43.7277983,-79.287618
34_0_34A,8624,34,true,1585505743,73,0,283.3,14484,280.93,284.26,False,2,43.7277983,-79.287618
34_0_34A,8624,34,true,1585505774,70,26,283.26,14484,280.93,284.26,False,2,43.7283658,-79.2849402
34_0_34A,8624,34,true,1585505773,70,26,283.26,14484,280.93,284.26,False,2,43.7283658,-79.2849402
34_0_34A,8624,34,true,1585505804,72,27,283.26,14484,280.93,284.26,False,2,43.7288272,-79.2826965
34_0_34A,8624,34,true,1585505803,72,27,283.26,14484,280.93,284.26,False,2,43.7288272,-79.2826965
34_0_34A,8624,34,true,1585505834,74,0,283.26,14484,280.93,284.26,False,2,43.7292291,-79.2810816
34_0_34A,8624,34,true,1585505833,74,0,283.26,14484,280.93,284.26,False,2,43.7292291,-79.2810816
34_0_34A,8624,34,true,1585505864,72,19,283.26,14484,280.93,284.26,False,2,43.7295102,-79.2800202
34_0_34A,8624,34,true,1585505863,72,19,283.26,14484,280.93,284.26,False,2,43.7295102,-79.2800202
34_0_34A,8624,34,true,1585505893,76,6,283.26,14484,280.93,284.26,False,2,43.7300319,-79.2774887
34_0_34A,8624,34,true,1585505894,76,6,283.26,14484,280.93,284.26,False,2,43.7300319,-79.2774887
34_0_34A,8624,34,true,1585505924,73,0,283.26,14484,280.93,284.26,False,2,43.7300357,-79.2774702
34_0_34A,8624,34,true,1585505923,73,0,283.26,14484,280.93,284.26,False,2,43.7300357,-79.2774702
34_0_34A,8624,34,true,1585505954,73,0,283.26,14484,280.93,284.26,False,2,43.7300357,-79.2774702
34_0_34A,8624,34,true,1585505953,73,0,283.26,14484,280.93,284.26,False,2,43.7300357,-79.2774702
34_0_34A,8624,34,true,1585505984,73,26,283.26,14484,280.93,284.26,False,2,43.7303843,-79.2758651
34_0_34A,8624,34,true,1585505983,73,26,283.26,14484,280.93,284.26,False,2,43.7303843,-79.2758651
34_0_34A,8624,34,true,1585506014,73,0,283.26,14484,280.93,284.26,False,2,43.730517,-79.275271
34_0_34A,8624,34,true,1585506013,73,0,283.26,14484,280.93,284.26,False,2,43.730517,-79.275271
34_0_34A,8624,34,true,1585506044,73,23,283.3,14484,280.93,284.26,False,2,43.7307717,-79.2738057
34_0_34A,8624,34,true,1585506043,73,23,283.3,14484,280.93,284.26,False,2,43.7307717,-79.2738057
34_0_34A,8624,34,true,1585506074,72,20,283.3,14484,280.93,284.26,False,2,43.7313601,-79.2711486
34_0_34A,8624,34,true,1585506073,72,20,283.3,14484,280.93,284.26,False,2,43.7313601,-79.2711486
34_0_34A,8624,34,true,1585506103,72,6,283.3,14484,280.93,284.26,False,2,43.731536,-79.270725
34_0_34A,8624,34,true,1585506104,72,6,283.3,14484,280.93,284.26,False,2,43.731536,-79.270725
34_0_34A,8624,34,true,1585506133,71,28,283.3,14484,280.93,284.26,False,2,43.7319105,-79.2688117
34_0_34A,8624,34,true,1585506134,71,28,283.3,14484,280.93,284.26,False,2,43.7319105,-79.2688117
34_0_34A,8624,34,true,1585506164,70,0,283.44,14484,281.15,285.37,False,2,43.7322355,-79.2675781
34_0_34A,8624,34,true,1585506163,70,0,283.44,14484,281.15,285.37,False,2,43.7322355,-79.2675781
34_0_34A,8624,34,true,1585506194,70,0,283.44,14484,281.15,285.37,False,2,43.7322355,-79.2675781
34_0_34A,8624,34,true,1585506193,70,0,283.44,14484,281.15,285.37,False,2,43.7322355,-79.2675781
34_0_34A,8624,34,true,1585506226,70,0,283.44,14484,281.15,285.37,False,2,43.7322355,-79.2675781
34_0_34A,8624,34,true,1585506225,70,0,283.44,14484,281.15,285.37,False,2,43.7322355,-79.2675781
34_0_34A,8624,34,true,1585506256,70,0,283.44,14484,281.15,285.37,False,2,43.7322355,-79.2675781
34_0_34A,8624,34,true,1585506257,70,0,283.44,14484,281.15,285.37,False,2,43.7322355,-79.2675781
34_0_34A,8624,34,true,1585506283,94,19,283.44,14484,281.15,285.37,False,2,43.7322457,-79.2659412
34_0_34A,8624,34,true,1585506284,94,19,283.44,14484,281.15,285.37,False,2,43.7322457,-79.2659412
34_0_34A,8624,34,true,1585506314,72,1,283.44,14484,281.15,285.37,False,2,43.732944,-79.2637496
34_0_34A,8624,34,true,1585506313,72,1,283.44,14484,281.15,285.37,False,2,43.732944,-79.2637496
34_0_34A,8624,34,true,1585506344,72,0,283.44,14484,281.15,285.37,False,2,43.7327084,-79.2634584
34_0_34A,8624,34,true,1585506377,72,0,283.44,14484,281.15,285.37,False,2,43.7327749,-79.2633416
34_0_34A,8624,34,true,1585506404,72,1,283.44,14484,281.15,285.37,False,2,43.7324683,-79.2630733
34_0_34A,8624,34,true,1585506434,72,0,283.44,14484,281.15,285.37,False,2,43.7323816,-79.2633283
34_0_34A,8624,34,true,1585506433,72,0,283.44,14484,281.15,285.37,False,2,43.7323816,-79.2633283
34_0_34A,8624,34,true,1585506464,72,0,283.44,14484,281.15,285.37,False,2,43.7323816,-79.2633283
34_0_34A,8624,34,true,1585506494,72,0,283.44,14484,281.15,285.37,False,2,43.7325897,-79.2636947
34_0_34A,8624,34,true,1585506493,72,0,283.44,14484,281.15,285.37,False,2,43.7325897,-79.2636947
34_0_34A,8624,34,true,1585506524,72,0,283.44,14484,281.15,285.37,False,2,43.7325897,-79.2636947
34_0_34A,8624,34,true,1585506554,72,0,283.44,14484,281.15,285.37,False,2,43.7325897,-79.2636947
34_0_34A,8624,34,true,1585506553,72,0,283.44,14484,281.15,285.37,False,2,43.7325897,-79.2636947
34_0_34A,8624,34,true,1585506584,72,0,283.44,14484,281.15,285.37,False,2,43.7325897,-79.2636947
34_0_34A,8624,34,true,1585506583,72,0,283.44,14484,281.15,285.37,False,2,43.7325897,-79.2636947
34_0_34A,8624,34,true,1585506614,72,0,283.44,14484,281.15,285.37,False,2,43.7325897,-79.2636947
34_0_34A,8624,34,true,1585506644,72,0,283.44,14484,281.15,285.37,False,2,43.7325897,-79.2636947
34_0_34A,8624,34,true,1585506674,72,0,283.44,14484,281.15,285.37,False,2,43.7325897,-79.2636947
34_0_34A,8624,34,true,1585506673,72,0,283.44,14484,281.15,285.37,False,2,43.7325897,-79.2636947
34_0_34A,8624,34,true,1585506704,72,0,283.44,14484,281.15,285.37,False,2,43.7325897,-79.2636947
34_0_34A,8624,34,true,1585506733,249,13,283.44,14484,281.15,285.37,False,2,43.7325897,-79.2636947
34_0_34A,8624,34,true,1585506734,249,13,283.44,14484,281.15,285.37,False,2,43.7325897,-79.2636947
34_0_34A,8624,34,true,1585506764,72,0,283.99,14484,281.15,287.04,False,0,43.7322502,-79.2640686
34_0_34A,8624,34,true,1585506763,72,0,283.99,14484,281.15,287.04,False,0,43.7322502,-79.2640686
34_0_34A,8624,34,true,1585506794,72,0,283.99,14484,281.15,287.04,False,0,43.7322502,-79.2640686
34_0_34A,8624,34,true,1585506824,72,0,283.99,14484,281.15,287.04,False,0,43.7323036,-79.2636871
34_0_34A,8624,34,true,1585506854,67,8,283.99,14484,281.15,287.04,False,0,43.7327919,-79.2631454
34_0_34A,8624,34,true,1585506885,242,23,283.99,14484,281.15,287.04,False,0,43.7334709,-79.2637786
34_0_34A,8624,34,true,1585508835,110,13,285.18,14484,281.15,292.59,False,0,43.7042977,-79.3989901
34_0_34A,8624,34,true,1585508865,0,0,285.18,14484,281.15,292.59,False,0,43.7044454,-79.3985364
34_0_34A,8624,34,true,1585508897,278,11,285.06,14484,281.15,289.82,False,0,43.7054199,-79.39897
34_0_34A,8624,34,true,1585508896,278,11,285.06,14484,281.15,289.82,False,0,43.7054199,-79.39897
34_0_34A,8624,34,true,1585508925,158,3,285.06,14484,281.15,289.82,False,0,43.7051583,-79.3993883
34_0_34A,8624,34,true,1585508955,216,0,285.06,14484,281.15,289.82,False,0,43.7051299,-79.3993733
34_0_34A,8624,34,true,1585508954,216,0,285.06,14484,281.15,289.82,False,0,43.7051299,-79.3993733
34_0_34A,8624,34,true,1585508984,216,0,285.06,14484,281.15,289.82,False,0,43.7051299,-79.3993733
34_0_34A,8624,34,true,1585508985,216,0,285.06,14484,281.15,289.82,False,0,43.7051299,-79.3993733
34_0_34A,8624,34,true,1585509015,216,0,285.06,14484,281.15,289.82,False,0,43.7051299,-79.3993733
34_0_34A,8624,34,true,1585509044,216,0,285.06,14484,281.15,289.82,False,0,43.7051299,-79.3993733
34_0_34A,8624,34,true,1585509045,216,0,285.06,14484,281.15,289.82,False,0,43.7051299,-79.3993733
34_0_34A,8624,34,true,1585509074,216,0,285.06,14484,281.15,289.82,False,0,43.7051299,-79.3993733
34_0_34A,8624,34,true,1585509075,216,0,285.06,14484,281.15,289.82,False,0,43.7051299,-79.3993733
34_0_34A,8624,34,true,1585509105,216,0,285.06,14484,281.15,289.82,False,0,43.7051299,-79.3993733
34_0_34A,8624,34,true,1585509104,216,0,285.06,14484,281.15,289.82,False,0,43.7051299,-79.3993733
34_0_34A,8624,34,true,1585509135,216,0,285.06,14484,281.15,289.82,False,0,43.7051299,-79.3993733
34_0_34A,8624,34,true,1585509134,216,0,285.06,14484,281.15,289.82,False,0,43.7051299,-79.3993733
34_0_34A,8624,34,true,1585509164,216,0,285.64,14484,281.15,292.59,False,0,43.7051299,-79.3993733
34_0_34A,8624,34,true,1585509165,216,0,285.64,14484,281.15,292.59,False,0,43.7051299,-79.3993733
34_0_34A,8624,34,true,1585509194,216,0,285.64,14484,281.15,292.59,False,0,43.7051299,-79.3993733
34_0_34A,8624,34,true,1585509195,216,0,285.64,14484,281.15,292.59,False,0,43.7051299,-79.3993733
34_0_34A,8624,34,true,1585509225,216,0,285.64,14484,281.15,292.59,False,0,43.7051299,-79.3993733
34_0_34A,8624,34,true,1585509224,216,0,285.64,14484,281.15,292.59,False,0,43.7051299,-79.3993733
34_0_34A,8624,34,true,1585509254,163,5,285.64,14484,281.15,292.59,False,0,43.7050433,-79.3993466
34_0_34A,8624,34,true,1585509255,163,5,285.64,14484,281.15,292.59,False,0,43.7050433,-79.3993466
34_0_34A,8624,34,true,1585509285,216,0,285.64,14484,281.15,292.59,False,0,43.704875,-79.3992983
34_0_34A,8624,34,true,1585509284,216,0,285.64,14484,281.15,292.59,False,0,43.704875,-79.3992983
34_0_34A,8624,34,true,1585509315,216,0,285.64,14484,281.15,292.59,False,0,43.704875,-79.3992983
34_0_34A,8624,34,true,1585509314,216,0,285.64,14484,281.15,292.59,False,0,43.704875,-79.3992983
34_0_34A,8624,34,true,1585509345,216,0,285.64,14484,281.15,292.59,False,0,43.704875,-79.3992983
34_0_34A,8624,34,true,1585509344,216,0,285.64,14484,281.15,292.59,False,0,43.704875,-79.3992983
34_0_34A,8624,34,true,1585509375,216,0,285.64,14484,281.15,292.59,False,0,43.704875,-79.3992983
34_0_34A,8624,34,true,1585509374,216,0,285.64,14484,281.15,292.59,False,0,43.704875,-79.3992983
34_0_34A,8624,34,true,1585509405,216,0,285.64,14484,281.15,292.59,False,0,43.704875,-79.3992983
34_0_34A,8624,34,true,1585509404,216,0,285.64,14484,281.15,292.59,False,0,43.704875,-79.3992983
34_0_34A,8624,34,true,1585509434,216,0,285.64,14484,281.15,292.59,False,0,43.704875,-79.3992983
34_0_34A,8624,34,true,1585509435,216,0,285.64,14484,281.15,292.59,False,0,43.704875,-79.3992983
34_0_34A,8624,34,true,1585509464,216,0,285.64,14484,281.15,292.59,False,0,43.704875,-79.3992983
34_0_34A,8624,34,true,1585509465,216,0,285.64,14484,281.15,292.59,False,0,43.704875,-79.3992983
34_0_34A,8624,34,true,1585509495,216,0,285.64,14484,281.15,292.59,False,0,43.704875,-79.3992983
34_0_34A,8624,34,true,1585509494,216,0,285.64,14484,281.15,292.59,False,0,43.704875,-79.3992983
34_0_34A,8624,34,true,1585509525,216,0,285.64,14484,281.15,292.59,False,0,43.704875,-79.3992983
34_0_34A,8624,34,true,1585509524,216,0,285.64,14484,281.15,292.59,False,0,43.704875,-79.3992983
34_0_34A,8624,34,true,1585509555,216,0,285.64,14484,281.15,292.59,False,0,43.704875,-79.3992983
34_0_34A,8624,34,true,1585509554,216,0,285.64,14484,281.15,292.59,False,0,43.704875,-79.3992983
34_0_34A,8624,34,true,1585509584,216,0,285.64,14484,281.15,292.59,False,0,43.704875,-79.3992983
34_0_34A,8624,34,true,1585509585,216,0,285.64,14484,281.15,292.59,False,0,43.704875,-79.3992983
34_0_34A,8624,34,true,1585509615,216,0,285.64,14484,281.15,292.59,False,0,43.704875,-79.3992983
34_0_34A,8624,34,true,1585509614,216,0,285.64,14484,281.15,292.59,False,0,43.704875,-79.3992983
34_0_34A,8624,34,true,1585509645,172,2,285.64,14484,281.15,292.59,False,0,43.704855,-79.39931
34_0_34A,8624,34,true,1585509644,172,2,285.64,14484,281.15,292.59,False,0,43.704855,-79.39931
34_0_34A,8624,34,true,1585509675,89,10,285.64,14484,281.15,292.59,False,0,43.7046566,-79.3989666
34_0_34A,8624,34,true,1585509674,89,10,285.64,14484,281.15,292.59,False,0,43.7046566,-79.3989666
34_0_34A,8624,34,true,1585509705,216,0,285.4,14484,281.15,288.15,False,0,43.7053375,-79.3988342
34_0_34A,8624,34,true,1585509704,216,0,285.4,14484,281.15,288.15,False,0,43.7053375,-79.3988342
34_0_34A,8624,34,true,1585509735,216,0,285.4,14484,281.15,288.15,False,0,43.7052574,-79.3986129
34_0_34A,8624,34,true,1585509764,216,0,285.4,14484,281.15,288.15,False,0,43.7052574,-79.3986129
34_0_34A,8624,34,true,1585509765,216,0,285.4,14484,281.15,288.15,False,0,43.7052574,-79.3986129
34_0_34A,8624,34,true,1585509794,216,0,285.4,14484,281.15,288.15,False,0,43.7052574,-79.3986129
34_0_34A,8624,34,true,1585509795,216,0,285.4,14484,281.15,288.15,False,0,43.7052574,-79.3986129
34_0_34A,8624,34,true,1585509825,216,0,285.4,14484,281.15,288.15,False,0,43.7052574,-79.3986129
34_0_34A,8624,34,true,1585509858,216,0,285.4,14484,281.15,288.15,False,0,43.7052574,-79.3986129
34_0_34A,8624,34,true,1585509884,326,9,285.72,14484,281.15,288.15,False,0,43.7052648,-79.3986333
34_0_34A,8624,34,true,1585509885,326,9,285.72,14484,281.15,288.15,False,0,43.7052648,-79.3986333
34_0_34A,8624,34,true,1585509945,68,24,285.72,14484,281.15,288.15,False,0,43.7065219,-79.3993786
34_0_34A,8624,34,true,1585509974,76,0,285.72,14484,281.15,288.15,False,0,43.7066532,-79.398719
34_0_34A,8624,34,true,1585509975,76,0,285.72,14484,281.15,288.15,False,0,43.7066532,-79.398719
34_0_34A,8624,34,true,1585510004,74,19,285.72,14484,281.15,288.15,False,0,43.7071271,-79.3962279
34_0_34A,8624,34,true,1585510005,74,19,285.72,14484,281.15,288.15,False,0,43.7071271,-79.3962279
34_0_34A,8624,34,true,1585510034,74,18,285.72,14484,281.15,288.15,False,0,43.7072777,-79.3954479
34_0_34A,8624,34,true,1585510035,74,18,285.72,14484,281.15,288.15,False,0,43.7072777,-79.3954479
34_0_34A,8624,34,true,1585510064,74,0,286.2,16093,283.71,288.15,False,0,43.707756,-79.3929367
34_0_34A,8624,34,true,1585510065,74,0,286.2,16093,283.71,288.15,False,0,43.707756,-79.3929367
34_0_34A,8624,34,true,1585510095,74,0,286.2,16093,283.71,288.15,False,0,43.707756,-79.3929367
34_0_34A,8624,34,true,1585510094,74,0,286.2,16093,283.71,288.15,False,0,43.707756,-79.3929367
34_0_34A,8624,34,true,1585510125,74,0,286.2,16093,283.71,288.15,False,0,43.707756,-79.3929367
34_0_34A,8624,34,true,1585510124,74,0,286.2,16093,283.71,288.15,False,0,43.707756,-79.3929367
34_0_34A,8624,34,true,1585510155,74,19,286.2,16093,283.71,288.15,False,0,43.708022,-79.3920038
34_0_34A,8624,34,true,1585510154,74,19,286.2,16093,283.71,288.15,False,0,43.708022,-79.3920038
34_0_34A,8624,34,true,1585510185,74,0,286.2,16093,283.71,288.15,False,0,43.7083292,-79.3905283
34_0_34A,8624,34,true,1585510184,74,0,286.2,16093,283.71,288.15,False,0,43.7083292,-79.3905283
34_0_34A,8624,34,true,1585510215,74,0,286.2,16093,283.71,288.15,False,0,43.7083292,-79.3905283
34_0_34A,8624,34,true,1585510245,71,21,286.2,16093,283.71,288.15,False,0,43.7086365,-79.3889232
34_0_34A,8624,34,true,1585510275,74,30,286.2,16093,283.71,288.15,False,0,43.7090134,-79.3869341
34_0_34A,8624,34,true,1585510304,70,22,286.2,16093,283.71,288.15,False,0,43.7092052,-79.3860355
34_0_34A,8624,34,true,1585510305,70,22,286.2,16093,283.71,288.15,False,0,43.7092052,-79.3860355
34_0_34A,8624,34,true,1585510335,74,19,286.19,12874,283.71,288.15,False,0,43.7098388,-79.3829498
34_0_34A,8624,34,true,1585510365,73,29,286.49,14484,283.15,291.15,False,0,43.7104886,-79.37957
34_0_34A,8624,34,true,1585510395,75,1,286.49,14484,283.15,291.15,False,0,43.7108854,-79.3778001
34_0_34A,8624,34,true,1585510425,74,36,286.68,14484,283.15,292.59,False,0,43.7115121,-79.3747468
34_0_34A,8624,34,true,1585510455,75,40,286.68,14484,283.15,292.59,False,0,43.7121234,-79.3714188
34_0_34A,8624,34,true,1585510485,73,34,286.68,14484,283.15,292.59,False,0,43.7130432,-79.3671312
34_0_34A,8624,34,true,1585510515,74,0,286.68,14484,283.15,292.59,False,0,43.7133333,-79.3656043
34_0_34A,8624,34,true,1585510545,75,0,286.5,14484,283.15,291.15,False,0,43.7135384,-79.364817
34_0_34A,8624,34,true,1585510575,75,0,286.5,14484,283.15,291.15,False,0,43.7135384,-79.364817
34_0_34A,8624,34,true,1585510605,74,35,286.5,14484,283.15,291.15,False,0,43.7139765,-79.3623614
34_0_34A,8624,34,true,1585510636,67,0,286.5,14484,283.15,291.15,False,0,43.7145656,-79.3597228
34_0_34A,8624,34,true,1585510635,67,0,286.5,14484,283.15,291.15,False,0,43.7145656,-79.3597228
34_0_34A,8624,34,true,1585510665,67,0,286.5,14484,283.15,291.15,False,0,43.7145656,-79.3597228
34_0_34A,8624,34,true,1585510666,67,0,286.5,14484,283.15,291.15,False,0,43.7145656,-79.3597228
34_0_34A,8624,34,true,1585510695,67,22,286.5,14484,283.15,291.15,False,0,43.7145656,-79.3597228
34_0_34A,8624,34,true,1585510696,67,22,286.5,14484,283.15,291.15,False,0,43.7145656,-79.3597228
34_0_34A,8624,34,true,1585510725,96,40,286.89,14484,283.15,292.59,False,0,43.7154884,-79.3555933
34_0_34A,8624,34,true,1585510755,65,47,286.61,14484,283.15,292.59,False,0,43.7169431,-79.3503686
34_0_34A,8624,34,true,1585510785,70,39,286.04,14484,282.59,287.59,False,0,43.7184692,-79.3453063
34_0_34A,8624,34,true,1585510815,67,49,286.04,14484,282.59,287.59,False,0,43.719813,-79.3409957
34_0_34A,8624,34,true,1585510845,66,28,286.04,14484,282.59,287.59,False,0,43.7206573,-79.3383255
34_0_34A,8624,34,true,1585510846,66,28,286.04,14484,282.59,287.59,False,0,43.7206573,-79.3383255
34_0_34A,8624,34,true,1585510875,62,37,286.04,14484,282.59,287.59,False,0,43.7216384,-79.3351351
34_0_34A,8624,34,true,1585510905,66,43,286.28,14484,282.59,291.15,False,0,43.7229435,-79.3308119
34_0_34A,8624,34,true,1585510906,66,43,286.28,14484,282.59,291.15,False,0,43.7229435,-79.3308119
34_0_34A,8624,34,true,1585510935,70,42,286.28,14484,282.59,291.15,False,0,43.7241575,-79.3261489
34_0_34A,8624,34,true,1585510936,70,42,286.28,14484,282.59,291.15,False,0,43.7241575,-79.3261489
34_0_34A,8624,34,true,1585510965,70,41,286.27,14484,282.59,291.15,False,0,43.7251652,-79.3224004
34_0_34A,8624,34,true,1585510996,85,41,286.27,14484,282.59,291.15,False,0,43.7262491,-79.3169062
34_0_34A,8624,34,true,1585510995,85,41,286.27,14484,282.59,291.15,False,0,43.7262491,-79.3169062
34_0_34A,8624,34,true,1585511026,103,4,286.31,14484,282.59,291.15,False,0,43.726072,-79.3141204
34_0_34A,8624,34,true,1585511025,103,4,286.31,14484,282.59,291.15,False,0,43.726072,-79.3141204
34_0_34A,8624,34,true,1585511055,140,0,286.31,14484,282.59,291.15,False,0,43.726038,-79.3140573
34_0_34A,8624,34,true,1585511056,140,0,286.31,14484,282.59,291.15,False,0,43.726038,-79.3140573
34_0_34A,8624,34,true,1585511085,102,21,286.31,14484,282.59,291.15,False,0,43.7259256,-79.3136601
34_0_34A,8624,34,true,1585511115,102,42,286.31,14484,282.59,291.15,False,0,43.7254829,-79.3099136
34_0_34A,8624,34,true,1585511116,102,42,286.31,14484,282.59,291.15,False,0,43.7254829,-79.3099136
34_0_34A,8624,34,true,1585511145,101,45,286.29,14484,282.59,291.15,False,0,43.7247713,-79.3050618
34_0_34A,8624,34,true,1585511146,101,45,286.29,14484,282.59,291.15,False,0,43.7247713,-79.3050618
34_0_34A,8624,34,true,1585511175,90,0,286.4,14484,282.59,291.15,False,0,43.724694,-79.3027811
34_0_34A,8624,34,true,1585511176,90,0,286.4,14484,282.59,291.15,False,0,43.724694,-79.3027811
34_0_34A,8624,34,true,1585511205,90,0,286.4,14484,282.59,291.15,False,0,43.724694,-79.3027811
34_0_34A,8624,34,true,1585511206,90,0,286.4,14484,282.59,291.15,False,0,43.724694,-79.3027811
34_0_34A,8624,34,true,1585511236,65,0,286.4,14484,282.59,291.15,False,0,43.7247165,-79.3018213
34_0_34A,8624,34,true,1585511235,65,0,286.4,14484,282.59,291.15,False,0,43.7247165,-79.3018213
34_0_34A,8624,34,true,1585511266,81,20,286.4,14484,282.59,291.15,False,0,43.7248254,-79.3012806
34_0_34A,8624,34,true,1585511265,81,20,286.4,14484,282.59,291.15,False,0,43.7248254,-79.3012806
34_0_34A,8624,34,true,1585511295,76,0,286.39,14484,282.59,291.15,False,0,43.7255354,-79.2979492
34_0_34A,8624,34,true,1585511296,76,0,286.39,14484,282.59,291.15,False,0,43.7255354,-79.2979492
34_0_34A,8624,34,true,1585511325,76,0,286.39,14484,282.59,291.15,False,0,43.7255354,-79.2979492
34_0_34A,8624,34,true,1585511355,76,0,286.39,14484,282.59,291.15,False,0,43.7255354,-79.2979492
34_0_34A,8624,34,true,1585511356,76,0,286.39,14484,282.59,291.15,False,0,43.7255354,-79.2979492
34_0_34A,8624,34,true,1585511386,73,39,286.43,14484,282.59,291.15,False,0,43.7264113,-79.2939354
34_0_34A,8624,34,true,1585511385,73,39,286.43,14484,282.59,291.15,False,0,43.7264113,-79.2939354
34_0_34A,8624,34,true,1585511416,73,0,286.43,14484,282.59,291.15,False,0,43.72686,-79.2916908
34_0_34A,8624,34,true,1585511415,73,0,286.43,14484,282.59,291.15,False,0,43.72686,-79.2916908
34_0_34A,8624,34,true,1585511445,73,0,286.43,14484,282.59,291.15,False,0,43.72686,-79.2916908
34_0_34A,8624,34,true,1585511446,73,0,286.43,14484,282.59,291.15,False,0,43.72686,-79.2916908
34_0_34A,8624,34,true,1585511476,73,0,286.43,14484,282.59,291.15,False,0,43.72686,-79.2916908
34_0_34A,8624,34,true,1585511475,73,0,286.43,14484,282.59,291.15,False,0,43.72686,-79.2916908
34_0_34A,8624,34,true,1585511505,73,28,286.43,14484,282.59,291.15,False,0,43.7272993,-79.2900058
34_0_34A,8624,34,true,1585511535,73,0,286.43,14484,282.59,291.15,False,0,43.7275876,-79.2881683
34_0_34A,8624,34,true,1585511536,73,0,286.43,14484,282.59,291.15,False,0,43.7275876,-79.2881683
34_0_34A,8624,34,true,1585511565,73,0,286.43,14484,282.59,291.15,False,0,43.7275876,-79.2881683
34_0_34A,8624,34,true,1585511566,73,0,286.43,14484,282.59,291.15,False,0,43.7275876,-79.2881683
34_0_34A,8624,34,true,1585511595,73,0,286.43,14484,282.59,291.15,False,0,43.7275876,-79.2881683
34_0_34A,8624,34,true,1585511625,73,0,286.43,14484,282.59,291.15,False,0,43.7277904,-79.2876386
34_0_34A,8624,34,true,1585511626,73,0,286.43,14484,282.59,291.15,False,0,43.7277904,-79.2876386
34_0_34A,8624,34,true,1585511655,73,2,286.43,14484,282.59,291.15,False,0,43.727797,-79.2876214
34_0_34A,8624,34,true,1585511656,73,2,286.43,14484,282.59,291.15,False,0,43.727797,-79.2876214
34_0_34A,8624,34,true,1585511685,72,27,286.9,14484,282.59,292.04,False,0,43.7283723,-79.284932
34_0_34A,8624,34,true,1585511686,72,27,286.9,14484,282.59,292.04,False,0,43.7283723,-79.284932
34_0_34A,8624,34,true,1585511715,76,25,286.9,14484,282.59,292.04,False,0,43.7291367,-79.2817615
34_0_34A,8624,34,true,1585511716,76,25,286.9,14484,282.59,292.04,False,0,43.7291367,-79.2817615
34_0_34A,8624,34,true,1585511746,73,13,286.9,14484,282.59,292.04,False,0,43.7292691,-79.28069
34_0_34A,8624,34,true,1585511745,73,13,286.9,14484,282.59,292.04,False,0,43.7292691,-79.28069
34_0_34A,8624,34,true,1585511775,76,10,286.9,14484,282.59,292.04,False,0,43.729763,-79.2781372
34_0_34A,8624,34,true,1585511776,76,10,286.9,14484,282.59,292.04,False,0,43.729763,-79.2781372
34_0_34A,8624,34,true,1585511805,73,25,287.2,14484,282.59,292.04,False,0,43.7302529,-79.276461
34_0_34A,8624,34,true,1585511806,73,25,287.2,14484,282.59,292.04,False,0,43.7302529,-79.276461
34_0_34A,8624,34,true,1585511835,73,24,287.22,14484,282.59,292.04,False,0,43.730777,-79.2737984
34_0_34A,8624,34,true,1585511836,73,24,287.22,14484,282.59,292.04,False,0,43.730777,-79.2737984
34_0_34A,8624,34,true,1585511866,71,16,287.22,14484,282.59,292.04,False,0,43.7312589,-79.2719268
34_0_34A,8624,34,true,1585511865,71,16,287.22,14484,282.59,292.04,False,0,43.7312589,-79.2719268
34_0_34A,8624,34,true,1585511895,73,0,287.22,14484,282.59,292.04,False,0,43.7312736,-79.2712783
34_0_34A,8624,34,true,1585511896,73,0,287.22,14484,282.59,292.04,False,0,43.7312736,-79.2712783
34_0_34A,8624,34,true,1585511926,71,26,287.22,14484,282.59,292.04,False,0,43.7316361,-79.2702985
34_0_34A,8624,34,true,1585511925,71,26,287.22,14484,282.59,292.04,False,0,43.7316361,-79.2702985
34_0_34A,8624,34,true,1585511956,71,21,287.22,14484,282.59,292.04,False,0,43.732211,-79.267723
34_0_34A,8624,34,true,1585511955,71,21,287.22,14484,282.59,292.04,False,0,43.732211,-79.267723
34_0_34A,8624,34,true,1585511985,125,16,287.22,14484,282.59,292.04,False,0,43.7322371,-79.2660781
34_0_34A,8624,34,true,1585511986,125,16,287.22,14484,282.59,292.04,False,0,43.7322371,-79.2660781
34_0_34A,8624,34,true,1585512016,62,10,287.23,14484,282.59,292.04,False,0,43.7327708,-79.2645165
34_0_34A,8624,34,true,1585512015,62,10,287.23,14484,282.59,292.04,False,0,43.7327708,-79.2645165
34_0_34A,8624,34,true,1585512045,61,8,287.23,14484,282.59,292.04,False,0,43.7329051,-79.2639216
34_0_34A,8624,34,true,1585512046,61,8,287.23,14484,282.59,292.04,False,0,43.7329051,-79.2639216
34_0_34A,8624,34,true,1585512076,60,5,287.23,14484,282.59,292.04,False,0,43.7330072,-79.2634657
34_0_34A,8624,34,true,1585512106,72,0,287.23,14484,282.59,292.04,False,0,43.733039,-79.2633292
34_0_34A,8624,34,true,1585512137,72,0,287.23,14484,282.59,292.04,False,0,43.733039,-79.2633292
34_0_34A,8624,34,true,1585512166,72,0,287.23,14484,282.59,292.04,False,0,43.733039,-79.2633292
34_0_34A,8624,34,true,1585512165,72,0,287.23,14484,282.59,292.04,False,0,43.733039,-79.2633292
34_0_34A,8624,34,true,1585512196,72,0,287.62,14484,282.59,293.71,False,0,43.733039,-79.2633292
34_0_34A,8624,34,true,1585512195,72,0,287.62,14484,282.59,293.71,False,0,43.733039,-79.2633292
34_0_34A,8624,34,true,1585512225,72,0,287.62,14484,282.59,293.71,False,0,43.733039,-79.2633292
34_0_34A,8624,34,true,1585512257,72,0,287.62,14484,282.59,293.71,False,0,43.733039,-79.2633292
34_0_34A,8624,34,true,1585512285,72,0,287.62,14484,282.59,293.71,False,0,43.733039,-79.2633292
34_0_34A,8624,34,true,1585512316,72,0,287.62,14484,282.59,293.71,False,0,43.733039,-79.2633292
34_0_34A,8624,34,true,1585512345,72,0,287.62,14484,282.59,293.71,False,0,43.733039,-79.2633292
34_0_34A,8624,34,true,1585512376,72,0,287.62,14484,282.59,293.71,False,0,43.733039,-79.2633292
34_0_34A,8624,34,true,1585512375,72,0,287.62,14484,282.59,293.71,False,0,43.733039,-79.2633292
34_0_34A,8624,34,true,1585512405,72,0,287.62,14484,282.59,293.71,False,0,43.733039,-79.2633292
34_0_34A,8624,34,true,1585512406,72,0,287.62,14484,282.59,293.71,False,0,43.733039,-79.2633292
34_0_34A,8624,34,true,1585512435,72,0,287.62,14484,282.59,293.71,False,0,43.733039,-79.2633292
34_0_34A,8624,34,true,1585512465,72,0,287.62,14484,282.59,293.71,False,0,43.733039,-79.2633292
34_0_34A,8624,34,true,1585512466,72,0,287.62,14484,282.59,293.71,False,0,43.733039,-79.2633292
34_0_34A,8624,34,true,1585512496,72,0,287.62,14484,282.59,293.71,False,0,43.733039,-79.2633292
34_0_34A,8624,34,true,1585512525,72,0,287.62,14484,282.59,293.71,False,0,43.733039,-79.2633292
34_0_34A,8624,34,true,1585512526,72,0,287.62,14484,282.59,293.71,False,0,43.733039,-79.2633292
34_0_34A,8624,34,true,1585512555,72,0,287.62,14484,282.59,293.71,False,0,43.733039,-79.2633292
34_0_34A,8624,34,true,1585512585,72,0,287.62,14484,282.59,293.71,False,0,43.733039,-79.2633292
34_0_34A,8624,34,true,1585512616,72,0,287.62,14484,282.59,293.71,False,0,43.733039,-79.2633292
34_0_34A,8624,34,true,1585512615,72,0,287.62,14484,282.59,293.71,False,0,43.733039,-79.2633292
34_0_34A,8624,34,true,1585512645,72,0,287.62,14484,282.59,293.71,False,0,43.733039,-79.2633292
34_0_34A,8624,34,true,1585512676,72,0,287.62,14484,282.59,293.71,False,0,43.733039,-79.2633292
34_0_34A,8624,34,true,1585512706,70,9,287.62,14484,282.59,293.71,False,0,43.7330166,-79.2631829
34_0_34A,8624,34,true,1585515286,353,2,289.55,14484,286.15,293.15,False,0,43.704488,-79.3985438
34_0_34A,8624,34,true,1585515287,353,2,289.55,14484,286.15,293.15,False,0,43.704488,-79.3985438
34_0_34A,8624,34,true,1585515316,0,0,289.55,14484,286.15,293.15,False,0,43.704488,-79.3985438
34_0_34A,8624,34,true,1585515346,322,8,289.31,14484,286.15,292.04,False,0,43.7050459,-79.3986053
34_0_34A,8624,34,true,1585515347,322,8,289.31,14484,286.15,292.04,False,0,43.7050459,-79.3986053
34_0_34A,8624,34,true,1585515376,151,4,289.31,14484,286.15,292.04,False,0,43.7052816,-79.3993366
34_0_34A,8624,34,true,1585515406,216,0,289.31,14484,286.15,292.04,False,0,43.705185,-79.399275
34_0_34A,8624,34,true,1585515407,216,0,289.31,14484,286.15,292.04,False,0,43.705185,-79.399275
34_0_34A,8624,34,true,1585515436,216,0,289.31,14484,286.15,292.04,False,0,43.705185,-79.399275
34_0_34A,8624,34,true,1585515437,216,0,289.31,14484,286.15,292.04,False,0,43.705185,-79.399275
34_0_34A,8624,34,true,1585515467,216,0,289.31,14484,286.15,292.04,False,0,43.705185,-79.399275
34_0_34A,8624,34,true,1585515496,216,0,289.31,14484,286.15,292.04,False,0,43.705185,-79.399275
34_0_34A,8624,34,true,1585515497,216,0,289.31,14484,286.15,292.04,False,0,43.705185,-79.399275
34_0_34A,8624,34,true,1585515527,216,0,289.31,14484,286.15,292.04,False,0,43.705185,-79.399275
34_0_34A,8624,34,true,1585515526,216,0,289.31,14484,286.15,292.04,False,0,43.705185,-79.399275
34_0_34A,8624,34,true,1585515557,216,0,289.31,14484,286.15,292.04,False,0,43.705185,-79.399275
34_0_34A,8624,34,true,1585515556,216,0,289.31,14484,286.15,292.04,False,0,43.705185,-79.399275
34_0_34A,8624,34,true,1585515586,216,0,289.59,14484,287.04,291.48,False,0,43.705185,-79.399275
34_0_34A,8624,34,true,1585515587,216,0,289.59,14484,287.04,291.48,False,0,43.705185,-79.399275
34_0_34A,8624,34,true,1585515617,216,0,289.59,14484,287.04,291.48,False,0,43.705185,-79.399275
34_0_34A,8624,34,true,1585515647,216,0,289.59,14484,287.04,291.48,False,0,43.705185,-79.399275
34_0_34A,8624,34,true,1585515646,216,0,289.59,14484,287.04,291.48,False,0,43.705185,-79.399275
34_0_34A,8624,34,true,1585515676,216,0,289.59,14484,287.04,291.48,False,0,43.705185,-79.399275
34_0_34A,8624,34,true,1585515677,216,0,289.59,14484,287.04,291.48,False,0,43.705185,-79.399275
34_0_34A,8624,34,true,1585515707,216,0,289.59,14484,287.04,291.48,False,0,43.705185,-79.399275
34_0_34A,8624,34,true,1585515706,216,0,289.59,14484,287.04,291.48,False,0,43.705185,-79.399275
34_0_34A,8624,34,true,1585515736,216,0,289.59,14484,287.04,291.48,False,0,43.705185,-79.399275
34_0_34A,8624,34,true,1585515737,216,0,289.59,14484,287.04,291.48,False,0,43.705185,-79.399275
34_0_34A,8624,34,true,1585515767,216,0,289.59,14484,287.04,291.48,False,0,43.705185,-79.399275
34_0_34A,8624,34,true,1585515797,216,0,289.59,14484,287.04,291.48,False,0,43.705185,-79.399275
34_0_34A,8624,34,true,1585515796,216,0,289.59,14484,287.04,291.48,False,0,43.705185,-79.399275
34_0_34A,8624,34,true,1585515827,216,0,289.59,14484,287.04,291.48,False,0,43.705185,-79.399275
34_0_34A,8624,34,true,1585515826,216,0,289.59,14484,287.04,291.48,False,0,43.705185,-79.399275
34_0_34A,8624,34,true,1585515857,216,0,289.59,14484,287.04,291.48,False,0,43.705185,-79.399275
34_0_34A,8624,34,true,1585515887,216,0,289.59,14484,287.04,291.48,False,0,43.705185,-79.399275
34_0_34A,8624,34,true,1585515917,216,0,289.59,14484,287.04,291.48,False,0,43.705185,-79.399275
34_0_34A,8624,34,true,1585515946,216,0,289.59,14484,287.04,291.48,False,0,43.705185,-79.399275
34_0_34A,8624,34,true,1585515947,216,0,289.59,14484,287.04,291.48,False,0,43.705185,-79.399275
34_0_34A,8624,34,true,1585515977,142,8,289.17,14484,286.48,291.15,False,0,43.704825,-79.3992016
34_0_34A,8624,34,true,1585515976,142,8,289.17,14484,286.48,291.15,False,0,43.704825,-79.3992016
34_0_34A,8624,34,true,1585516006,349,2,289.59,14484,287.04,291.48,False,0,43.7052574,-79.3986129
34_0_34A,8624,34,true,1585516007,349,2,289.59,14484,287.04,291.48,False,0,43.7052574,-79.3986129
34_0_34A,8624,34,true,1585516037,349,13,289.59,14484,287.04,291.48,False,0,43.7052574,-79.3986129
34_0_34A,8624,34,true,1585516066,216,0,289.59,14484,287.04,291.48,False,0,43.7052574,-79.3986129
34_0_34A,8624,34,true,1585516067,216,0,289.59,14484,287.04,291.48,False,0,43.7052574,-79.3986129
34_0_34A,8624,34,true,1585516097,306,14,289.59,14484,287.04,291.48,False,0,43.7053054,-79.3987457
34_0_34A,8624,34,true,1585516096,306,14,289.59,14484,287.04,291.48,False,0,43.7053054,-79.3987457
34_0_34A,8624,34,true,1585516126,1,20,289.59,14484,287.04,291.48,False,0,43.7057818,-79.4000791
34_0_34A,8624,34,true,1585516127,1,20,289.59,14484,287.04,291.48,False,0,43.7057818,-79.4000791
34_0_34A,8624,34,true,1585516157,82,16,289.59,14484,287.04,291.48,False,0,43.7063293,-79.3999595
34_0_34A,8624,34,true,1585516156,82,16,289.59,14484,287.04,291.48,False,0,43.7063293,-79.3999595
34_0_34A,8624,34,true,1585516187,76,25,289.11,14484,286.48,291.15,False,0,43.7067805,-79.3980876
34_0_34A,8624,34,true,1585516216,74,28,289.11,14484,286.48,291.15,False,0,43.7072858,-79.3954297
34_0_34A,8624,34,true,1585516217,74,28,289.11,14484,286.48,291.15,False,0,43.7072858,-79.3954297
34_0_34A,8624,34,true,1585516246,74,0,289.14,14484,286.48,291.15,False,0,43.707756,-79.3929367
34_0_34A,8624,34,true,1585516247,74,0,289.14,14484,286.48,291.15,False,0,43.707756,-79.3929367
34_0_34A,8624,34,true,1585516276,74,0,289.14,14484,286.48,291.15,False,0,43.707756,-79.3929367
34_0_34A,8624,34,true,1585516277,74,0,289.14,14484,286.48,291.15,False,0,43.707756,-79.3929367
34_0_34A,8624,34,true,1585516307,74,19,289.14,14484,286.48,291.15,False,0,43.708238,-79.3909634
34_0_34A,8624,34,true,1585516337,74,0,289.14,14484,286.48,291.15,False,0,43.7083132,-79.3906051
34_0_34A,8624,34,true,1585516366,72,24,289.14,14484,286.48,291.15,False,0,43.708632,-79.3889458
34_0_34A,8624,34,true,1585516367,72,24,289.14,14484,286.48,291.15,False,0,43.708632,-79.3889458
34_0_34A,8624,34,true,1585516397,73,30,289.14,14484,286.48,291.15,False,0,43.7091691,-79.3861477
34_0_34A,8624,34,true,1585516396,73,30,289.14,14484,286.48,291.15,False,0,43.7091691,-79.3861477
34_0_34A,8624,34,true,1585516427,74,39,289.1,14484,286.48,291.15,False,0,43.7099998,-79.3821418
34_0_34A,8624,34,true,1585516456,77,28,289.1,14484,286.48,291.15,False,0,43.7107522,-79.3783992
34_0_34A,8624,34,true,1585516457,77,28,289.1,14484,286.48,291.15,False,0,43.7107522,-79.3783992
34_0_34A,8624,34,true,1585516486,75,0,289.1,14484,286.48,291.15,False,0,43.7109102,-79.3776818
34_0_34A,8624,34,true,1585516487,75,0,289.1,14484,286.48,291.15,False,0,43.7109102,-79.3776818
34_0_34A,8624,34,true,1585516517,73,29,289.1,14484,286.48,291.15,False,0,43.7111502,-79.3762192
34_0_34A,8624,34,true,1585516547,74,41,289.1,14484,286.48,291.15,False,0,43.7121271,-79.3714003
34_0_34A,8624,34,true,1585516577,74,16,289.1,14484,286.48,291.15,False,0,43.7125342,-79.3695755
34_0_34A,8624,34,true,1585516576,74,16,289.1,14484,286.48,291.15,False,0,43.7125342,-79.3695755
34_0_34A,8624,34,true,1585516607,74,29,289.1,14484,286.48,291.15,False,0,43.7132706,-79.3659899
34_0_34A,8624,34,true,1585516606,74,29,289.1,14484,286.48,291.15,False,0,43.7132706,-79.3659899
34_0_34A,8624,34,true,1585516637,75,0,289.09,14484,286.48,291.15,False,0,43.7135475,-79.3647775
34_0_34A,8624,34,true,1585516636,75,0,289.09,14484,286.48,291.15,False,0,43.7135475,-79.3647775
34_0_34A,8624,34,true,1585516666,75,0,289.09,14484,286.48,291.15,False,0,43.7135475,-79.3647775
34_0_34A,8624,34,true,1585516667,75,0,289.09,14484,286.48,291.15,False,0,43.7135475,-79.3647775
34_0_34A,8624,34,true,1585516697,78,26,289.09,14484,286.48,291.15,False,0,43.7139652,-79.3623868
34_0_34A,8624,34,true,1585516696,78,26,289.09,14484,286.48,291.15,False,0,43.7139652,-79.3623868
34_0_34A,8624,34,true,1585516727,73,32,289.09,14484,286.48,291.15,False,0,43.7141867,-79.3615428
34_0_34A,8624,34,true,1585516757,74,0,289.52,14484,286.48,291.15,False,0,43.7144584,-79.3599014
34_0_34A,8624,34,true,1585516756,74,0,289.52,14484,286.48,291.15,False,0,43.7144584,-79.3599014
34_0_34A,8624,34,true,1585516786,68,35,289.52,14484,286.48,291.15,False,0,43.7148503,-79.3587085
34_0_34A,8624,34,true,1585516787,68,35,289.52,14484,286.48,291.15,False,0,43.7148503,-79.3587085
34_0_34A,8624,34,true,1585516817,77,42,289.52,14484,286.48,291.15,False,0,43.7157405,-79.3544124
34_0_34A,8624,34,true,1585516846,69,23,289.52,14484,286.48,291.15,False,0,43.7169418,-79.3503723
34_0_34A,8624,34,true,1585516847,69,23,289.52,14484,286.48,291.15,False,0,43.7169418,-79.3503723
34_0_34A,8624,34,true,1585516877,66,0,289.52,14484,286.48,291.15,False,0,43.7169867,-79.3501688
34_0_34A,8624,34,true,1585516907,62,39,289.52,14484,286.48,291.15,False,0,43.7175385,-79.3484004
34_0_34A,8624,34,true,1585516937,64,33,289.1,14484,286.48,291.15,False,0,43.7188283,-79.3441821
34_0_34A,8624,34,true,1585516967,67,36,289.58,14484,287.59,291.15,False,0,43.7203026,-79.3395087
34_0_34A,8624,34,true,1585516966,67,36,289.58,14484,287.59,291.15,False,0,43.7203026,-79.3395087
34_0_34A,8624,34,true,1585516997,67,25,289.58,14484,287.59,291.15,False,0,43.7206573,-79.3383255
34_0_34A,8624,34,true,1585516996,67,25,289.58,14484,287.59,291.15,False,0,43.7206573,-79.3383255
34_0_34A,8624,34,true,1585517027,65,0,289.58,14484,287.59,291.15,False,0,43.7207232,-79.3374298
34_0_34A,8624,34,true,1585517057,65,44,289.52,14484,286.48,291.15,False,0,43.7217556,-79.3347514
34_0_34A,8624,34,true,1585517056,65,44,289.52,14484,286.48,291.15,False,0,43.7217556,-79.3347514
34_0_34A,8624,34,true,1585517087,66,28,289.52,14484,286.48,291.15,False,0,43.7224459,-79.3322355
34_0_34A,8624,34,true,1585517116,71,44,289.52,14484,286.48,291.15,False,0,43.7238648,-79.3273124
34_0_34A,8624,34,true,1585517117,71,44,289.52,14484,286.48,291.15,False,0,43.7238648,-79.3273124
34_0_34A,8624,34,true,1585517147,69,12,289.55,14484,287.59,291.15,False,0,43.7245552,-79.3246709
34_0_34A,8624,34,true,1585517177,69,41,289.55,14484,287.59,291.15,False,0,43.7249183,-79.3233101
34_0_34A,8624,34,true,1585517207,76,9,289.52,14484,286.48,291.15,False,0,43.7259891,-79.3190672
34_0_34A,8624,34,true,1585517206,76,9,289.52,14484,286.48,291.15,False,0,43.7259891,-79.3190672
34_0_34A,8624,34,true,1585517237,85,37,289.52,14484,286.48,291.15,False,0,43.7262433,-79.317096
34_0_34A,8624,34,true,1585517267,107,11,289.42,14484,287.59,290.93,False,0,43.7261333,-79.3142852
34_0_34A,8624,34,true,1585517297,96,0,289.42,14484,287.59,290.93,False,0,43.7260962,-79.3141655
34_0_34A,8624,34,true,1585517327,96,0,289.42,14484,287.59,290.93,False,0,43.7260962,-79.3141655
34_0_34A,8624,34,true,1585517357,140,0,289.42,14484,287.59,290.93,False,0,43.7260218,-79.3140272
34_0_34A,8624,34,true,1585517387,100,37,289.42,14484,287.59,290.93,False,0,43.7258209,-79.3122325
34_0_34A,8624,34,true,1585517417,100,44,289.38,14484,287.59,290.93,False,0,43.7249398,-79.3067996
34_0_34A,8624,34,true,1585517447,90,0,289.59,14484,287.59,291.15,False,0,43.7246832,-79.3029804
34_0_34A,8624,34,true,1585517477,90,0,289.59,14484,287.59,291.15,False,0,43.7246832,-79.3029804
34_0_34A,8624,34,true,1585517507,65,0,289.59,14484,287.59,291.15,False,0,43.7246523,-79.3019428
34_0_34A,8624,34,true,1585517537,65,0,289.18,14484,286.48,290.37,False,0,43.7247672,-79.3017171
34_0_34A,8624,34,true,1585517567,65,0,289.18,14484,286.48,290.37,False,0,43.7247672,-79.3017171
34_0_34A,8624,34,true,1585517597,65,0,289.18,14484,286.48,290.37,False,0,43.7247672,-79.3017171
34_0_34A,8624,34,true,1585517627,71,43,289.4,14484,287.59,290.93,False,0,43.7251976,-79.2993967
34_0_34A,8624,34,true,1585517658,76,0,289.4,14484,287.59,290.93,False,0,43.725484,-79.298164
34_0_34A,8624,34,true,1585517659,76,0,289.4,14484,287.59,290.93,False,0,43.725484,-79.298164
34_0_34A,8624,34,true,1585517687,76,0,289.4,14484,287.59,290.93,False,0,43.725484,-79.298164
34_0_34A,8624,34,true,1585517717,72,39,289.4,14484,287.59,290.93,False,0,43.7256528,-79.2968
34_0_34A,8624,34,true,1585517747,73,25,289.21,14484,286.48,290.37,False,0,43.7266268,-79.2925627
34_0_34A,8624,34,true,1585517777,73,26,289.21,14484,286.48,290.37,False,0,43.7267873,-79.2918228
34_0_34A,8624,34,true,1585517778,73,26,289.21,14484,286.48,290.37,False,0,43.7267873,-79.2918228
34_0_34A,8624,34,true,1585517807,72,32,289.21,14484,286.48,290.37,False,0,43.7270774,-79.2905925
34_0_34A,8624,34,true,1585517837,73,0,289.21,14484,286.48,290.37,False,0,43.7275059,-79.2887224
34_0_34A,8624,34,true,1585517867,72,12,289.21,14484,286.48,290.37,False,0,43.7275426,-79.2884856
34_0_34A,8624,34,true,1585517868,72,12,289.21,14484,286.48,290.37,False,0,43.7275426,-79.2884856
34_0_34A,8624,34,true,1585517899,72,37,289.09,14484,286.48,290.37,False,0,43.7283658,-79.2849402
34_0_34A,8624,34,true,1585517928,72,39,289.09,14484,286.48,290.37,False,0,43.7292714,-79.2806865
34_0_34A,8624,34,true,1585517927,72,39,289.09,14484,286.48,290.37,False,0,43.7292714,-79.2806865
34_0_34A,8624,34,true,1585517957,73,32,289.09,14484,286.48,290.37,False,0,43.7301327,-79.2770226
34_0_34A,8624,34,true,1585517958,73,32,289.09,14484,286.48,290.37,False,0,43.7301327,-79.2770226
34_0_34A,8624,34,true,1585517987,73,0,289.09,14484,286.48,290.37,False,0,43.7302711,-79.276376
34_0_34A,8624,34,true,1585518017,72,18,289.14,14484,287.04,290.37,False,0,43.7306125,-79.2748469
34_0_34A,8624,34,true,1585518047,73,0,289.14,14484,287.04,290.37,False,0,43.730802,-79.2737635
34_0_34A,8624,34,true,1585518077,73,0,289.14,14484,287.04,290.37,False,0,43.7312604,-79.2718315
34_0_34A,8624,34,true,1585518108,73,0,289.14,14484,287.04,290.37,False,0,43.7312604,-79.2718315
34_0_34A,8624,34,true,1585518137,72,37,289.14,14484,287.04,290.37,False,0,43.7317797,-79.2696364
34_0_34A,8624,34,true,1585518138,72,37,289.14,14484,287.04,290.37,False,0,43.7317797,-79.2696364
34_0_34A,8624,34,true,1585518167,97,26,289.14,14484,287.04,290.37,False,0,43.7324233,-79.2669069
34_0_34A,8624,34,true,1585518168,97,26,289.14,14484,287.04,290.37,False,0,43.7324233,-79.2669069
34_0_34A,8624,34,true,1585518198,74,0,289.14,14484,287.04,290.37,False,0,43.7326917,-79.2648824
34_0_34A,8624,34,true,1585518197,74,0,289.14,14484,287.04,290.37,False,0,43.7326917,-79.2648824
34_0_34A,8624,34,true,1585518227,72,0,289.14,14484,287.04,290.37,False,0,43.7328153,-79.2643194
34_0_34A,8624,34,true,1585518228,72,0,289.14,14484,287.04,290.37,False,0,43.7328153,-79.2643194
34_0_34A,8624,34,true,1585518257,44,3,289.14,14484,287.04,290.37,False,0,43.7328355,-79.2642298
34_0_34A,8624,34,true,1585518258,44,3,289.14,14484,287.04,290.37,False,0,43.7328355,-79.2642298
34_0_34A,8624,34,true,1585518287,116,10,289.14,14484,287.04,290.37,False,0,43.7330513,-79.2632898
