dir,id,route,predable,time,hdg,spd,temp,vis,t_min,t_max,snow,rain,lat,lon
34_1_34A,8832,34,true,1585433569,252,26,280.21,14484,277.59,283.15,False,0,43.7263488,-79.2943038
34_1_34A,8832,34,true,1585433599,252,14,280.21,14484,277.59,283.15,False,0,43.725933,-79.29673
34_1_34A,8832,34,true,1585433629,252,19,280.21,14484,277.59,283.15,False,0,43.7255859,-79.2977371
34_1_34A,8832,34,true,1585433659,252,25,280.21,14484,277.59,283.15,False,0,43.7250709,-79.2999954
34_1_34A,8832,34,true,1585433689,261,16,280.19,14484,277.59,283.15,False,0,43.7247467,-79.3018798
34_1_34A,8832,34,true,1585433719,291,0,280.19,14484,277.59,283.15,False,0,43.7248382,-79.3023681
34_1_34A,8832,34,true,1585433749,291,0,280.19,14484,277.59,283.15,False,0,43.7248382,-79.3023681
34_1_34A,8832,34,true,1585433750,291,0,280.19,14484,277.59,283.15,False,0,43.7248382,-79.3023681
34_1_34A,8832,34,true,1585433779,281,38,280.18,14484,277.59,283.15,False,0,43.7248344,-79.3056182
34_1_34A,8832,34,true,1585433780,281,38,280.18,14484,277.59,283.15,False,0,43.7248344,-79.3056182
34_1_34A,8832,34,true,1585433809,284,29,280.2,14484,277.59,283.15,False,0,43.7252464,-79.3083419
34_1_34A,8832,34,true,1585433810,284,29,280.2,14484,277.59,283.15,False,0,43.7252464,-79.3083419
34_1_34A,8832,34,true,1585433839,282,22,280.2,14484,277.59,283.15,False,0,43.7257766,-79.311943
34_1_34A,8832,34,true,1585433840,282,22,280.2,14484,277.59,283.15,False,0,43.7257766,-79.311943
34_1_34A,8832,34,true,1585433869,282,0,280.2,14484,277.59,283.15,False,0,43.7259368,-79.3129196
34_1_34A,8832,34,true,1585433870,282,0,280.2,14484,277.59,283.15,False,0,43.7259368,-79.3129196
34_1_34A,8832,34,true,1585433899,282,0,280.2,14484,277.59,283.15,False,0,43.7259368,-79.3129196
34_1_34A,8832,34,true,1585433900,282,0,280.2,14484,277.59,283.15,False,0,43.7259368,-79.3129196
34_1_34A,8832,34,true,1585433929,282,0,280.2,14484,277.59,283.15,False,0,43.7259368,-79.3129196
34_1_34A,8832,34,true,1585433930,282,0,280.2,14484,277.59,283.15,False,0,43.7259368,-79.3129196
34_1_34A,8832,34,true,1585433960,275,34,280.05,14484,277.59,282.59,False,0,43.7262115,-79.3150405
34_1_34A,8832,34,true,1585433959,275,34,280.05,14484,277.59,282.59,False,0,43.7262115,-79.3150405
34_1_34A,8832,34,true,1585433989,251,30,280.05,14484,277.59,282.59,False,0,43.7258415,-79.3197326
34_1_34A,8832,34,true,1585433990,251,30,280.05,14484,277.59,282.59,False,0,43.7258415,-79.3197326
34_1_34A,8832,34,true,1585434019,250,39,280.05,14484,277.59,282.59,False,0,43.725193,-79.3222808
34_1_34A,8832,34,true,1585434020,250,39,280.05,14484,277.59,282.59,False,0,43.725193,-79.3222808
34_1_34A,8832,34,true,1585434049,251,28,280.18,14484,277.59,283.15,False,0,43.7240371,-79.3266525
34_1_34A,8832,34,true,1585434050,251,28,280.18,14484,277.59,283.15,False,0,43.7240371,-79.3266525
34_1_34A,8832,34,true,1585434080,249,11,280.18,14484,277.59,283.15,False,0,43.7237472,-79.3283462
34_1_34A,8832,34,true,1585434079,249,11,280.18,14484,277.59,283.15,False,0,43.7237472,-79.3283462
34_1_34A,8832,34,true,1585434109,249,27,280.18,14484,277.59,283.15,False,0,43.722721,-79.3318023
34_1_34A,8832,34,true,1585434110,249,27,280.18,14484,277.59,283.15,False,0,43.722721,-79.3318023
34_1_34A,8832,34,true,1585434139,248,30,280.18,14484,277.59,283.15,False,0,43.7223815,-79.3326721
34_1_34A,8832,34,true,1585434140,248,30,280.18,14484,277.59,283.15,False,0,43.7223815,-79.3326721
34_1_34A,8832,34,true,1585434170,249,29,280.13,14484,276.48,283.15,False,0,43.7213897,-79.3359527
34_1_34A,8832,34,true,1585434169,249,29,280.13,14484,276.48,283.15,False,0,43.7213897,-79.3359527
34_1_34A,8832,34,true,1585434199,251,0,280.13,14484,276.48,283.15,False,0,43.720642,-79.3383789
34_1_34A,8832,34,true,1585434200,251,0,280.13,14484,276.48,283.15,False,0,43.720642,-79.3383789
34_1_34A,8832,34,true,1585434229,245,4,280.21,14484,277.59,283.15,False,0,43.720642,-79.3383789
34_1_34A,8832,34,true,1585434230,245,4,280.21,14484,277.59,283.15,False,0,43.720642,-79.3383789
34_1_34A,8832,34,true,1585434260,247,41,280.21,14484,277.59,283.15,False,0,43.7195816,-79.3417282
34_1_34A,8832,34,true,1585434259,247,41,280.21,14484,277.59,283.15,False,0,43.7195816,-79.3417282
34_1_34A,8832,34,true,1585434289,245,42,280.19,14484,277.59,283.15,False,0,43.7183456,-79.3457107
34_1_34A,8832,34,true,1585434290,245,42,280.19,14484,277.59,283.15,False,0,43.7183456,-79.3457107
34_1_34A,8832,34,true,1585434319,245,39,280.19,14484,277.59,283.15,False,0,43.7171592,-79.3497314
34_1_34A,8832,34,true,1585434320,245,39,280.19,14484,277.59,283.15,False,0,43.7171592,-79.3497314
34_1_34A,8832,34,true,1585434350,248,42,280.19,14484,277.59,283.15,False,0,43.7158012,-79.3541564
34_1_34A,8832,34,true,1585434349,248,42,280.19,14484,277.59,283.15,False,0,43.7158012,-79.3541564
34_1_34A,8832,34,true,1585434379,249,37,280.17,14484,277.59,283.15,False,0,43.7149314,-79.3583831
34_1_34A,8832,34,true,1585434409,254,0,280.17,14484,277.59,283.15,False,0,43.7146224,-79.3601226
34_1_34A,8832,34,true,1585434410,254,0,280.17,14484,277.59,283.15,False,0,43.7146224,-79.3601226
34_1_34A,8832,34,true,1585434439,254,0,280.17,14484,277.59,283.15,False,0,43.7146224,-79.3601226
34_1_34A,8832,34,true,1585434440,254,0,280.17,14484,277.59,283.15,False,0,43.7146224,-79.3601226
34_1_34A,8832,34,true,1585434469,254,24,280.17,14484,277.59,283.15,False,0,43.7144196,-79.361117
34_1_34A,8832,34,true,1585434470,254,24,280.17,14484,277.59,283.15,False,0,43.7144196,-79.361117
34_1_34A,8832,34,true,1585434499,254,26,280.17,14484,277.59,283.15,False,0,43.713911,-79.3631248
34_1_34A,8832,34,true,1585434500,254,26,280.17,14484,277.59,283.15,False,0,43.713911,-79.3631248
34_1_34A,8832,34,true,1585434530,254,0,280.17,14484,277.59,283.15,False,0,43.7136566,-79.3643277
34_1_34A,8832,34,true,1585434559,254,0,280.17,14484,277.59,283.15,False,0,43.7136566,-79.3643277
34_1_34A,8832,34,true,1585434560,254,0,280.17,14484,277.59,283.15,False,0,43.7136566,-79.3643277
34_1_34A,8832,34,true,1585434589,253,28,280.17,14484,277.59,283.15,False,0,43.7135528,-79.3653384
34_1_34A,8832,34,true,1585434590,253,28,280.17,14484,277.59,283.15,False,0,43.7135528,-79.3653384
34_1_34A,8832,34,true,1585434619,253,29,280.17,14484,277.59,283.15,False,0,43.712909,-79.3681855
34_1_34A,8832,34,true,1585434620,253,29,280.17,14484,277.59,283.15,False,0,43.712909,-79.3681855
34_1_34A,8832,34,true,1585434649,254,26,280.17,14484,277.59,283.15,False,0,43.7124277,-79.3704697
34_1_34A,8832,34,true,1585434650,254,26,280.17,14484,277.59,283.15,False,0,43.7124277,-79.3704697
34_1_34A,8832,34,true,1585434679,255,22,280.17,14484,277.59,283.15,False,0,43.711737,-79.3738314
34_1_34A,8832,34,true,1585434680,255,22,280.17,14484,277.59,283.15,False,0,43.711737,-79.3738314
34_1_34A,8832,34,true,1585434709,255,0,280.17,14484,277.59,283.15,False,0,43.7115379,-79.3752868
34_1_34A,8832,34,true,1585434710,255,0,280.17,14484,277.59,283.15,False,0,43.7115379,-79.3752868
34_1_34A,8832,34,true,1585434739,252,7,280.17,14484,277.59,283.15,False,0,43.7112426,-79.3768234
34_1_34A,8832,34,true,1585434740,252,7,280.17,14484,277.59,283.15,False,0,43.7112426,-79.3768234
34_1_34A,8832,34,true,1585434770,253,0,279.94,14484,277.04,282.04,False,0,43.7112339,-79.3768365
34_1_34A,8832,34,true,1585434769,253,0,279.94,14484,277.04,282.04,False,0,43.7112339,-79.3768365
34_1_34A,8832,34,true,1585434800,253,0,279.94,14484,277.04,282.04,False,0,43.7112339,-79.3768365
34_1_34A,8832,34,true,1585434799,253,0,279.94,14484,277.04,282.04,False,0,43.7112339,-79.3768365
34_1_34A,8832,34,true,1585434830,256,24,279.94,14484,277.04,282.04,False,0,43.7107666,-79.3783304
34_1_34A,8832,34,true,1585434829,256,24,279.94,14484,277.04,282.04,False,0,43.7107666,-79.3783304
