dir,id,route,predable,time,hdg,spd,temp,vis,t_min,t_max,snow,rain,lat,lon
34_0_34A,8710,34,true,1585753562,72,0,279.23,14484,277.15,280.37,False,0,43.7329229,-79.2638428
34_0_34A,8710,34,true,1585753593,71,9,279.23,14484,277.15,280.37,False,0,43.7330551,-79.2632774
