dir,id,route,predable,time,hdg,spd,temp,vis,t_min,t_max,snow,rain,lat,lon
34_0_34Aam,8624,34,true,1585479803,216,0,278.36,14484,277.04,279.82,False,2,43.7205366,-79.2921033
34_0_34Aam,8624,34,true,1585479802,216,0,278.36,14484,277.04,279.82,False,2,43.7205366,-79.2921033
34_0_34Aam,8624,34,true,1585479833,216,0,278.36,14484,277.04,279.82,False,2,43.7212638,-79.2917175
34_0_34Aam,8624,34,true,1585479832,216,0,278.36,14484,277.04,279.82,False,2,43.7212638,-79.2917175
34_0_34Aam,8624,34,true,1585479862,216,0,278.36,14484,277.04,279.82,False,2,43.7212638,-79.2917175
34_0_34Aam,8624,34,true,1585479863,216,0,278.36,14484,277.04,279.82,False,2,43.7212638,-79.2917175
34_0_34Aam,8624,34,true,1585479893,216,0,278.36,14484,277.04,279.82,False,2,43.7212638,-79.2917175
34_0_34Aam,8624,34,true,1585479892,216,0,278.36,14484,277.04,279.82,False,2,43.7212638,-79.2917175
34_0_34Aam,8624,34,true,1585479922,216,0,278.36,14484,277.04,279.82,False,2,43.7212638,-79.2917175
34_0_34Aam,8624,34,true,1585479923,216,0,278.36,14484,277.04,279.82,False,2,43.7212638,-79.2917175
34_0_34Aam,8624,34,true,1585479953,216,0,278.36,14484,277.04,279.82,False,2,43.7212638,-79.2917175
34_0_34Aam,8624,34,true,1585479952,216,0,278.36,14484,277.04,279.82,False,2,43.7212638,-79.2917175
34_0_34Aam,8624,34,true,1585479983,216,0,278.36,14484,277.04,279.82,False,2,43.7212638,-79.2917175
34_0_34Aam,8624,34,true,1585479982,216,0,278.36,14484,277.04,279.82,False,2,43.7212638,-79.2917175
34_0_34Aam,8624,34,true,1585480012,216,0,278.36,14484,277.04,279.82,False,2,43.7212638,-79.2917175
34_0_34Aam,8624,34,true,1585480013,216,0,278.36,14484,277.04,279.82,False,2,43.7212638,-79.2917175
34_0_34Aam,8624,34,true,1585480043,216,0,278.38,14484,277.04,279.82,False,2,43.7212638,-79.2917175
34_0_34Aam,8624,34,true,1585480042,216,0,278.38,14484,277.04,279.82,False,2,43.7212638,-79.2917175
34_0_34Aam,8624,34,true,1585480073,216,0,278.38,14484,277.04,279.82,False,2,43.7212638,-79.2917175
34_0_34Aam,8624,34,true,1585480072,216,0,278.38,14484,277.04,279.82,False,2,43.7212638,-79.2917175
34_0_34Aam,8624,34,true,1585480103,216,0,278.38,14484,277.04,279.82,False,2,43.7212638,-79.2917175
34_0_34Aam,8624,34,true,1585480102,216,0,278.38,14484,277.04,279.82,False,2,43.7212638,-79.2917175
34_0_34Aam,8624,34,true,1585480133,216,0,278.38,14484,277.04,279.82,False,2,43.7212638,-79.2917175
34_0_34Aam,8624,34,true,1585480132,216,0,278.38,14484,277.04,279.82,False,2,43.7212638,-79.2917175
34_0_34Aam,8624,34,true,1585480163,216,0,278.38,14484,277.04,279.82,False,2,43.7205016,-79.2922566
34_0_34Aam,8624,34,true,1585480162,216,0,278.38,14484,277.04,279.82,False,2,43.7205016,-79.2922566
34_0_34Aam,8624,34,true,1585480193,216,0,278.38,14484,277.04,279.82,False,2,43.7205016,-79.2922566
34_0_34Aam,8624,34,true,1585480222,216,0,278.38,14484,277.04,279.82,False,2,43.7205016,-79.2922566
34_0_34Aam,8624,34,true,1585480223,216,0,278.38,14484,277.04,279.82,False,2,43.7205016,-79.2922566
34_0_34Aam,8624,34,true,1585480253,216,0,278.38,14484,277.04,279.82,False,2,43.7205016,-79.2922566
34_0_34Aam,8624,34,true,1585480252,216,0,278.38,14484,277.04,279.82,False,2,43.7205016,-79.2922566
34_0_34Aam,8624,34,true,1585480283,216,1,278.38,14484,277.04,279.82,False,2,43.7204983,-79.2922616
34_0_34Aam,8624,34,true,1585480282,216,1,278.38,14484,277.04,279.82,False,2,43.7204983,-79.2922616
34_0_34Aam,8624,34,true,1585480313,170,5,278.38,14484,277.04,279.82,False,2,43.720205,-79.2929033
34_0_34Aam,8624,34,true,1585480312,170,5,278.38,14484,277.04,279.82,False,2,43.720205,-79.2929033
34_0_34Aam,8624,34,true,1585480343,70,29,278.38,14484,277.04,279.82,False,2,43.7200283,-79.2918433
34_0_34Aam,8624,34,true,1585480372,18,17,278.38,14484,277.04,279.82,False,2,43.7208433,-79.2887866
34_0_34Aam,8624,34,true,1585480373,18,17,278.38,14484,277.04,279.82,False,2,43.7208433,-79.2887866
34_0_34Aam,8624,34,true,1585480403,343,37,278.38,14484,277.04,279.82,False,2,43.723765,-79.2900483
34_0_34Aam,8624,34,true,1585480433,335,25,278.38,14484,277.04,279.82,False,2,43.72646,-79.2912833
34_0_34Aam,8624,34,true,1585480463,252,29,278.38,14484,277.04,279.82,False,2,43.72677,-79.2930433
34_0_34Aam,8624,34,true,1585480492,253,32,278.38,14484,277.04,279.82,False,2,43.7259716,-79.296605
34_0_34Aam,8624,34,true,1585480493,253,32,278.38,14484,277.04,279.82,False,2,43.7259716,-79.296605
34_0_34Aam,8624,34,true,1585480523,252,21,278.38,14484,277.04,279.82,False,2,43.7252316,-79.2999183
34_0_34Aam,8624,34,true,1585480522,252,21,278.38,14484,277.04,279.82,False,2,43.7252316,-79.2999183
34_0_34Aam,8624,34,true,1585480553,216,0,278.38,14484,277.04,279.82,False,2,43.7251083,-79.30049
34_0_34Aam,8624,34,true,1585480583,216,0,278.38,14484,277.04,279.82,False,2,43.7251083,-79.30049
34_0_34Aam,8624,34,true,1585480613,261,24,278.38,14484,277.04,279.82,False,2,43.7249466,-79.3016166
34_0_34Aam,8624,34,true,1585480643,270,34,278.38,14484,277.04,279.82,False,2,43.7247816,-79.3036833
34_0_34Aam,8624,34,true,1585480673,281,31,278.37,14484,277.04,279.82,False,2,43.7252083,-79.3076083
34_0_34Aam,8624,34,true,1585480703,283,33,278.37,14484,277.04,279.82,False,2,43.7258083,-79.3111833
34_0_34Aam,8624,34,true,1585480733,216,0,278.37,14484,277.04,279.82,False,2,43.72612,-79.3131416
34_0_34Aam,8624,34,true,1585480764,275,36,278.37,14484,277.04,279.82,False,2,43.72633,-79.3150333
34_0_34Aam,8624,34,true,1585480763,275,36,278.37,14484,277.04,279.82,False,2,43.72633,-79.3150333
34_0_34Aam,8624,34,true,1585480793,255,32,278.37,14484,277.04,279.82,False,2,43.7261049,-79.3190566
34_0_34Aam,8624,34,true,1585480823,250,35,278.37,14484,277.04,279.82,False,2,43.7250633,-79.3231349
34_0_34Aam,8624,34,true,1585480854,251,31,278.36,14484,277.04,279.82,False,2,43.7241766,-79.3267266
34_0_34Aam,8624,34,true,1585480853,251,31,278.36,14484,277.04,279.82,False,2,43.7241766,-79.3267266
34_0_34Aam,8624,34,true,1585480883,250,12,278.36,14484,277.04,279.82,False,2,43.7237216,-79.3284483
34_0_34Aam,8624,34,true,1585480913,249,24,278.36,14484,277.04,279.82,False,2,43.7229066,-79.3314266
34_0_34Aam,8624,34,true,1585480943,216,0,278.36,14484,277.04,279.82,False,2,43.72281,-79.331755
34_0_34Aam,8624,34,true,1585480973,246,37,278.36,14484,277.04,279.82,False,2,43.7221583,-79.3339483
34_0_34Aam,8624,34,true,1585480974,246,37,278.36,14484,277.04,279.82,False,2,43.7221583,-79.3339483
34_0_34Aam,8624,34,true,1585481003,252,33,278.32,14484,276.48,279.82,False,2,43.721125,-79.3375083
34_0_34Aam,8624,34,true,1585481004,252,33,278.32,14484,276.48,279.82,False,2,43.721125,-79.3375083
34_0_34Aam,8624,34,true,1585481033,245,40,278.32,14484,276.48,279.82,False,2,43.7198833,-79.34136
34_0_34Aam,8624,34,true,1585481034,245,40,278.32,14484,276.48,279.82,False,2,43.7198833,-79.34136
34_0_34Aam,8624,34,true,1585481063,245,40,278.33,14484,276.48,279.82,False,2,43.7185166,-79.3455183
34_0_34Aam,8624,34,true,1585481094,246,22,278.33,14484,276.48,279.82,False,2,43.717355,-79.34935
34_0_34Aam,8624,34,true,1585481093,246,22,278.33,14484,276.48,279.82,False,2,43.717355,-79.34935
34_0_34Aam,8624,34,true,1585481123,216,0,278.33,14484,276.48,279.82,False,2,43.7172383,-79.349705
34_0_34Aam,8624,34,true,1585481153,245,19,278.33,14484,276.48,279.82,False,2,43.7171733,-79.3498866
34_0_34Aam,8624,34,true,1585481184,248,43,278.33,14484,276.48,279.82,False,2,43.7160083,-79.3535266
34_0_34Aam,8624,34,true,1585481183,248,43,278.33,14484,276.48,279.82,False,2,43.7160083,-79.3535266
34_0_34Aam,8624,34,true,1585481213,251,37,278.32,14484,276.48,279.82,False,2,43.7151783,-79.357785
34_0_34Aam,8624,34,true,1585481243,216,0,278.31,14484,276.48,279.82,False,2,43.7147283,-79.35955
34_0_34Aam,8624,34,true,1585481273,252,18,278.31,14484,276.48,279.82,False,2,43.7146683,-79.359795
34_0_34Aam,8624,34,true,1585481303,254,35,278.31,14484,276.48,279.82,False,2,43.7139666,-79.3631333
34_0_34Aam,8624,34,true,1585481304,254,35,278.31,14484,276.48,279.82,False,2,43.7139666,-79.3631333
34_0_34Aam,8624,34,true,1585481333,216,0,278.31,14484,276.48,279.82,False,2,43.7136716,-79.364615
34_0_34Aam,8624,34,true,1585481334,216,0,278.31,14484,276.48,279.82,False,2,43.7136716,-79.364615
34_0_34Aam,8624,34,true,1585481363,216,0,278.31,14484,276.48,279.82,False,2,43.7136716,-79.364615
34_0_34Aam,8624,34,true,1585481393,253,31,278.3,14484,276.48,279.82,False,2,43.71323,-79.3667033
34_0_34Aam,8624,34,true,1585481394,253,31,278.3,14484,276.48,279.82,False,2,43.71323,-79.3667033
34_0_34Aam,8624,34,true,1585481424,255,30,278.3,14484,276.48,279.82,False,2,43.7124866,-79.3702516
34_0_34Aam,8624,34,true,1585481423,255,30,278.3,14484,276.48,279.82,False,2,43.7124866,-79.3702516
34_0_34Aam,8624,34,true,1585481453,255,30,278.3,14484,276.48,279.82,False,2,43.711815,-79.373595
34_0_34Aam,8624,34,true,1585481454,255,30,278.3,14484,276.48,279.82,False,2,43.711815,-79.373595
34_0_34Aam,8624,34,true,1585481483,248,15,278.41,8047,276.48,280.37,False,2,43.7111433,-79.3764033
34_0_34Aam,8624,34,true,1585481484,248,15,278.41,8047,276.48,280.37,False,2,43.7111433,-79.3764033
34_0_34Aam,8624,34,true,1585481513,216,0,278.41,8047,276.48,280.37,False,2,43.7110816,-79.376675
34_0_34Aam,8624,34,true,1585481544,216,0,278.41,8047,276.48,280.37,False,2,43.7110816,-79.376675
34_0_34Aam,8624,34,true,1585481543,216,0,278.41,8047,276.48,280.37,False,2,43.7110816,-79.376675
34_0_34Aam,8624,34,true,1585481573,253,14,278.41,8047,276.48,280.37,False,2,43.7110366,-79.3769133
34_0_34Aam,8624,34,true,1585481574,253,14,278.41,8047,276.48,280.37,False,2,43.7110366,-79.3769133
34_0_34Aam,8624,34,true,1585481603,254,34,278.41,8047,276.48,280.37,False,2,43.710565,-79.37966
34_0_34Aam,8624,34,true,1585481604,254,34,278.41,8047,276.48,280.37,False,2,43.710565,-79.37966
34_0_34Aam,8624,34,true,1585481633,254,34,278.41,8047,276.48,280.37,False,2,43.7097666,-79.383505
34_0_34Aam,8624,34,true,1585481634,254,34,278.41,8047,276.48,280.37,False,2,43.7097666,-79.383505
34_0_34Aam,8624,34,true,1585481663,257,30,278.39,8047,276.48,280.37,False,2,43.7090266,-79.387295
34_0_34Aam,8624,34,true,1585481664,257,30,278.39,8047,276.48,280.37,False,2,43.7090266,-79.387295
34_0_34Aam,8624,34,true,1585481693,252,19,278.39,8047,276.48,280.37,False,2,43.7085116,-79.389325
34_0_34Aam,8624,34,true,1585481694,252,19,278.39,8047,276.48,280.37,False,2,43.7085116,-79.389325
34_0_34Aam,8624,34,true,1585481723,254,27,278.39,8047,276.48,280.37,False,2,43.7080533,-79.39198
34_0_34Aam,8624,34,true,1585481724,254,27,278.39,8047,276.48,280.37,False,2,43.7080533,-79.39198
34_0_34Aam,8624,34,true,1585481753,251,25,278.44,8047,276.48,280.37,False,2,43.7073766,-79.395105
34_0_34Aam,8624,34,true,1585481754,251,25,278.44,8047,276.48,280.37,False,2,43.7073766,-79.395105
34_0_34Aam,8624,34,true,1585481783,256,16,278.44,8047,276.48,280.37,False,2,43.7068416,-79.397775
34_0_34Aam,8624,34,true,1585481784,256,16,278.44,8047,276.48,280.37,False,2,43.7068416,-79.397775
34_0_34Aam,8624,34,true,1585481813,216,0,278.44,8047,276.48,280.37,False,2,43.7068166,-79.397915
34_0_34Aam,8624,34,true,1585481814,216,0,278.44,8047,276.48,280.37,False,2,43.7068166,-79.397915
34_0_34Aam,8624,34,true,1585481843,255,18,278.44,8047,276.48,280.37,False,2,43.706745,-79.3982966
34_0_34Aam,8624,34,true,1585481844,255,18,278.44,8047,276.48,280.37,False,2,43.706745,-79.3982966
34_0_34Aam,8624,34,true,1585481873,187,13,278.44,8047,276.48,280.37,False,2,43.7062133,-79.400285
34_0_34Aam,8624,34,true,1585481874,187,13,278.44,8047,276.48,280.37,False,2,43.7062133,-79.400285
34_0_34Aam,8624,34,true,1585481903,165,12,278.44,8047,276.48,280.37,False,2,43.7052966,-79.3993233
34_0_34Aam,8624,34,true,1585481904,165,12,278.44,8047,276.48,280.37,False,2,43.7052966,-79.3993233
34_0_34Aam,8624,34,true,1585481964,76,0,278.44,8047,276.48,280.37,False,2,43.7052574,-79.3986129
34_0_34Aam,8624,34,true,1585481963,76,0,278.44,8047,276.48,280.37,False,2,43.7052574,-79.3986129
34_0_34Aam,8624,34,true,1585481993,76,0,278.44,8047,276.48,280.37,False,2,43.7052574,-79.3986129
34_0_34Aam,8624,34,true,1585481994,76,0,278.44,8047,276.48,280.37,False,2,43.7052574,-79.3986129
34_0_34Aam,8624,34,true,1585482023,313,9,278.44,8047,276.48,280.37,False,2,43.7056349,-79.3999407
34_0_34Aam,8624,34,true,1585482024,313,9,278.44,8047,276.48,280.37,False,2,43.7056349,-79.3999407
34_0_34Aam,8624,34,true,1585482053,76,0,278.44,8047,276.48,280.37,False,2,43.7059731,-79.4000904
34_0_34Aam,8624,34,true,1585482054,76,0,278.44,8047,276.48,280.37,False,2,43.7059731,-79.4000904
34_0_34Aam,8624,34,true,1585482084,72,19,278.44,8047,276.48,280.37,False,2,43.7065226,-79.3993748
34_0_34Aam,8624,34,true,1585482083,72,19,278.44,8047,276.48,280.37,False,2,43.7065226,-79.3993748
34_0_34Aam,8624,34,true,1585482114,75,25,278.44,8047,276.48,280.37,False,2,43.7069822,-79.3971468
34_0_34Aam,8624,34,true,1585482113,75,25,278.44,8047,276.48,280.37,False,2,43.7069822,-79.3971468
34_0_34Aam,8624,34,true,1585482144,76,25,278.48,8047,276.48,280.37,False,2,43.7075097,-79.3945522
34_0_34Aam,8624,34,true,1585482143,76,25,278.48,8047,276.48,280.37,False,2,43.7075097,-79.3945522
34_0_34Aam,8624,34,true,1585482173,74,0,278.48,8047,276.48,280.37,False,2,43.707756,-79.3929367
34_0_34Aam,8624,34,true,1585482174,74,0,278.48,8047,276.48,280.37,False,2,43.707756,-79.3929367
34_0_34Aam,8624,34,true,1585482204,76,17,278.48,8047,276.48,280.37,False,2,43.7079934,-79.39214
34_0_34Aam,8624,34,true,1585482203,76,17,278.48,8047,276.48,280.37,False,2,43.7079934,-79.39214
34_0_34Aam,8624,34,true,1585482233,74,4,278.48,8047,276.48,280.37,False,2,43.7083334,-79.390508
34_0_34Aam,8624,34,true,1585482234,74,4,278.48,8047,276.48,280.37,False,2,43.7083334,-79.390508
34_0_34Aam,8624,34,true,1585482264,73,6,278.48,8047,276.48,280.37,False,2,43.7083499,-79.3904266
34_0_34Aam,8624,34,true,1585482263,73,6,278.48,8047,276.48,280.37,False,2,43.7083499,-79.3904266
34_0_34Aam,8624,34,true,1585482293,73,19,278.48,8047,276.48,280.37,False,2,43.7085616,-79.3893358
34_0_34Aam,8624,34,true,1585482294,73,19,278.48,8047,276.48,280.37,False,2,43.7085616,-79.3893358
34_0_34Aam,8624,34,true,1585482323,74,26,278.48,8047,276.48,280.37,False,2,43.7091674,-79.3861526
34_0_34Aam,8624,34,true,1585482324,74,26,278.48,8047,276.48,280.37,False,2,43.7091674,-79.3861526
34_0_34Aam,8624,34,true,1585482354,74,29,278.48,8047,276.48,280.37,False,2,43.7098388,-79.3829498
34_0_34Aam,8624,34,true,1585482353,74,29,278.48,8047,276.48,280.37,False,2,43.7098388,-79.3829498
34_0_34Aam,8624,34,true,1585482384,74,24,278.48,8047,276.48,280.37,False,2,43.7103805,-79.3803458
34_0_34Aam,8624,34,true,1585482385,74,24,278.48,8047,276.48,280.37,False,2,43.7103805,-79.3803458
34_0_34Aam,8624,34,true,1585482414,75,21,278.48,8047,276.48,280.37,False,2,43.7108637,-79.3779004
34_0_34Aam,8624,34,true,1585482415,75,21,278.48,8047,276.48,280.37,False,2,43.7108637,-79.3779004
34_0_34Aam,8624,34,true,1585482444,72,14,278.48,8047,276.48,280.37,False,2,43.7110384,-79.3770106
34_0_34Aam,8624,34,true,1585482445,72,14,278.48,8047,276.48,280.37,False,2,43.7110384,-79.3770106
34_0_34Aam,8624,34,true,1585482474,74,25,278.5,8047,276.48,280.37,False,2,43.7114601,-79.3749618
34_0_34Aam,8624,34,true,1585482475,74,25,278.5,8047,276.48,280.37,False,2,43.7114601,-79.3749618
34_0_34Aam,8624,34,true,1585482504,74,29,278.51,8047,276.48,280.37,False,2,43.7120816,-79.3720904
34_0_34Aam,8624,34,true,1585482505,74,29,278.51,8047,276.48,280.37,False,2,43.7120816,-79.3720904
34_0_34Aam,8624,34,true,1585482534,73,27,278.51,8047,276.48,280.37,False,2,43.7127459,-79.3686024
34_0_34Aam,8624,34,true,1585482535,73,27,278.51,8047,276.48,280.37,False,2,43.7127459,-79.3686024
34_0_34Aam,8624,34,true,1585482564,73,5,278.51,8047,276.48,280.37,False,2,43.7130363,-79.3671478
34_0_34Aam,8624,34,true,1585482565,73,5,278.51,8047,276.48,280.37,False,2,43.7130363,-79.3671478
34_0_34Aam,8624,34,true,1585482594,73,26,278.51,8047,276.48,280.37,False,2,43.7134195,-79.3652191
34_0_34Aam,8624,34,true,1585482624,78,28,278.53,8047,276.48,280.37,False,2,43.7139765,-79.3623614
34_0_34Aam,8624,34,true,1585482625,78,28,278.53,8047,276.48,280.37,False,2,43.7139765,-79.3623614
34_0_34Aam,8624,34,true,1585482655,76,14,278.53,8047,276.48,280.37,False,2,43.7145363,-79.3597715
34_0_34Aam,8624,34,true,1585482654,76,14,278.53,8047,276.48,280.37,False,2,43.7145363,-79.3597715
34_0_34Aam,8624,34,true,1585482685,67,24,278.53,8047,276.48,280.37,False,2,43.7148671,-79.3586426
34_0_34Aam,8624,34,true,1585482684,67,24,278.53,8047,276.48,280.37,False,2,43.7148671,-79.3586426
34_0_34Aam,8624,34,true,1585482714,76,28,278.51,8047,276.48,280.37,False,2,43.715297,-79.3566091
34_0_34Aam,8624,34,true,1585482715,76,28,278.51,8047,276.48,280.37,False,2,43.715297,-79.3566091
34_0_34Aam,8624,34,true,1585482745,62,30,278.53,8047,276.48,279.82,False,2,43.7160342,-79.3532576
34_0_34Aam,8624,34,true,1585482744,62,30,278.53,8047,276.48,279.82,False,2,43.7160342,-79.3532576
34_0_34Aam,8624,34,true,1585482774,65,29,278.53,8047,276.48,279.82,False,2,43.716975,-79.3496507
34_0_34Aam,8624,34,true,1585482775,65,29,278.53,8047,276.48,279.82,False,2,43.716975,-79.3496507
34_0_34Aam,8624,34,true,1585482805,67,31,278.53,8047,276.48,279.82,False,2,43.7181961,-79.3461927
34_0_34Aam,8624,34,true,1585482804,67,31,278.53,8047,276.48,279.82,False,2,43.7181961,-79.3461927
34_0_34Aam,8624,34,true,1585482834,66,30,278.55,8047,276.48,279.82,False,2,43.719223,-79.3429489
34_0_34Aam,8624,34,true,1585482835,66,30,278.55,8047,276.48,279.82,False,2,43.719223,-79.3429489
34_0_34Aam,8624,34,true,1585482864,69,32,278.55,8047,276.48,279.82,False,2,43.7199467,-79.3405841
34_0_34Aam,8624,34,true,1585482865,69,32,278.55,8047,276.48,279.82,False,2,43.7199467,-79.3405841
34_0_34Aam,8624,34,true,1585482895,66,4,278.55,8047,276.48,279.82,False,2,43.7206302,-79.3384156
34_0_34Aam,8624,34,true,1585482894,66,4,278.55,8047,276.48,279.82,False,2,43.7206302,-79.3384156
34_0_34Aam,8624,34,true,1585482925,78,0,278.55,8047,276.48,279.82,False,2,43.7206355,-79.3383983
34_0_34Aam,8624,34,true,1585482924,78,0,278.55,8047,276.48,279.82,False,2,43.7206355,-79.3383983
34_0_34Aam,8624,34,true,1585482955,78,0,278.55,8047,276.48,279.82,False,2,43.7206355,-79.3383983
34_0_34Aam,8624,34,true,1585482954,78,0,278.55,8047,276.48,279.82,False,2,43.7206355,-79.3383983
34_0_34Aam,8624,34,true,1585482985,67,20,278.55,8047,276.48,279.82,False,2,43.7205977,-79.3376423
34_0_34Aam,8624,34,true,1585482984,67,20,278.55,8047,276.48,279.82,False,2,43.7205977,-79.3376423
34_0_34Aam,8624,34,true,1585483015,63,26,278.55,8047,276.48,279.82,False,2,43.7216003,-79.3352645
34_0_34Aam,8624,34,true,1585483014,63,26,278.55,8047,276.48,279.82,False,2,43.7216003,-79.3352645
34_0_34Aam,8624,34,true,1585483045,67,24,278.59,8047,277.04,279.82,False,2,43.7224362,-79.3322517
34_0_34Aam,8624,34,true,1585483044,67,24,278.59,8047,277.04,279.82,False,2,43.7224362,-79.3322517
34_0_34Aam,8624,34,true,1585483074,70,29,278.59,8047,277.04,279.82,False,2,43.7232335,-79.3295389
34_0_34Aam,8624,34,true,1585483075,70,29,278.59,8047,277.04,279.82,False,2,43.7232335,-79.3295389
34_0_34Aam,8624,34,true,1585483104,70,26,278.59,8047,277.04,279.82,False,2,43.7241569,-79.3261604
34_0_34Aam,8624,34,true,1585483105,70,26,278.59,8047,277.04,279.82,False,2,43.7241569,-79.3261604
34_0_34Aam,8624,34,true,1585483134,68,26,278.59,8047,277.04,279.82,False,2,43.7248003,-79.3237289
34_0_34Aam,8624,34,true,1585483135,68,26,278.59,8047,277.04,279.82,False,2,43.7248003,-79.3237289
34_0_34Aam,8624,34,true,1585483165,70,27,278.59,8047,277.04,279.82,False,2,43.7255916,-79.3207032
34_0_34Aam,8624,34,true,1585483164,70,27,278.59,8047,277.04,279.82,False,2,43.7255916,-79.3207032
34_0_34Aam,8624,34,true,1585483197,75,20,278.59,8047,277.04,279.82,False,2,43.7260347,-79.3182793
34_0_34Aam,8624,34,true,1585483198,75,20,278.59,8047,277.04,279.82,False,2,43.7260347,-79.3182793
34_0_34Aam,8624,34,true,1585483225,82,0,278.59,8047,277.04,279.82,False,2,43.7261911,-79.3179295
34_0_34Aam,8624,34,true,1585483224,82,0,278.59,8047,277.04,279.82,False,2,43.7261911,-79.3179295
34_0_34Aam,8624,34,true,1585483254,82,0,278.59,8047,277.04,279.82,False,2,43.7261911,-79.3179295
34_0_34Aam,8624,34,true,1585483255,82,0,278.59,8047,277.04,279.82,False,2,43.7261911,-79.3179295
34_0_34Aam,8624,34,true,1585483284,89,26,278.59,8047,277.04,279.82,False,2,43.726255,-79.3156356
34_0_34Aam,8624,34,true,1585483285,89,26,278.59,8047,277.04,279.82,False,2,43.726255,-79.3156356
34_0_34Aam,8624,34,true,1585483317,103,4,278.6,8047,277.04,279.82,False,2,43.7259499,-79.3134936
34_0_34Aam,8624,34,true,1585483344,103,22,278.6,8047,277.04,279.82,False,2,43.7259287,-79.3128981
34_0_34Aam,8624,34,true,1585483345,103,22,278.6,8047,277.04,279.82,False,2,43.7259287,-79.3128981
34_0_34Aam,8624,34,true,1585483375,102,32,278.6,8047,277.04,279.82,False,2,43.7254154,-79.3094724
34_0_34Aam,8624,34,true,1585483374,102,32,278.6,8047,277.04,279.82,False,2,43.7254154,-79.3094724
34_0_34Aam,8624,34,true,1585483405,101,37,278.6,8047,277.04,279.82,False,2,43.7247993,-79.3053919
34_0_34Aam,8624,34,true,1585483404,101,37,278.6,8047,277.04,279.82,False,2,43.7247993,-79.3053919
34_0_34Aam,8624,34,true,1585483434,82,22,278.61,8047,277.04,279.82,False,2,43.7246384,-79.3019686
34_0_34Aam,8624,34,true,1585483435,82,22,278.61,8047,277.04,279.82,False,2,43.7246384,-79.3019686
34_0_34Aam,8624,34,true,1585483464,80,11,278.61,8047,277.04,279.82,False,2,43.7250015,-79.300322
34_0_34Aam,8624,34,true,1585483465,80,11,278.61,8047,277.04,279.82,False,2,43.7250015,-79.300322
34_0_34Aam,8624,34,true,1585483495,72,15,278.61,8047,277.04,279.82,False,2,43.7256503,-79.2974688
34_0_34Aam,8624,34,true,1585483494,72,15,278.61,8047,277.04,279.82,False,2,43.7256503,-79.2974688
34_0_34Aam,8624,34,true,1585483525,76,0,278.61,8047,277.04,279.82,False,2,43.7256164,-79.2969284
34_0_34Aam,8624,34,true,1585483524,76,0,278.61,8047,277.04,279.82,False,2,43.7256164,-79.2969284
34_0_34Aam,8624,34,true,1585483555,71,19,278.61,8047,277.04,279.82,False,2,43.7256498,-79.2968104
34_0_34Aam,8624,34,true,1585483554,71,19,278.61,8047,277.04,279.82,False,2,43.7256498,-79.2968104
34_0_34Aam,8624,34,true,1585483584,72,28,278.61,8047,277.04,279.82,False,2,43.7264149,-79.2939136
34_0_34Aam,8624,34,true,1585483585,72,28,278.61,8047,277.04,279.82,False,2,43.7264149,-79.2939136
34_0_34Aam,8624,34,true,1585483614,73,16,278.61,8047,277.04,279.82,False,2,43.7269432,-79.2914972
34_0_34Aam,8624,34,true,1585483615,73,16,278.61,8047,277.04,279.82,False,2,43.7269432,-79.2914972
34_0_34Aam,8624,34,true,1585483645,73,0,278.61,8047,277.04,279.82,False,2,43.7269401,-79.2909545
34_0_34Aam,8624,34,true,1585483644,73,0,278.61,8047,277.04,279.82,False,2,43.7269401,-79.2909545
34_0_34Aam,8624,34,true,1585483675,73,0,278.61,8047,277.04,279.82,False,2,43.7272682,-79.2900896
34_0_34Aam,8624,34,true,1585483674,73,0,278.61,8047,277.04,279.82,False,2,43.7272682,-79.2900896
34_0_34Aam,8624,34,true,1585483704,73,22,278.61,8047,277.04,279.82,False,2,43.7274086,-79.2893919
34_0_34Aam,8624,34,true,1585483705,73,22,278.61,8047,277.04,279.82,False,2,43.7274086,-79.2893919
34_0_34Aam,8624,34,true,1585483735,73,0,278.61,8047,277.04,279.82,False,2,43.7278063,-79.2875975
34_0_34Aam,8624,34,true,1585483734,73,0,278.61,8047,277.04,279.82,False,2,43.7278063,-79.2875975
34_0_34Aam,8624,34,true,1585483765,71,15,278.61,8047,277.04,279.82,False,2,43.7279488,-79.2871247
34_0_34Aam,8624,34,true,1585483764,71,15,278.61,8047,277.04,279.82,False,2,43.7279488,-79.2871247
34_0_34Aam,8624,34,true,1585483797,69,23,278.62,8047,277.04,279.82,False,2,43.7283788,-79.2849238
34_0_34Aam,8624,34,true,1585483825,74,24,278.62,8047,277.04,279.82,False,2,43.7291221,-79.281826
34_0_34Aam,8624,34,true,1585483824,74,24,278.62,8047,277.04,279.82,False,2,43.7291221,-79.281826
34_0_34Aam,8624,34,true,1585483855,72,24,278.62,8047,277.04,279.82,False,2,43.7297028,-79.2790063
34_0_34Aam,8624,34,true,1585483854,72,24,278.62,8047,277.04,279.82,False,2,43.7297028,-79.2790063
34_0_34Aam,8624,34,true,1585483885,73,23,278.62,8047,277.04,279.82,False,2,43.7302994,-79.2762503
34_0_34Aam,8624,34,true,1585483884,73,23,278.62,8047,277.04,279.82,False,2,43.7302994,-79.2762503
34_0_34Aam,8624,34,true,1585483914,73,0,278.62,8047,277.04,279.82,False,2,43.7305178,-79.2752673
34_0_34Aam,8624,34,true,1585483915,73,0,278.62,8047,277.04,279.82,False,2,43.7305178,-79.2752673
34_0_34Aam,8624,34,true,1585483945,73,19,278.65,8047,277.04,279.82,False,2,43.7307586,-79.273824
34_0_34Aam,8624,34,true,1585483944,73,19,278.65,8047,277.04,279.82,False,2,43.7307586,-79.273824
34_0_34Aam,8624,34,true,1585483975,73,0,278.65,8047,277.04,279.82,False,2,43.7309488,-79.273385
34_0_34Aam,8624,34,true,1585483974,73,0,278.65,8047,277.04,279.82,False,2,43.7309488,-79.273385
34_0_34Aam,8624,34,true,1585484005,72,17,278.65,8047,277.04,279.82,False,2,43.7311286,-79.2725753
34_0_34Aam,8624,34,true,1585484004,72,17,278.65,8047,277.04,279.82,False,2,43.7311286,-79.2725753
34_0_34Aam,8624,34,true,1585484037,72,5,278.65,8047,277.04,279.82,False,2,43.7315228,-79.2707832
34_0_34Aam,8624,34,true,1585484038,72,5,278.65,8047,277.04,279.82,False,2,43.7315228,-79.2707832
34_0_34Aam,8624,34,true,1585484065,72,0,278.65,8047,277.04,279.82,False,2,43.7315352,-79.2707287
34_0_34Aam,8624,34,true,1585484064,72,0,278.65,8047,277.04,279.82,False,2,43.7315352,-79.2707287
34_0_34Aam,8624,34,true,1585484095,72,0,278.65,8047,277.04,279.82,False,2,43.7315352,-79.2707287
34_0_34Aam,8624,34,true,1585484094,72,0,278.65,8047,277.04,279.82,False,2,43.7315352,-79.2707287
34_0_34Aam,8624,34,true,1585484125,72,27,278.65,8047,277.04,279.82,False,2,43.7319088,-79.2688228
34_0_34Aam,8624,34,true,1585484124,72,27,278.65,8047,277.04,279.82,False,2,43.7319088,-79.2688228
34_0_34Aam,8624,34,true,1585484154,93,21,278.65,8047,277.04,279.82,False,2,43.7322403,-79.2660263
34_0_34Aam,8624,34,true,1585484155,93,21,278.65,8047,277.04,279.82,False,2,43.7322403,-79.2660263
