dir,id,route,predable,time,hdg,spd,temp,vis,t_min,t_max,snow,rain,lat,lon
34_0_34A,8851,34,true,1585437651,216,0,279.73,14484,278.15,281.48,False,0,43.7210383,-79.2914483
34_0_34A,8851,34,true,1585437650,216,0,279.73,14484,278.15,281.48,False,0,43.7210383,-79.2914483
34_0_34A,8851,34,true,1585437681,216,0,279.73,14484,278.15,281.48,False,0,43.7210383,-79.2914483
34_0_34A,8851,34,true,1585437680,216,0,279.73,14484,278.15,281.48,False,0,43.7210383,-79.2914483
34_0_34A,8851,34,true,1585437711,216,0,279.73,14484,278.15,281.48,False,0,43.7210383,-79.2914483
34_0_34A,8851,34,true,1585437710,216,0,279.73,14484,278.15,281.48,False,0,43.7210383,-79.2914483
34_0_34A,8851,34,true,1585437740,216,0,279.73,14484,278.15,281.48,False,0,43.7210383,-79.2914483
34_0_34A,8851,34,true,1585437741,216,0,279.73,14484,278.15,281.48,False,0,43.7210383,-79.2914483
34_0_34A,8851,34,true,1585437770,216,0,279.73,14484,278.15,281.48,False,0,43.7210383,-79.2914483
34_0_34A,8851,34,true,1585437771,216,0,279.73,14484,278.15,281.48,False,0,43.7210383,-79.2914483
34_0_34A,8851,34,true,1585437800,216,0,279.73,14484,278.15,281.48,False,0,43.7210383,-79.2914483
34_0_34A,8851,34,true,1585437801,216,0,279.73,14484,278.15,281.48,False,0,43.7210383,-79.2914483
34_0_34A,8851,34,true,1585437830,216,0,279.73,14484,278.15,281.48,False,0,43.7210383,-79.2914483
34_0_34A,8851,34,true,1585437831,216,0,279.73,14484,278.15,281.48,False,0,43.7210383,-79.2914483
34_0_34A,8851,34,true,1585437860,216,0,279.73,14484,278.15,281.48,False,0,43.7210383,-79.2914483
34_0_34A,8851,34,true,1585437861,216,0,279.73,14484,278.15,281.48,False,0,43.7210383,-79.2914483
34_0_34A,8851,34,true,1585437890,216,0,279.73,14484,278.15,281.48,False,0,43.7210383,-79.2914483
34_0_34A,8851,34,true,1585437891,216,0,279.73,14484,278.15,281.48,False,0,43.7210383,-79.2914483
34_0_34A,8851,34,true,1585437920,216,0,279.73,14484,278.15,281.48,False,0,43.7210383,-79.2914483
34_0_34A,8851,34,true,1585437921,216,0,279.73,14484,278.15,281.48,False,0,43.7210383,-79.2914483
34_0_34A,8851,34,true,1585437951,216,0,279.73,14484,278.15,281.48,False,0,43.7210383,-79.2914483
34_0_34A,8851,34,true,1585437950,216,0,279.73,14484,278.15,281.48,False,0,43.7210383,-79.2914483
34_0_34A,8851,34,true,1585437980,216,0,279.73,14484,278.15,281.48,False,0,43.7210383,-79.2914483
34_0_34A,8851,34,true,1585437981,216,0,279.73,14484,278.15,281.48,False,0,43.7210383,-79.2914483
34_0_34A,8851,34,true,1585438010,228,6,279.73,14484,278.15,281.48,False,0,43.7207866,-79.2916066
34_0_34A,8851,34,true,1585438041,243,10,279.73,14484,278.15,281.48,False,0,43.7204883,-79.292785
34_0_34A,8851,34,true,1585438040,243,10,279.73,14484,278.15,281.48,False,0,43.7204883,-79.292785
34_0_34A,8851,34,true,1585438071,130,11,279.73,14484,278.15,281.48,False,0,43.7199316,-79.29267
34_0_34A,8851,34,true,1585438100,70,26,279.73,14484,278.15,281.48,False,0,43.7205633,-79.2895383
34_0_34A,8851,34,true,1585438101,70,26,279.73,14484,278.15,281.48,False,0,43.7205633,-79.2895383
34_0_34A,8851,34,true,1585438131,343,25,279.73,14484,278.15,281.48,False,0,43.7220299,-79.28927
34_0_34A,8851,34,true,1585438130,343,25,279.73,14484,278.15,281.48,False,0,43.7220299,-79.28927
34_0_34A,8851,34,true,1585438161,341,25,279.73,14484,278.15,281.48,False,0,43.7230833,-79.2897216
34_0_34A,8851,34,true,1585438160,341,25,279.73,14484,278.15,281.48,False,0,43.7230833,-79.2897216
34_0_34A,8851,34,true,1585438191,343,28,279.8,14484,278.15,281.48,False,0,43.72528,-79.2906416
34_0_34A,8851,34,true,1585438220,216,0,279.8,14484,278.15,281.48,False,0,43.7269477,-79.2916946
34_0_34A,8851,34,true,1585438221,216,0,279.8,14484,278.15,281.48,False,0,43.7269477,-79.2916946
34_0_34A,8851,34,true,1585438251,216,0,279.8,14484,278.15,281.48,False,0,43.7269477,-79.2916946
34_0_34A,8851,34,true,1585438250,216,0,279.8,14484,278.15,281.48,False,0,43.7269477,-79.2916946
34_0_34A,8851,34,true,1585438280,216,0,279.8,14484,278.15,281.48,False,0,43.7269477,-79.2916946
34_0_34A,8851,34,true,1585438281,216,0,279.8,14484,278.15,281.48,False,0,43.7269477,-79.2916946
34_0_34A,8851,34,true,1585438311,216,0,279.8,14484,278.15,281.48,False,0,43.7269477,-79.2916946
34_0_34A,8851,34,true,1585438340,216,0,279.8,14484,278.15,281.48,False,0,43.7269477,-79.2916946
34_0_34A,8851,34,true,1585438341,216,0,279.8,14484,278.15,281.48,False,0,43.7269477,-79.2916946
34_0_34A,8851,34,true,1585438371,216,0,279.8,14484,278.15,281.48,False,0,43.7269477,-79.2916946
34_0_34A,8851,34,true,1585438370,216,0,279.8,14484,278.15,281.48,False,0,43.7269477,-79.2916946
34_0_34A,8851,34,true,1585438400,216,0,279.8,14484,278.15,281.48,False,0,43.7269477,-79.2916946
34_0_34A,8851,34,true,1585438401,216,0,279.8,14484,278.15,281.48,False,0,43.7269477,-79.2916946
34_0_34A,8851,34,true,1585438433,216,0,279.8,14484,278.15,281.48,False,0,43.7269477,-79.2916946
34_0_34A,8851,34,true,1585439721,62,13,279.58,14484,277.59,281.48,False,0,43.7269668,-79.2912063
34_0_34A,8851,34,true,1585439751,73,0,279.58,14484,277.59,281.48,False,0,43.7269401,-79.2909545
34_0_34A,8851,34,true,1585439750,73,0,279.58,14484,277.59,281.48,False,0,43.7269401,-79.2909545
34_0_34A,8851,34,true,1585439781,74,14,279.58,14484,277.59,281.48,False,0,43.7269884,-79.2908272
34_0_34A,8851,34,true,1585439780,74,14,279.58,14484,277.59,281.48,False,0,43.7269884,-79.2908272
34_0_34A,8851,34,true,1585439811,73,21,279.58,14484,277.59,281.48,False,0,43.7274487,-79.2891293
34_0_34A,8851,34,true,1585439810,73,21,279.58,14484,277.59,281.48,False,0,43.7274487,-79.2891293
34_0_34A,8851,34,true,1585439842,71,17,279.58,14484,277.59,281.48,False,0,43.7275487,-79.2884449
34_0_34A,8851,34,true,1585439841,71,17,279.58,14484,277.59,281.48,False,0,43.7275487,-79.2884449
34_0_34A,8851,34,true,1585439870,73,30,279.52,14484,277.59,281.15,False,0,43.7283723,-79.284932
34_0_34A,8851,34,true,1585439871,73,30,279.52,14484,277.59,281.15,False,0,43.7283723,-79.284932
34_0_34A,8851,34,true,1585439901,75,27,279.52,14484,277.59,281.15,False,0,43.7288222,-79.2827052
34_0_34A,8851,34,true,1585439900,75,27,279.52,14484,277.59,281.15,False,0,43.7288222,-79.2827052
34_0_34A,8851,34,true,1585439931,71,8,279.52,14484,277.59,281.15,False,0,43.7290766,-79.2820338
34_0_34A,8851,34,true,1585439961,74,0,279.52,14484,277.59,281.15,False,0,43.7292372,-79.2812916
34_0_34A,8851,34,true,1585439960,74,0,279.52,14484,277.59,281.15,False,0,43.7292372,-79.2812916
34_0_34A,8851,34,true,1585439991,73,29,279.52,14484,277.59,281.15,False,0,43.7295579,-79.2798088
34_0_34A,8851,34,true,1585439990,73,29,279.52,14484,277.59,281.15,False,0,43.7295579,-79.2798088
34_0_34A,8851,34,true,1585440021,74,0,279.52,14484,277.59,281.15,False,0,43.729732,-79.2785764
34_0_34A,8851,34,true,1585440020,74,0,279.52,14484,277.59,281.15,False,0,43.729732,-79.2785764
34_0_34A,8851,34,true,1585440051,74,0,279.52,14484,277.59,281.15,False,0,43.729732,-79.2785764
34_0_34A,8851,34,true,1585440050,74,0,279.52,14484,277.59,281.15,False,0,43.729732,-79.2785764
34_0_34A,8851,34,true,1585440081,72,22,279.52,14484,277.59,281.15,False,0,43.7301424,-79.276976
34_0_34A,8851,34,true,1585440111,73,0,279.52,14484,277.59,281.15,False,0,43.7302627,-79.2764129
34_0_34A,8851,34,true,1585440141,73,23,279.5,14484,277.59,281.15,False,0,43.7306708,-79.2745889
34_0_34A,8851,34,true,1585440171,79,15,279.5,14484,277.59,281.15,False,0,43.7312589,-79.2719306
34_0_34A,8851,34,true,1585440201,73,0,279.5,14484,277.59,281.15,False,0,43.7312614,-79.2717628
34_0_34A,8851,34,true,1585440231,73,0,279.5,14484,277.59,281.15,False,0,43.7312614,-79.2717628
34_0_34A,8851,34,true,1585440261,72,27,279.5,14484,277.59,281.15,False,0,43.7316643,-79.2701788
