dir,id,route,predable,time,hdg,spd,temp,vis,t_min,t_max,snow,rain,lat,lon
34_0_34C,8648,34,true,1585440741,216,0,279.41,14484,277.59,281.15,False,0,43.721185,-79.2915066
34_0_34C,8648,34,true,1585440771,216,0,279.41,14484,277.59,281.15,False,0,43.721185,-79.2915066
34_0_34C,8648,34,true,1585440801,216,0,279.41,14484,277.59,281.15,False,0,43.721185,-79.2915066
34_0_34C,8648,34,true,1585440831,216,0,279.41,14484,277.59,281.15,False,0,43.721185,-79.2915066
34_0_34C,8648,34,true,1585440861,216,0,279.41,14484,277.59,281.15,False,0,43.721185,-79.2915066
34_0_34C,8648,34,true,1585440862,216,0,279.41,14484,277.59,281.15,False,0,43.721185,-79.2915066
34_0_34C,8648,34,true,1585440891,216,0,279.41,14484,277.59,281.15,False,0,43.721185,-79.2915066
34_0_34C,8648,34,true,1585440892,216,0,279.41,14484,277.59,281.15,False,0,43.721185,-79.2915066
34_0_34C,8648,34,true,1585440921,216,0,279.41,14484,277.59,281.15,False,0,43.721185,-79.2915066
34_0_34C,8648,34,true,1585440922,216,0,279.41,14484,277.59,281.15,False,0,43.721185,-79.2915066
34_0_34C,8648,34,true,1585440951,216,0,279.41,14484,277.59,281.15,False,0,43.721185,-79.2915066
34_0_34C,8648,34,true,1585440981,216,0,279.41,14484,277.59,281.15,False,0,43.721185,-79.2915066
34_0_34C,8648,34,true,1585440982,216,0,279.41,14484,277.59,281.15,False,0,43.721185,-79.2915066
34_0_34C,8648,34,true,1585441011,216,0,279.41,14484,277.59,281.15,False,0,43.721185,-79.2915066
34_0_34C,8648,34,true,1585441012,216,0,279.41,14484,277.59,281.15,False,0,43.721185,-79.2915066
34_0_34C,8648,34,true,1585441041,216,0,279.41,14484,277.59,281.15,False,0,43.721185,-79.2915066
34_0_34C,8648,34,true,1585441042,216,0,279.41,14484,277.59,281.15,False,0,43.721185,-79.2915066
34_0_34C,8648,34,true,1585441071,216,0,279.41,14484,277.59,281.15,False,0,43.721185,-79.2915066
34_0_34C,8648,34,true,1585441072,216,0,279.41,14484,277.59,281.15,False,0,43.721185,-79.2915066
34_0_34C,8648,34,true,1585441101,216,0,279.41,14484,277.59,281.15,False,0,43.721185,-79.2915066
34_0_34C,8648,34,true,1585441131,216,0,279.41,14484,277.59,281.15,False,0,43.721185,-79.2915066
34_0_34C,8648,34,true,1585441132,216,0,279.41,14484,277.59,281.15,False,0,43.721185,-79.2915066
