dir,id,route,predable,time,hdg,spd,temp,vis,t_min,t_max,snow,rain,lat,lon
34_0_34C,8805,34,true,1585753563,353,2,279.14,14484,276.48,280.37,False,0,43.7050933,-79.3985671
34_0_34C,8805,34,true,1585753564,353,2,279.14,14484,276.48,280.37,False,0,43.7050933,-79.3985671
34_0_34C,8805,34,true,1585753594,216,0,279.14,14484,276.48,280.37,False,0,43.7050933,-79.3985671
34_0_34C,8805,34,true,1585753593,216,0,279.14,14484,276.48,280.37,False,0,43.7050933,-79.3985671
34_0_34C,8805,34,true,1585753624,216,0,279.14,14484,276.48,280.37,False,0,43.7050933,-79.3985671
34_0_34C,8805,34,true,1585753623,216,0,279.14,14484,276.48,280.37,False,0,43.7050933,-79.3985671
34_0_34C,8805,34,true,1585753653,216,0,279.14,14484,276.48,280.37,False,0,43.7050933,-79.3985671
34_0_34C,8805,34,true,1585753654,216,0,279.14,14484,276.48,280.37,False,0,43.7050933,-79.3985671
34_0_34C,8805,34,true,1585753683,216,0,279.14,14484,276.48,280.37,False,0,43.7050933,-79.3985671
34_0_34C,8805,34,true,1585753684,216,0,279.14,14484,276.48,280.37,False,0,43.7050933,-79.3985671
34_0_34C,8805,34,true,1585753714,216,0,279.14,14484,276.48,280.37,False,0,43.7050933,-79.3985671
34_0_34C,8805,34,true,1585753713,216,0,279.14,14484,276.48,280.37,False,0,43.7050933,-79.3985671
34_0_34C,8805,34,true,1585753744,216,0,279.14,14484,276.48,280.37,False,0,43.7050933,-79.3985671
34_0_34C,8805,34,true,1585753743,216,0,279.14,14484,276.48,280.37,False,0,43.7050933,-79.3985671
34_0_34C,8805,34,true,1585753773,216,0,279.14,14484,276.48,280.37,False,0,43.7050933,-79.3985671
34_0_34C,8805,34,true,1585753774,216,0,279.14,14484,276.48,280.37,False,0,43.7050933,-79.3985671
34_0_34C,8805,34,true,1585753804,216,0,279.14,14484,276.48,280.37,False,0,43.7050933,-79.3985671
34_0_34C,8805,34,true,1585753803,216,0,279.14,14484,276.48,280.37,False,0,43.7050933,-79.3985671
34_0_34C,8805,34,true,1585753834,216,0,279.14,14484,276.48,280.37,False,0,43.7050933,-79.3985671
34_0_34C,8805,34,true,1585753833,216,0,279.14,14484,276.48,280.37,False,0,43.7050933,-79.3985671
34_0_34C,8805,34,true,1585753863,216,0,279.14,14484,276.48,280.37,False,0,43.7050933,-79.3985671
34_0_34C,8805,34,true,1585753864,216,0,279.14,14484,276.48,280.37,False,0,43.7050933,-79.3985671
34_0_34C,8805,34,true,1585753893,216,0,279.14,14484,276.48,280.37,False,0,43.7050933,-79.3985671
34_0_34C,8805,34,true,1585753894,216,0,279.14,14484,276.48,280.37,False,0,43.7050933,-79.3985671
34_0_34C,8805,34,true,1585753924,327,11,279.14,14484,276.48,280.37,False,0,43.7050933,-79.3985671
34_0_34C,8805,34,true,1585753923,327,11,279.14,14484,276.48,280.37,False,0,43.7050933,-79.3985671
34_0_34C,8805,34,true,1585753984,76,0,279.2,14484,277.15,280.93,False,0,43.7058563,-79.4000854
34_0_34C,8805,34,true,1585753983,76,0,279.2,14484,277.15,280.93,False,0,43.7058563,-79.4000854
34_0_34C,8805,34,true,1585754013,75,4,279.2,14484,277.15,280.93,False,0,43.7065849,-79.3990707
34_0_34C,8805,34,true,1585754014,75,4,279.2,14484,277.15,280.93,False,0,43.7065849,-79.3990707
34_0_34C,8805,34,true,1585754044,74,4,279.2,14484,277.15,280.93,False,0,43.7065849,-79.3990707
34_0_34C,8805,34,true,1585754043,74,4,279.2,14484,277.15,280.93,False,0,43.7065849,-79.3990707
34_0_34C,8805,34,true,1585754074,75,15,279.2,14484,277.15,280.93,False,0,43.706974,-79.3971862
34_0_34C,8805,34,true,1585754073,75,15,279.2,14484,277.15,280.93,False,0,43.706974,-79.3971862
34_0_34C,8805,34,true,1585754104,76,0,279.2,14484,277.15,280.93,False,0,43.7071456,-79.39608
34_0_34C,8805,34,true,1585754103,76,0,279.2,14484,277.15,280.93,False,0,43.7071456,-79.39608
