dir,id,route,predable,time,hdg,spd,temp,vis,t_min,t_max,snow,rain,lat,lon
334_0_334*,8903,334,true,1585462668,336,4,278.79,14484,277.04,280.37,False,0,43.7062301,-79.4001083
334_0_334*,8903,334,true,1585462669,336,4,278.79,14484,277.04,280.37,False,0,43.7062301,-79.4001083
