dir,id,route,predable,time,hdg,spd,temp,vis,t_min,t_max,snow,rain,lat,lon
34_0_34C,8747,34,true,1585433899,177,24,280.24,14484,277.59,283.15,False,0,43.7299401,-79.3284924
34_0_34C,8747,34,true,1585433929,171,30,280.24,14484,277.59,283.15,False,0,43.7282947,-79.3283157
34_0_34C,8747,34,true,1585433928,171,30,280.24,14484,277.59,283.15,False,0,43.7282947,-79.3283157
34_0_34C,8747,34,true,1585433959,154,6,280.24,14484,277.59,283.15,False,0,43.7278184,-79.3281055
34_0_34C,8747,34,true,1585433958,154,6,280.24,14484,277.59,283.15,False,0,43.7278184,-79.3281055
34_0_34C,8747,34,true,1585433989,143,33,280.24,14484,277.59,283.15,False,0,43.7261199,-79.3273478
34_0_34C,8747,34,true,1585434019,149,31,280.18,14484,277.59,283.15,False,0,43.7246808,-79.3256301
34_0_34C,8747,34,true,1585434049,248,39,280.18,14484,277.59,283.15,False,0,43.7226858,-79.3266046
34_0_34C,8747,34,true,1585434079,163,34,280.18,14484,277.59,283.15,False,0,43.7199923,-79.3280248
34_0_34C,8747,34,true,1585434109,252,38,280.18,14484,277.59,283.15,False,0,43.7187874,-79.3297969
34_0_34C,8747,34,true,1585434139,156,31,280.18,14484,277.59,283.15,False,0,43.717608,-79.3310172
34_0_34C,8747,34,true,1585434169,158,0,280.21,14484,277.59,283.15,False,0,43.7164669,-79.3303241
34_0_34C,8747,34,true,1585434199,70,27,280.21,14484,277.59,283.15,False,0,43.715416,-79.3288412
34_0_34C,8747,34,true,1585434229,157,8,280.17,14484,277.59,283.15,False,0,43.7149097,-79.3276982
34_0_34C,8747,34,true,1585434259,157,0,280.17,14484,277.59,283.15,False,0,43.7149097,-79.3276982
34_0_34C,8747,34,true,1585434289,157,0,280.17,14484,277.59,283.15,False,0,43.7149097,-79.3276982
34_0_34C,8747,34,true,1585434319,157,0,280.17,14484,277.59,283.15,False,0,43.7149097,-79.3276982
34_0_34C,8747,34,true,1585434349,157,32,280.17,14484,277.59,283.15,False,0,43.7141593,-79.3272566
34_0_34C,8747,34,true,1585436840,168,0,279.78,14484,277.04,282.04,False,0,43.7045594,-79.3993079
34_0_34C,8747,34,true,1585436870,274,11,279.78,14484,277.04,282.04,False,0,43.7043059,-79.3985276
34_0_34C,8747,34,true,1585436900,107,18,279.78,14484,277.04,282.04,False,0,43.7046466,-79.3990066
34_0_34C,8747,34,true,1585436930,8,0,279.9,14484,277.04,282.04,False,0,43.7046233,-79.39877
34_0_34C,8747,34,true,1585436960,8,0,279.9,14484,277.04,282.04,False,0,43.7046233,-79.39877
34_0_34C,8747,34,true,1585436990,8,0,279.9,14484,277.04,282.04,False,0,43.7046233,-79.39877
34_0_34C,8747,34,true,1585436989,8,0,279.9,14484,277.04,282.04,False,0,43.7046233,-79.39877
34_0_34C,8747,34,true,1585437020,8,0,279.9,14484,277.04,282.04,False,0,43.7046233,-79.39877
34_0_34C,8747,34,true,1585437050,8,0,279.9,14484,277.04,282.04,False,0,43.7046233,-79.39877
34_0_34C,8747,34,true,1585437049,8,0,279.9,14484,277.04,282.04,False,0,43.7046233,-79.39877
34_0_34C,8747,34,true,1585437080,8,0,279.9,14484,277.04,282.04,False,0,43.7046233,-79.39877
34_0_34C,8747,34,true,1585437110,8,0,279.9,14484,277.04,282.04,False,0,43.7046233,-79.39877
34_0_34C,8747,34,true,1585437140,8,0,279.9,14484,277.04,282.04,False,0,43.7046233,-79.39877
34_0_34C,8747,34,true,1585437170,8,0,279.9,14484,277.04,282.04,False,0,43.7046233,-79.39877
34_0_34C,8747,34,true,1585437200,8,0,279.9,14484,277.04,282.04,False,0,43.7046233,-79.39877
34_0_34C,8747,34,true,1585437230,8,0,279.9,14484,277.04,282.04,False,0,43.7046233,-79.39877
34_0_34C,8747,34,true,1585437260,8,0,279.9,14484,277.04,282.04,False,0,43.7046233,-79.39877
34_0_34C,8747,34,true,1585437290,8,0,279.73,14484,277.04,282.04,False,0,43.7046233,-79.39877
34_0_34C,8747,34,true,1585437320,8,0,279.73,14484,277.04,282.04,False,0,43.7046233,-79.39877
34_0_34C,8747,34,true,1585437350,8,0,279.73,14484,277.04,282.04,False,0,43.7046233,-79.39877
34_0_34C,8747,34,true,1585437351,8,0,279.73,14484,277.04,282.04,False,0,43.7046233,-79.39877
34_0_34C,8747,34,true,1585437381,8,0,279.73,14484,277.04,282.04,False,0,43.7046233,-79.39877
34_0_34C,8747,34,true,1585437380,8,0,279.73,14484,277.04,282.04,False,0,43.7046233,-79.39877
34_0_34C,8747,34,true,1585437410,8,0,279.73,14484,277.04,282.04,False,0,43.7046233,-79.39877
34_0_34C,8747,34,true,1585437440,8,0,279.73,14484,277.04,282.04,False,0,43.7046233,-79.39877
34_0_34C,8747,34,true,1585437470,8,0,279.73,14484,277.04,282.04,False,0,43.7046233,-79.39877
34_0_34C,8747,34,true,1585437500,8,0,279.73,14484,277.04,282.04,False,0,43.7046233,-79.39877
34_0_34C,8747,34,true,1585437501,8,0,279.73,14484,277.04,282.04,False,0,43.7046233,-79.39877
34_0_34C,8747,34,true,1585437530,8,0,279.73,14484,277.04,282.04,False,0,43.7046233,-79.39877
34_0_34C,8747,34,true,1585437531,8,0,279.73,14484,277.04,282.04,False,0,43.7046233,-79.39877
34_0_34C,8747,34,true,1585437560,8,0,279.73,14484,277.04,282.04,False,0,43.7046233,-79.39877
34_0_34C,8747,34,true,1585437590,8,0,279.73,14484,277.04,282.04,False,0,43.7046233,-79.39877
34_0_34C,8747,34,true,1585437620,8,0,279.73,14484,277.04,282.04,False,0,43.7046233,-79.39877
34_0_34C,8747,34,true,1585437650,8,0,279.73,14484,277.04,282.04,False,0,43.7046233,-79.39877
34_0_34C,8747,34,true,1585437651,8,0,279.73,14484,277.04,282.04,False,0,43.7046233,-79.39877
34_0_34C,8747,34,true,1585437680,8,0,279.73,14484,277.04,282.04,False,0,43.7046233,-79.39877
34_0_34C,8747,34,true,1585437710,8,0,279.73,14484,277.04,282.04,False,0,43.7046233,-79.39877
34_0_34C,8747,34,true,1585437711,8,0,279.73,14484,277.04,282.04,False,0,43.7046233,-79.39877
34_0_34C,8747,34,true,1585437740,8,0,279.73,14484,277.04,282.04,False,0,43.7046233,-79.39877
34_0_34C,8747,34,true,1585437770,8,0,279.73,14484,277.04,282.04,False,0,43.7046233,-79.39877
34_0_34C,8747,34,true,1585437800,8,0,279.73,14484,277.04,282.04,False,0,43.7046233,-79.39877
34_0_34C,8747,34,true,1585437830,8,0,279.73,14484,277.04,282.04,False,0,43.7046233,-79.39877
34_0_34C,8747,34,true,1585437831,8,0,279.73,14484,277.04,282.04,False,0,43.7046233,-79.39877
34_0_34C,8747,34,true,1585437860,8,0,279.73,14484,277.04,282.04,False,0,43.7046233,-79.39877
34_0_34C,8747,34,true,1585437890,8,0,279.58,14484,277.04,281.48,False,0,43.7046233,-79.39877
34_0_34C,8747,34,true,1585437891,8,0,279.58,14484,277.04,281.48,False,0,43.7046233,-79.39877
34_0_34C,8747,34,true,1585437920,8,0,279.58,14484,277.04,281.48,False,0,43.7046233,-79.39877
34_0_34C,8747,34,true,1585437921,8,0,279.58,14484,277.04,281.48,False,0,43.7046233,-79.39877
34_0_34C,8747,34,true,1585437950,8,0,279.58,14484,277.04,281.48,False,0,43.7046233,-79.39877
34_0_34C,8747,34,true,1585437951,8,0,279.58,14484,277.04,281.48,False,0,43.7046233,-79.39877
34_0_34C,8747,34,true,1585437980,8,0,279.58,14484,277.04,281.48,False,0,43.7046233,-79.39877
34_0_34C,8747,34,true,1585438010,8,0,279.58,14484,277.04,281.48,False,0,43.7046233,-79.39877
34_0_34C,8747,34,true,1585438041,8,0,279.58,14484,277.04,281.48,False,0,43.7046233,-79.39877
34_0_34C,8747,34,true,1585438040,8,0,279.58,14484,277.04,281.48,False,0,43.7046233,-79.39877
34_0_34C,8747,34,true,1585438070,60,6,279.58,14484,277.04,281.48,False,0,43.7047615,-79.3984985
34_0_34C,8747,34,true,1585438071,60,6,279.58,14484,277.04,281.48,False,0,43.7047615,-79.3984985
34_0_34C,8747,34,true,1585438100,216,0,279.58,14484,277.04,281.48,False,0,43.7047615,-79.3984985
34_0_34C,8747,34,true,1585438130,281,16,279.65,14484,277.04,281.48,False,0,43.7054679,-79.3992954
34_0_34C,8747,34,true,1585438160,357,1,279.65,14484,277.04,281.48,False,0,43.7062301,-79.4001083
34_0_34C,8747,34,true,1585438161,357,1,279.65,14484,277.04,281.48,False,0,43.7062301,-79.4001083
