dir,id,route,predable,time,hdg,spd,temp,vis,t_min,t_max,snow,rain,lat,lon
34_0_34C,8715,34,true,1585753563,66,0,279.25,14484,277.15,280.37,False,0,43.7272796,-79.3280029
34_0_34C,8715,34,true,1585753564,66,0,279.25,14484,277.15,280.37,False,0,43.7272796,-79.3280029
34_0_34C,8715,34,true,1585753593,338,0,279.25,14484,277.15,280.37,False,0,43.7281417,-79.3281631
34_0_34C,8715,34,true,1585753594,338,0,279.25,14484,277.15,280.37,False,0,43.7281417,-79.3281631
34_0_34C,8715,34,true,1585753624,356,18,279.25,14484,277.15,280.37,False,0,43.7282432,-79.3282082
34_0_34C,8715,34,true,1585753623,356,18,279.25,14484,277.15,280.37,False,0,43.7282432,-79.3282082
34_0_34C,8715,34,true,1585753653,357,0,279.25,14484,277.15,280.37,False,0,43.7285231,-79.3283189
34_0_34C,8715,34,true,1585753654,357,0,279.25,14484,277.15,280.37,False,0,43.7285231,-79.3283189
34_0_34C,8715,34,true,1585753683,357,0,279.25,14484,277.15,280.37,False,0,43.7285231,-79.3283189
34_0_34C,8715,34,true,1585753684,357,0,279.25,14484,277.15,280.37,False,0,43.7285231,-79.3283189
34_0_34C,8715,34,true,1585753714,357,0,279.25,14484,277.15,280.37,False,0,43.7285231,-79.3283189
34_0_34C,8715,34,true,1585753713,357,0,279.25,14484,277.15,280.37,False,0,43.7285231,-79.3283189
34_0_34C,8715,34,true,1585753744,357,0,279.25,14484,277.15,280.37,False,0,43.7285231,-79.3283189
34_0_34C,8715,34,true,1585753743,357,0,279.25,14484,277.15,280.37,False,0,43.7285231,-79.3283189
34_0_34C,8715,34,true,1585753773,357,0,279.25,14484,277.15,280.37,False,0,43.7285231,-79.3283189
34_0_34C,8715,34,true,1585753774,357,0,279.25,14484,277.15,280.37,False,0,43.7285231,-79.3283189
34_0_34C,8715,34,true,1585753804,357,0,279.25,14484,277.15,280.37,False,0,43.7285231,-79.3283189
34_0_34C,8715,34,true,1585753803,357,0,279.25,14484,277.15,280.37,False,0,43.7285231,-79.3283189
34_0_34C,8715,34,true,1585753834,357,0,279.25,14484,277.15,280.37,False,0,43.7285231,-79.3283189
34_0_34C,8715,34,true,1585753833,357,0,279.25,14484,277.15,280.37,False,0,43.7285231,-79.3283189
34_0_34C,8715,34,true,1585753863,357,0,279.25,14484,277.15,280.37,False,0,43.7285231,-79.3283189
34_0_34C,8715,34,true,1585753864,357,0,279.25,14484,277.15,280.37,False,0,43.7285231,-79.3283189
34_0_34C,8715,34,true,1585753893,357,0,279.25,14484,277.15,280.37,False,0,43.7285231,-79.3283189
34_0_34C,8715,34,true,1585753894,357,0,279.25,14484,277.15,280.37,False,0,43.7285231,-79.3283189
34_0_34C,8715,34,true,1585753924,357,0,279.25,14484,277.15,280.37,False,0,43.7285231,-79.3283189
34_0_34C,8715,34,true,1585753923,357,0,279.25,14484,277.15,280.37,False,0,43.7285231,-79.3283189
34_0_34C,8715,34,true,1585753953,357,0,279.25,14484,277.15,280.37,False,0,43.7285231,-79.3283189
34_0_34C,8715,34,true,1585753954,357,0,279.25,14484,277.15,280.37,False,0,43.7285231,-79.3283189
