dir,id,route,predable,time,hdg,spd,temp,vis,t_min,t_max,snow,rain,lat,lon
34_0_34A,8943,34,true,1585433570,74,11,280.21,14484,277.59,283.15,False,0,43.7254981,-79.2981033
34_0_34A,8943,34,true,1585433569,74,11,280.21,14484,277.59,283.15,False,0,43.7254981,-79.2981033
34_0_34A,8943,34,true,1585433599,76,0,280.21,14484,277.59,283.15,False,0,43.7254981,-79.2981033
34_0_34A,8943,34,true,1585433600,76,0,280.21,14484,277.59,283.15,False,0,43.7254981,-79.2981033
34_0_34A,8943,34,true,1585433629,73,27,280.21,14484,277.59,283.15,False,0,43.725811,-79.2962341
34_0_34A,8943,34,true,1585433630,73,27,280.21,14484,277.59,283.15,False,0,43.725811,-79.2962341
34_0_34A,8943,34,true,1585433659,74,28,280.21,14484,277.59,283.15,False,0,43.7265205,-79.2932434
34_0_34A,8943,34,true,1585433660,74,28,280.21,14484,277.59,283.15,False,0,43.7265205,-79.2932434
34_0_34A,8943,34,true,1585433689,73,4,280.21,14484,277.59,283.15,False,0,43.727024,-79.2907333
34_0_34A,8943,34,true,1585433690,73,4,280.21,14484,277.59,283.15,False,0,43.727024,-79.2907333
34_0_34A,8943,34,true,1585433719,73,0,280.21,14484,277.59,283.15,False,0,43.727024,-79.2907333
34_0_34A,8943,34,true,1585433720,73,0,280.21,14484,277.59,283.15,False,0,43.727024,-79.2907333
34_0_34A,8943,34,true,1585433750,73,0,280.21,14484,277.59,283.15,False,0,43.727024,-79.2907333
34_0_34A,8943,34,true,1585433749,73,0,280.21,14484,277.59,283.15,False,0,43.727024,-79.2907333
34_0_34A,8943,34,true,1585433780,73,0,280.21,14484,277.59,283.15,False,0,43.727024,-79.2907333
34_0_34A,8943,34,true,1585433779,73,0,280.21,14484,277.59,283.15,False,0,43.727024,-79.2907333
34_0_34A,8943,34,true,1585433809,73,0,280.21,14484,277.59,283.15,False,0,43.727024,-79.2907333
34_0_34A,8943,34,true,1585433810,73,0,280.21,14484,277.59,283.15,False,0,43.727024,-79.2907333
34_0_34A,8943,34,true,1585433839,73,0,280.21,14484,277.59,283.15,False,0,43.727024,-79.2907333
34_0_34A,8943,34,true,1585433840,73,0,280.21,14484,277.59,283.15,False,0,43.727024,-79.2907333
34_0_34A,8943,34,true,1585433869,73,0,280.21,14484,277.59,283.15,False,0,43.727024,-79.2907333
34_0_34A,8943,34,true,1585433870,73,0,280.21,14484,277.59,283.15,False,0,43.727024,-79.2907333
34_0_34A,8943,34,true,1585433899,73,0,280.21,14484,277.59,283.15,False,0,43.727024,-79.2907333
34_0_34A,8943,34,true,1585433900,73,0,280.21,14484,277.59,283.15,False,0,43.727024,-79.2907333
34_0_34A,8943,34,true,1585433930,73,0,280.21,14484,277.59,283.15,False,0,43.727024,-79.2907333
34_0_34A,8943,34,true,1585433929,73,0,280.21,14484,277.59,283.15,False,0,43.727024,-79.2907333
34_0_34A,8943,34,true,1585433959,72,26,280.21,14484,277.59,283.15,False,0,43.7274017,-79.2894363
34_0_34A,8943,34,true,1585433960,72,26,280.21,14484,277.59,283.15,False,0,43.7274017,-79.2894363
34_0_34A,8943,34,true,1585433990,73,0,280.21,14484,277.59,283.15,False,0,43.7275466,-79.2884597
34_0_34A,8943,34,true,1585433989,73,0,280.21,14484,277.59,283.15,False,0,43.7275466,-79.2884597
34_0_34A,8943,34,true,1585434019,73,7,280.21,14484,277.59,283.15,False,0,43.7276153,-79.2879714
34_0_34A,8943,34,true,1585434020,73,7,280.21,14484,277.59,283.15,False,0,43.7276153,-79.2879714
34_0_34A,8943,34,true,1585434049,73,23,280.21,14484,277.59,283.15,False,0,43.7281074,-79.2864151
34_0_34A,8943,34,true,1585434050,73,23,280.21,14484,277.59,283.15,False,0,43.7281074,-79.2864151
34_0_34A,8943,34,true,1585434080,72,24,280.21,14484,277.59,283.15,False,0,43.7286453,-79.2835998
34_0_34A,8943,34,true,1585434079,72,24,280.21,14484,277.59,283.15,False,0,43.7286453,-79.2835998
34_0_34A,8943,34,true,1585434109,73,20,280.21,14484,277.59,283.15,False,0,43.7291984,-79.2814636
34_0_34A,8943,34,true,1585434110,73,20,280.21,14484,277.59,283.15,False,0,43.7291984,-79.2814636
34_0_34A,8943,34,true,1585434139,72,22,280.21,14484,277.59,283.15,False,0,43.729618,-79.2795257
34_0_34A,8943,34,true,1585434140,72,22,280.21,14484,277.59,283.15,False,0,43.729618,-79.2795257
34_0_34A,8943,34,true,1585434170,73,0,280.21,14484,277.59,283.15,False,0,43.729763,-79.2781372
34_0_34A,8943,34,true,1585434169,73,0,280.21,14484,277.59,283.15,False,0,43.729763,-79.2781372
34_0_34A,8943,34,true,1585434200,73,0,280.21,14484,277.59,283.15,False,0,43.729763,-79.2781372
34_0_34A,8943,34,true,1585434199,73,0,280.21,14484,277.59,283.15,False,0,43.729763,-79.2781372
34_0_34A,8943,34,true,1585434229,73,0,280.21,14484,277.59,283.15,False,0,43.729763,-79.2781372
34_0_34A,8943,34,true,1585434230,73,0,280.21,14484,277.59,283.15,False,0,43.729763,-79.2781372
34_0_34A,8943,34,true,1585434260,73,8,280.21,14484,277.59,283.15,False,0,43.7303657,-79.2759475
34_0_34A,8943,34,true,1585434259,73,8,280.21,14484,277.59,283.15,False,0,43.7303657,-79.2759475
34_0_34A,8943,34,true,1585434289,73,0,280.21,14484,277.59,283.15,False,0,43.7303657,-79.2759475
34_0_34A,8943,34,true,1585434290,73,0,280.21,14484,277.59,283.15,False,0,43.7303657,-79.2759475
34_0_34A,8943,34,true,1585434320,73,17,280.24,14484,277.59,283.15,False,0,43.7306861,-79.2745208
34_0_34A,8943,34,true,1585434319,73,17,280.24,14484,277.59,283.15,False,0,43.7306861,-79.2745208
34_0_34A,8943,34,true,1585434349,72,23,280.24,14484,277.59,283.15,False,0,43.7312622,-79.2717132
34_0_34A,8943,34,true,1585434350,72,23,280.24,14484,277.59,283.15,False,0,43.7312622,-79.2717132
34_0_34A,8943,34,true,1585434379,73,0,280.24,14484,277.59,283.15,False,0,43.7312736,-79.2712783
34_0_34A,8943,34,true,1585434380,73,0,280.24,14484,277.59,283.15,False,0,43.7312736,-79.2712783
34_0_34A,8943,34,true,1585434409,73,0,280.24,14484,277.59,283.15,False,0,43.7312736,-79.2712783
34_0_34A,8943,34,true,1585434410,73,0,280.24,14484,277.59,283.15,False,0,43.7312736,-79.2712783
34_0_34A,8943,34,true,1585434439,75,22,280.24,14484,277.59,283.15,False,0,43.7319412,-79.2686157
34_0_34A,8943,34,true,1585434440,75,22,280.24,14484,277.59,283.15,False,0,43.7319412,-79.2686157
34_0_34A,8943,34,true,1585434469,72,0,280.24,14484,277.59,283.15,False,0,43.7320098,-79.2682037
34_0_34A,8943,34,true,1585434470,72,0,280.24,14484,277.59,283.15,False,0,43.7320098,-79.2682037
34_0_34A,8943,34,true,1585434500,67,3,280.24,14484,277.59,283.15,False,0,43.7320098,-79.2682037
34_0_34A,8943,34,true,1585434499,67,3,280.24,14484,277.59,283.15,False,0,43.7320098,-79.2682037
34_0_34A,8943,34,true,1585434530,72,0,280.24,14484,277.59,283.15,False,0,43.7320098,-79.2682037
34_0_34A,8943,34,true,1585434560,111,22,280.24,14484,277.59,283.15,False,0,43.7323875,-79.2666015
34_0_34A,8943,34,true,1585434559,111,22,280.24,14484,277.59,283.15,False,0,43.7323875,-79.2666015
34_0_34A,8943,34,true,1585434589,62,10,280.18,14484,277.59,282.59,False,0,43.7327232,-79.2647323
34_0_34A,8943,34,true,1585434590,62,10,280.18,14484,277.59,282.59,False,0,43.7327232,-79.2647323
34_0_34A,8943,34,true,1585434619,74,0,280.18,14484,277.59,282.59,False,0,43.7327232,-79.2647323
34_0_34A,8943,34,true,1585434620,74,0,280.18,14484,277.59,282.59,False,0,43.7327232,-79.2647323
34_0_34A,8943,34,true,1585434650,75,3,280.18,14484,277.59,282.59,False,0,43.7329254,-79.263832
34_0_34A,8943,34,true,1585434649,75,3,280.18,14484,277.59,282.59,False,0,43.7329254,-79.263832
34_0_34A,8943,34,true,1585434680,72,0,280.18,14484,277.59,282.59,False,0,43.7329254,-79.263832
34_0_34A,8943,34,true,1585434679,72,0,280.18,14484,277.59,282.59,False,0,43.7329254,-79.263832
34_0_34A,8943,34,true,1585434710,72,0,280.18,14484,277.59,282.59,False,0,43.7329254,-79.263832
34_0_34A,8943,34,true,1585434740,72,0,280.18,14484,277.59,282.59,False,0,43.7329254,-79.263832
34_0_34A,8943,34,true,1585434739,72,0,280.18,14484,277.59,282.59,False,0,43.7329254,-79.263832
