dir,id,route,predable,time,hdg,spd,temp,vis,t_min,t_max,snow,rain,lat,lon
34_1_34C,8648,34,true,1585442302,247,38,279.19,14484,277.59,280.93,False,0,43.721615,-79.3357666
34_1_34C,8648,34,true,1585442301,247,38,279.19,14484,277.59,280.93,False,0,43.721615,-79.3357666
34_1_34C,8648,34,true,1585442332,259,0,279.19,14484,277.59,280.93,False,0,43.7208683,-79.3385283
34_1_34C,8648,34,true,1585442331,259,0,279.19,14484,277.59,280.93,False,0,43.7208683,-79.3385283
34_1_34C,8648,34,true,1585442362,246,34,279.19,14484,277.59,280.93,False,0,43.7204716,-79.3396716
34_1_34C,8648,34,true,1585442361,246,34,279.19,14484,277.59,280.93,False,0,43.7204716,-79.3396716
34_1_34C,8648,34,true,1585442391,243,41,279.02,14484,277.59,280.37,False,0,43.719385,-79.3428816
34_1_34C,8648,34,true,1585442392,243,41,279.02,14484,277.59,280.37,False,0,43.719385,-79.3428816
34_1_34C,8648,34,true,1585442421,246,41,279.01,14484,277.59,280.37,False,0,43.7179216,-79.3473783
34_1_34C,8648,34,true,1585442422,246,41,279.01,14484,277.59,280.37,False,0,43.7179216,-79.3473783
34_1_34C,8648,34,true,1585442452,239,42,279.01,14484,277.59,280.37,False,0,43.7165483,-79.351735
34_1_34C,8648,34,true,1585442451,239,42,279.01,14484,277.59,280.37,False,0,43.7165483,-79.351735
34_1_34C,8648,34,true,1585442482,266,33,279.06,14484,277.59,280.37,False,0,43.7155016,-79.355775
34_1_34C,8648,34,true,1585442511,253,41,278.94,14484,277.59,279.82,False,0,43.7145866,-79.36006
34_1_34C,8648,34,true,1585442512,253,41,278.94,14484,277.59,279.82,False,0,43.7145866,-79.36006
34_1_34C,8648,34,true,1585442542,254,21,278.94,14484,277.59,279.82,False,0,43.713755,-79.3641116
34_1_34C,8648,34,true,1585442572,254,0,278.94,14484,277.59,279.82,False,0,43.7136816,-79.364485
34_1_34C,8648,34,true,1585442571,254,0,278.94,14484,277.59,279.82,False,0,43.7136816,-79.364485
34_1_34C,8648,34,true,1585442601,253,37,279.05,14484,277.59,280.37,False,0,43.7129383,-79.36811
34_1_34C,8648,34,true,1585442602,253,37,279.05,14484,277.59,280.37,False,0,43.7129383,-79.36811
34_1_34C,8648,34,true,1585442632,255,36,279.05,14484,277.59,280.37,False,0,43.7121333,-79.3720483
34_1_34C,8648,34,true,1585442631,255,36,279.05,14484,277.59,280.37,False,0,43.7121333,-79.3720483
34_1_34C,8648,34,true,1585442662,247,26,279.05,14484,277.59,280.37,False,0,43.71132,-79.3759283
34_1_34C,8648,34,true,1585442661,247,26,279.05,14484,277.59,280.37,False,0,43.71132,-79.3759283
34_1_34C,8648,34,true,1585442692,255,0,279.05,14484,277.59,280.37,False,0,43.7111466,-79.3764766
34_1_34C,8648,34,true,1585442722,255,0,279.05,14484,277.59,280.37,False,0,43.711135,-79.3765066
34_1_34C,8648,34,true,1585442721,255,0,279.05,14484,277.59,280.37,False,0,43.711135,-79.3765066
34_1_34C,8648,34,true,1585442751,253,23,279.05,14484,277.59,280.37,False,0,43.7110066,-79.377095
34_1_34C,8648,34,true,1585442752,253,23,279.05,14484,277.59,280.37,False,0,43.7110066,-79.377095
34_1_34C,8648,34,true,1585442781,253,40,279.05,14484,277.59,280.37,False,0,43.71034,-79.3807166
34_1_34C,8648,34,true,1585442782,253,40,279.05,14484,277.59,280.37,False,0,43.71034,-79.3807166
34_1_34C,8648,34,true,1585442812,254,40,278.94,14484,277.59,279.82,False,0,43.70946,-79.385075
34_1_34C,8648,34,true,1585442811,254,40,278.94,14484,277.59,279.82,False,0,43.70946,-79.385075
34_1_34C,8648,34,true,1585442841,245,19,278.94,14484,277.59,279.82,False,0,43.70875,-79.3887633
34_1_34C,8648,34,true,1585442842,245,19,278.94,14484,277.59,279.82,False,0,43.70875,-79.3887633
34_1_34C,8648,34,true,1585442872,254,0,278.94,14484,277.59,279.82,False,0,43.7084116,-79.3898383
34_1_34C,8648,34,true,1585442902,254,0,278.94,14484,277.59,279.82,False,0,43.7084116,-79.3898383
34_1_34C,8648,34,true,1585442901,254,0,278.94,14484,277.59,279.82,False,0,43.7084116,-79.3898383
34_1_34C,8648,34,true,1585442932,254,22,278.94,14484,277.59,279.82,False,0,43.70821,-79.3907933
34_1_34C,8648,34,true,1585442931,254,22,278.94,14484,277.59,279.82,False,0,43.70821,-79.3907933
34_1_34C,8648,34,true,1585442962,254,0,278.94,14484,277.59,279.82,False,0,43.7079166,-79.39251
34_1_34C,8648,34,true,1585442961,254,0,278.94,14484,277.59,279.82,False,0,43.7079166,-79.39251
34_1_34C,8648,34,true,1585442992,254,31,278.94,14484,277.59,279.82,False,0,43.7077633,-79.3932533
34_1_34C,8648,34,true,1585443022,253,25,279.05,14484,277.59,280.37,False,0,43.7070733,-79.3964066
34_1_34C,8648,34,true,1585443021,253,25,279.05,14484,277.59,280.37,False,0,43.7070733,-79.3964066
34_1_34C,8648,34,true,1585443051,253,0,279.02,14484,277.59,280.37,False,0,43.7068416,-79.3977516
34_1_34C,8648,34,true,1585443052,253,0,279.02,14484,277.59,280.37,False,0,43.7068416,-79.3977516
34_1_34C,8648,34,true,1585443081,257,11,279.02,14484,277.59,280.37,False,0,43.7065033,-79.399815
34_1_34C,8648,34,true,1585443082,257,11,279.02,14484,277.59,280.37,False,0,43.7065033,-79.399815
34_1_34C,8648,34,true,1585443112,102,13,279.02,14484,277.59,280.37,False,0,43.7062301,-79.4001083
34_1_34C,8648,34,true,1585443111,102,13,279.02,14484,277.59,280.37,False,0,43.7062301,-79.4001083
34_1_34C,8648,34,true,1585443142,173,0,279.02,14484,277.59,280.37,False,0,43.7051666,-79.3993133
34_1_34C,8648,34,true,1585443141,173,0,279.02,14484,277.59,280.37,False,0,43.7051666,-79.3993133
34_1_34C,8648,34,true,1585443172,173,0,279.02,14484,277.59,280.37,False,0,43.7052383,-79.3993716
34_1_34C,8648,34,true,1585443171,173,0,279.02,14484,277.59,280.37,False,0,43.7052383,-79.3993716
34_1_34C,8648,34,true,1585443202,173,0,279.02,14484,277.59,280.37,False,0,43.7052383,-79.3993716
34_1_34C,8648,34,true,1585443201,173,0,279.02,14484,277.59,280.37,False,0,43.7052383,-79.3993716
34_1_34C,8648,34,true,1585443232,173,0,279.02,14484,277.59,280.37,False,0,43.7052383,-79.3993716
34_1_34C,8648,34,true,1585443231,173,0,279.02,14484,277.59,280.37,False,0,43.7052383,-79.3993716
34_1_34C,8648,34,true,1585443261,173,0,279.02,14484,277.59,280.37,False,0,43.7052383,-79.3993716
34_1_34C,8648,34,true,1585443262,173,0,279.02,14484,277.59,280.37,False,0,43.7052383,-79.3993716
34_1_34C,8648,34,true,1585443292,173,0,279.02,14484,277.59,280.37,False,0,43.7052383,-79.3993716
34_1_34C,8648,34,true,1585443291,173,0,279.02,14484,277.59,280.37,False,0,43.7052383,-79.3993716
34_1_34C,8648,34,true,1585443322,173,0,279.02,14484,277.59,280.37,False,0,43.7052383,-79.3993716
34_1_34C,8648,34,true,1585443321,173,0,279.02,14484,277.59,280.37,False,0,43.7052383,-79.3993716
34_1_34C,8648,34,true,1585443351,173,0,279.02,14484,277.59,280.37,False,0,43.7052383,-79.3993716
34_1_34C,8648,34,true,1585443352,173,0,279.02,14484,277.59,280.37,False,0,43.7052383,-79.3993716
34_1_34C,8648,34,true,1585443382,173,0,279.02,14484,277.59,280.37,False,0,43.7052154,-79.3994445
34_1_34C,8648,34,true,1585443412,173,0,279.02,14484,277.59,280.37,False,0,43.7052154,-79.3994445
34_1_34C,8648,34,true,1585443411,173,0,279.02,14484,277.59,280.37,False,0,43.7052154,-79.3994445
34_1_34C,8648,34,true,1585443442,173,0,279.02,14484,277.59,280.37,False,0,43.7052154,-79.3994445
34_1_34C,8648,34,true,1585443441,173,0,279.02,14484,277.59,280.37,False,0,43.7052154,-79.3994445
34_1_34C,8648,34,true,1585443472,173,0,279.02,14484,277.59,280.37,False,0,43.7052154,-79.3994445
34_1_34C,8648,34,true,1585443502,173,0,279.02,14484,277.59,280.37,False,0,43.7052154,-79.3994445
34_1_34C,8648,34,true,1585444132,253,0,279,14484,277.59,280.37,False,0,43.7048568,-79.3993835
34_1_34C,8648,34,true,1585444162,114,0,278.99,14484,277.59,280.37,False,0,43.7055282,-79.39962
34_1_34C,8648,34,true,1585444192,173,0,278.99,14484,277.59,280.37,False,0,43.7050361,-79.399414
34_1_34C,8648,34,true,1585444222,173,0,278.99,14484,277.59,280.37,False,0,43.7055511,-79.3996887
34_1_34C,8648,34,true,1585444252,173,0,279.01,14484,277.59,280.37,False,0,43.705677,-79.4000701
34_1_34C,8648,34,true,1585444283,173,0,279.01,14484,277.59,280.37,False,0,43.705677,-79.4000701
34_1_34C,8648,34,true,1585444282,173,0,279.01,14484,277.59,280.37,False,0,43.705677,-79.4000701
34_1_34C,8648,34,true,1585444312,173,0,279.01,14484,277.59,280.37,False,0,43.705101,-79.3986587
34_1_34C,8648,34,true,1585444313,173,0,279.01,14484,277.59,280.37,False,0,43.705101,-79.3986587
34_1_34C,8648,34,true,1585444342,173,0,279.01,14484,277.59,280.37,False,0,43.705101,-79.3986587
34_1_34C,8648,34,true,1585444343,173,0,279.01,14484,277.59,280.37,False,0,43.705101,-79.3986587
34_1_34C,8648,34,true,1585444373,173,0,279.01,14484,277.59,280.37,False,0,43.705101,-79.3986587
34_1_34C,8648,34,true,1585444372,173,0,279.01,14484,277.59,280.37,False,0,43.705101,-79.3986587
34_1_34C,8648,34,true,1585444402,173,0,279.01,14484,277.59,280.37,False,0,43.7054786,-79.3994674
34_1_34C,8648,34,true,1585444433,173,0,279.01,14484,277.59,280.37,False,0,43.705677,-79.4000701
34_1_34C,8648,34,true,1585444432,173,0,279.01,14484,277.59,280.37,False,0,43.705677,-79.4000701
34_1_34C,8648,34,true,1585444493,168,14,279,14484,277.59,280.37,False,0,43.7048766,-79.3993316
34_1_34C,8648,34,true,1585446864,354,32,278.86,14484,277.59,279.82,False,0,43.7132759,-79.3243179
34_1_34C,8648,34,true,1585446894,347,29,278.86,14484,277.59,279.82,False,0,43.7158775,-79.3248138
34_1_34C,8648,34,true,1585446893,347,29,278.86,14484,277.59,279.82,False,0,43.7158775,-79.3248138
34_1_34C,8648,34,true,1585446924,325,32,278.86,14484,277.59,279.82,False,0,43.7180252,-79.3268127
34_1_34C,8648,34,true,1585446923,325,32,278.86,14484,277.59,279.82,False,0,43.7180252,-79.3268127
34_1_34C,8648,34,true,1585446954,343,26,278.86,14484,277.59,279.82,False,0,43.719738,-79.3278808
34_1_34C,8648,34,true,1585446953,343,26,278.86,14484,277.59,279.82,False,0,43.719738,-79.3278808
34_1_34C,8648,34,true,1585446984,31,33,278.86,14484,277.59,279.82,False,0,43.7221641,-79.3274688
34_1_34C,8648,34,true,1585446983,31,33,278.86,14484,277.59,279.82,False,0,43.7221641,-79.3274688
34_1_34C,8648,34,true,1585447014,30,26,278.86,14484,277.59,279.82,False,0,43.7232627,-79.3245925
34_1_34C,8648,34,true,1585447013,30,26,278.86,14484,277.59,279.82,False,0,43.7232627,-79.3245925
34_1_34C,8648,34,true,1585447044,318,32,278.91,14484,278.15,279.82,False,0,43.7253265,-79.3261566
34_1_34C,8648,34,true,1585447043,318,32,278.91,14484,278.15,279.82,False,0,43.7253265,-79.3261566
34_1_34C,8648,34,true,1585447074,328,32,278.91,14484,278.15,279.82,False,0,43.7277565,-79.3280181
34_1_34C,8648,34,true,1585447073,328,32,278.91,14484,278.15,279.82,False,0,43.7277565,-79.3280181
34_1_34C,8648,34,true,1585447103,0,23,278.91,14484,278.15,279.82,False,0,43.7295265,-79.3283996
34_1_34C,8648,34,true,1585447104,0,23,278.91,14484,278.15,279.82,False,0,43.7295265,-79.3283996
34_1_34C,8648,34,true,1585447134,177,22,278.91,14484,278.15,279.82,False,0,43.729721,-79.3284149
34_1_34C,8648,34,true,1585447164,357,0,278.91,14484,278.15,279.82,False,0,43.7284927,-79.3283233
34_1_34C,8648,34,true,1585447163,357,0,278.91,14484,278.15,279.82,False,0,43.7284927,-79.3283233
34_1_34C,8648,34,true,1585447196,155,15,278.91,14484,278.15,279.82,False,0,43.7276496,-79.3279418
34_1_34C,8648,34,true,1585447195,155,15,278.91,14484,278.15,279.82,False,0,43.7276496,-79.3279418
34_1_34C,8648,34,true,1585447224,254,30,278.91,14484,278.15,279.82,False,0,43.7268295,-79.3301467
34_1_34C,8648,34,true,1585447223,254,30,278.91,14484,278.15,279.82,False,0,43.7268295,-79.3301467
34_1_34C,8648,34,true,1585447254,208,36,278.91,14484,278.15,279.82,False,0,43.7254714,-79.3335494
34_1_34C,8648,34,true,1585447253,208,36,278.91,14484,278.15,279.82,False,0,43.7254714,-79.3335494
34_1_34C,8648,34,true,1585447284,257,25,278.86,14484,277.59,279.82,False,0,43.7235412,-79.33609
34_1_34C,8648,34,true,1585447314,165,12,278.86,14484,277.59,279.82,False,0,43.7217254,-79.3367767
34_1_34C,8648,34,true,1585447344,253,24,278.86,14484,277.59,279.82,False,0,43.7210311,-79.3371124
34_1_34C,8648,34,true,1585447343,253,24,278.86,14484,277.59,279.82,False,0,43.7210311,-79.3371124
34_1_34C,8648,34,true,1585447374,251,5,278.86,14484,277.59,279.82,False,0,43.7207489,-79.3380279
34_1_34C,8648,34,true,1585447373,251,5,278.86,14484,277.59,279.82,False,0,43.7207489,-79.3380279
34_1_34C,8648,34,true,1585447404,247,28,278.86,14484,277.59,279.82,False,0,43.7203674,-79.3392868
34_1_34C,8648,34,true,1585447403,247,28,278.86,14484,277.59,279.82,False,0,43.7203674,-79.3392868
34_1_34C,8648,34,true,1585447434,245,29,278.86,14484,277.59,279.82,False,0,43.7197227,-79.3412704
34_1_34C,8648,34,true,1585447464,246,31,278.86,14484,277.59,279.82,False,0,43.7187461,-79.3444366
34_1_34C,8648,34,true,1585447463,246,31,278.86,14484,277.59,279.82,False,0,43.7187461,-79.3444366
34_1_34C,8648,34,true,1585447494,248,29,278.85,14484,277.59,279.82,False,0,43.7176246,-79.348114
34_1_34C,8648,34,true,1585447526,248,0,278.85,14484,277.59,279.82,False,0,43.7172889,-79.3492736
34_1_34C,8648,34,true,1585447554,246,32,278.85,14484,277.59,279.82,False,0,43.7168388,-79.3506622
34_1_34C,8648,34,true,1585447553,246,32,278.85,14484,277.59,279.82,False,0,43.7168388,-79.3506622
34_1_34C,8648,34,true,1585447584,248,26,278.85,14484,277.59,279.82,False,0,43.7160873,-79.3530731
34_1_34C,8648,34,true,1585447583,248,26,278.85,14484,277.59,279.82,False,0,43.7160873,-79.3530731
34_1_34C,8648,34,true,1585447614,257,32,278.85,14484,277.59,279.82,False,0,43.7153396,-79.3563842
34_1_34C,8648,34,true,1585447613,257,32,278.85,14484,277.59,279.82,False,0,43.7153396,-79.3563842
34_1_34C,8648,34,true,1585447644,250,11,278.83,14484,277.59,279.82,False,0,43.7147445,-79.3591766
34_1_34C,8648,34,true,1585447674,251,13,278.83,14484,277.59,279.82,False,0,43.7146339,-79.3596496
34_1_34C,8648,34,true,1585447704,253,23,278.83,14484,277.59,279.82,False,0,43.7139854,-79.3627624
34_1_34C,8648,34,true,1585447703,253,23,278.83,14484,277.59,279.82,False,0,43.7139854,-79.3627624
34_1_34C,8648,34,true,1585447734,255,4,278.83,14484,277.59,279.82,False,0,43.7136344,-79.3644332
34_1_34C,8648,34,true,1585447733,255,4,278.83,14484,277.59,279.82,False,0,43.7136344,-79.3644332
34_1_34C,8648,34,true,1585447764,254,0,278.83,14484,277.59,279.82,False,0,43.7136344,-79.3644332
34_1_34C,8648,34,true,1585447794,256,31,278.8,14484,277.59,279.82,False,0,43.7134284,-79.365921
34_1_34C,8648,34,true,1585447824,253,25,278.8,14484,277.59,279.82,False,0,43.713047,-79.3674163
34_1_34C,8648,34,true,1585447854,254,34,278.8,14484,277.59,279.82,False,0,43.7122802,-79.3713455
34_1_34C,8648,34,true,1585447884,253,32,278.82,14484,277.59,279.82,False,0,43.7115745,-79.3750915
34_1_34C,8648,34,true,1585447914,255,0,278.78,14484,277.59,279.82,False,0,43.7112503,-79.3767776
34_1_34C,8648,34,true,1585447944,255,0,278.78,14484,277.59,279.82,False,0,43.7112503,-79.3767776
34_1_34C,8648,34,true,1585447974,254,37,278.78,14484,277.59,279.82,False,0,43.7105369,-79.3795394
34_1_34C,8648,34,true,1585448004,254,40,278.78,14484,277.59,279.82,False,0,43.7096672,-79.3840713
34_1_34C,8648,34,true,1585448003,254,40,278.78,14484,277.59,279.82,False,0,43.7096672,-79.3840713
34_1_34C,8648,34,true,1585448034,255,30,278.8,14484,277.59,279.82,False,0,43.7088546,-79.3878784
34_1_34C,8648,34,true,1585448064,254,0,278.8,14484,277.59,279.82,False,0,43.7084732,-79.389801
34_1_34C,8648,34,true,1585448061,254,0,278.8,14484,277.59,279.82,False,0,43.7084732,-79.389801
34_1_34C,8648,34,true,1585448091,256,33,278.8,14484,277.59,279.82,False,0,43.7080383,-79.3922271
34_1_34C,8648,34,true,1585448121,252,29,278.8,14484,277.59,279.82,False,0,43.7078285,-79.3930019
34_1_34C,8648,34,true,1585448151,254,0,278.8,14484,277.59,279.82,False,0,43.7075057,-79.3948776
34_1_34C,8648,34,true,1585448181,252,23,278.77,14484,277.59,279.82,False,0,43.7071635,-79.3962638
34_1_34C,8648,34,true,1585448182,252,23,278.77,14484,277.59,279.82,False,0,43.7071635,-79.3962638
34_1_34C,8648,34,true,1585448211,253,0,278.77,14484,277.59,279.82,False,0,43.7068977,-79.3975501
34_1_34C,8648,34,true,1585448212,253,0,278.77,14484,277.59,279.82,False,0,43.7068977,-79.3975501
34_1_34C,8648,34,true,1585448241,256,19,278.77,14484,277.59,279.82,False,0,43.7067945,-79.3980317
34_1_34C,8648,34,true,1585448242,256,19,278.77,14484,277.59,279.82,False,0,43.7067945,-79.3980317
34_1_34C,8648,34,true,1585448271,255,11,278.77,14484,277.59,279.82,False,0,43.7063993,-79.399989
34_1_34C,8648,34,true,1585448301,170,24,278.77,14484,277.59,279.82,False,0,43.7052334,-79.3994436
34_1_34C,8648,34,true,1585448302,170,24,278.77,14484,277.59,279.82,False,0,43.7052334,-79.3994436
34_1_34C,8648,34,true,1585448331,95,0,278.81,14484,277.59,279.82,False,0,43.7042615,-79.3985942
34_1_34C,8648,34,true,1585451002,158,18,278.77,12874,277.04,280.37,False,0,43.7134857,-79.326889
34_1_34C,8648,34,true,1585451032,189,6,278.77,12874,277.04,280.37,False,0,43.7131423,-79.3269195
34_1_34C,8648,34,true,1585451031,189,6,278.77,12874,277.04,280.37,False,0,43.7131423,-79.3269195
34_1_34C,8648,34,true,1585451061,188,0,278.77,12874,277.04,280.37,False,0,43.7131423,-79.3269195
34_1_34C,8648,34,true,1585451062,188,0,278.77,12874,277.04,280.37,False,0,43.7131423,-79.3269195
34_1_34C,8648,34,true,1585451092,188,0,278.77,12874,277.04,280.37,False,0,43.7131423,-79.3269195
34_1_34C,8648,34,true,1585451122,188,0,278.77,12874,277.04,280.37,False,0,43.7131423,-79.3269195
34_1_34C,8648,34,true,1585451152,188,0,278.77,12874,277.04,280.37,False,0,43.7131423,-79.3269195
34_1_34C,8648,34,true,1585451151,188,0,278.77,12874,277.04,280.37,False,0,43.7131423,-79.3269195
34_1_34C,8648,34,true,1585451182,188,0,278.77,12874,277.04,280.37,False,0,43.7131423,-79.3269195
34_1_34C,8648,34,true,1585451181,188,0,278.77,12874,277.04,280.37,False,0,43.7131423,-79.3269195
34_1_34C,8648,34,true,1585451212,188,0,278.77,12874,277.04,280.37,False,0,43.7131423,-79.3269195
34_1_34C,8648,34,true,1585451242,188,0,278.77,12874,277.04,280.37,False,0,43.7131423,-79.3269195
34_1_34C,8648,34,true,1585451272,188,0,278.77,12874,277.04,280.37,False,0,43.7131423,-79.3269195
34_1_34C,8648,34,true,1585451302,188,0,278.77,12874,277.04,280.37,False,0,43.7131423,-79.3269195
34_1_34C,8648,34,true,1585451332,188,0,278.77,12874,277.04,280.37,False,0,43.7131423,-79.3269195
34_1_34C,8648,34,true,1585451362,188,0,278.77,12874,277.04,280.37,False,0,43.7131423,-79.3269195
34_1_34C,8648,34,true,1585451392,110,26,278.77,12874,277.04,280.37,False,0,43.7125358,-79.3252334
34_1_34C,8648,34,true,1585451422,353,31,278.8,12874,277.04,280.37,False,0,43.7132759,-79.3243179
34_1_34C,8648,34,true,1585451452,347,32,278.85,12874,277.59,280.37,False,0,43.7158775,-79.3248138
34_1_34C,8648,34,true,1585451482,325,33,278.83,12874,277.59,280.37,False,0,43.7172966,-79.3261108
34_1_34C,8648,34,true,1585451512,342,26,278.83,12874,277.59,280.37,False,0,43.719738,-79.3278808
34_1_34C,8648,34,true,1585451542,31,32,278.83,12874,277.59,280.37,False,0,43.7221641,-79.3274688
34_1_34C,8648,34,true,1585451572,40,29,278.85,12874,277.59,280.37,False,0,43.723217,-79.3246231
34_1_34C,8648,34,true,1585451602,312,34,278.87,12874,277.59,280.37,False,0,43.7253608,-79.3262252
34_1_34C,8648,34,true,1585451632,329,34,278.87,12874,277.59,280.37,False,0,43.7277565,-79.3280181
34_1_34C,8648,34,true,1585451662,0,26,278.87,12874,277.59,280.37,False,0,43.7297058,-79.3284149
34_1_34C,8648,34,true,1585451663,0,26,278.87,12874,277.59,280.37,False,0,43.7297058,-79.3284149
34_1_34C,8648,34,true,1585451692,178,14,278.87,12874,277.59,280.37,False,0,43.7295417,-79.3283996
34_1_34C,8648,34,true,1585451693,178,14,278.87,12874,277.59,280.37,False,0,43.7295417,-79.3283996
34_1_34C,8648,34,true,1585451722,154,16,278.87,12874,277.59,280.37,False,0,43.7276496,-79.3279418
34_1_34C,8648,34,true,1585451754,253,32,278.87,12874,277.59,280.37,False,0,43.7268295,-79.3301467
34_1_34C,8648,34,true,1585451782,211,38,278.87,12874,277.59,280.37,False,0,43.7253379,-79.3337173
34_1_34C,8648,34,true,1585451783,211,38,278.87,12874,277.59,280.37,False,0,43.7253379,-79.3337173
34_1_34C,8648,34,true,1585451812,227,19,278.79,12874,277.04,280.37,False,0,43.7234802,-79.3364791
34_1_34C,8648,34,true,1585451843,159,13,278.79,12874,277.04,280.37,False,0,43.7215766,-79.3367996
34_1_34C,8648,34,true,1585451842,159,13,278.79,12874,277.04,280.37,False,0,43.7215766,-79.3367996
34_1_34C,8648,34,true,1585451872,246,18,278.79,12874,277.04,280.37,False,0,43.720642,-79.3383789
34_1_34C,8648,34,true,1585451873,246,18,278.79,12874,277.04,280.37,False,0,43.720642,-79.3383789
34_1_34C,8648,34,true,1585451902,245,33,278.79,12874,277.04,280.37,False,0,43.7196502,-79.3414993
34_1_34C,8648,34,true,1585451903,245,33,278.79,12874,277.04,280.37,False,0,43.7196502,-79.3414993
34_1_34C,8648,34,true,1585451932,246,37,278.8,12874,277.04,280.37,False,0,43.7184867,-79.3452529
34_1_34C,8648,34,true,1585451933,246,37,278.8,12874,277.04,280.37,False,0,43.7184867,-79.3452529
34_1_34C,8648,34,true,1585451963,247,32,278.8,12874,277.04,280.37,False,0,43.7173538,-79.3490371
34_1_34C,8648,34,true,1585451962,247,32,278.8,12874,277.04,280.37,False,0,43.7173538,-79.3490371
34_1_34C,8648,34,true,1585451992,246,5,278.8,12874,277.04,280.37,False,0,43.7171592,-79.3497314
34_1_34C,8648,34,true,1585451993,246,5,278.8,12874,277.04,280.37,False,0,43.7171592,-79.3497314
34_1_34C,8648,34,true,1585452022,248,37,278.8,12874,277.04,280.37,False,0,43.7159614,-79.3535385
34_1_34C,8648,34,true,1585452023,248,37,278.8,12874,277.04,280.37,False,0,43.7159614,-79.3535385
34_1_34C,8648,34,true,1585452052,253,37,278.82,12874,277.04,280.37,False,0,43.7150955,-79.357666
34_1_34C,8648,34,true,1585452053,253,37,278.82,12874,277.04,280.37,False,0,43.7150955,-79.357666
34_1_34C,8648,34,true,1585452082,253,31,278.79,12874,277.04,280.37,False,0,43.7143287,-79.361557
34_1_34C,8648,34,true,1585452083,253,31,278.79,12874,277.04,280.37,False,0,43.7143287,-79.361557
34_1_34C,8648,34,true,1585452112,254,29,278.79,12874,277.04,280.37,False,0,43.7137832,-79.3637237
34_1_34C,8648,34,true,1585452113,254,29,278.79,12874,277.04,280.37,False,0,43.7137832,-79.3637237
34_1_34C,8648,34,true,1585452142,254,0,278.79,12874,277.04,280.37,False,0,43.7135848,-79.3646774
34_1_34C,8648,34,true,1585452143,254,0,278.79,12874,277.04,280.37,False,0,43.7135848,-79.3646774
34_1_34C,8648,34,true,1585452172,254,9,278.79,12874,277.04,280.37,False,0,43.7135848,-79.3646774
34_1_34C,8648,34,true,1585452173,254,9,278.79,12874,277.04,280.37,False,0,43.7135848,-79.3646774
34_1_34C,8648,34,true,1585452202,252,30,278.76,12874,277.04,280.37,False,0,43.713005,-79.3676605
34_1_34C,8648,34,true,1585452203,252,30,278.76,12874,277.04,280.37,False,0,43.713005,-79.3676605
34_1_34C,8648,34,true,1585452233,254,34,278.76,12874,277.04,280.37,False,0,43.7122802,-79.3713455
34_1_34C,8648,34,true,1585452234,254,34,278.76,12874,277.04,280.37,False,0,43.7122802,-79.3713455
34_1_34C,8648,34,true,1585452262,253,32,278.76,12874,277.04,280.37,False,0,43.7116203,-79.3748474
34_1_34C,8648,34,true,1585452292,255,0,278.74,12874,277.04,280.37,False,0,43.7112503,-79.3767776
34_1_34C,8648,34,true,1585452293,255,0,278.74,12874,277.04,280.37,False,0,43.7112503,-79.3767776
34_1_34C,8648,34,true,1585452323,255,0,278.74,12874,277.04,280.37,False,0,43.7112503,-79.3767776
34_1_34C,8648,34,true,1585452322,255,0,278.74,12874,277.04,280.37,False,0,43.7112503,-79.3767776
34_1_34C,8648,34,true,1585452352,255,0,278.74,12874,277.04,280.37,False,0,43.7112503,-79.3767776
34_1_34C,8648,34,true,1585452353,255,0,278.74,12874,277.04,280.37,False,0,43.7112503,-79.3767776
34_1_34C,8648,34,true,1585452382,257,32,278.74,12874,277.04,280.37,False,0,43.7107658,-79.378334
34_1_34C,8648,34,true,1585452383,257,32,278.74,12874,277.04,280.37,False,0,43.7107658,-79.378334
34_1_34C,8648,34,true,1585452412,251,42,278.81,14484,277.04,280.37,False,0,43.7099113,-79.3827133
34_1_34C,8648,34,true,1585452413,251,42,278.81,14484,277.04,280.37,False,0,43.7099113,-79.3827133
34_1_34C,8648,34,true,1585452442,254,35,278.76,12874,277.04,280.37,False,0,43.7089614,-79.3873901
34_1_34C,8648,34,true,1585452443,254,35,278.76,12874,277.04,280.37,False,0,43.7089614,-79.3873901
34_1_34C,8648,34,true,1585452472,253,19,278.76,12874,277.04,280.37,False,0,43.7084732,-79.389801
34_1_34C,8648,34,true,1585452473,253,19,278.76,12874,277.04,280.37,False,0,43.7084732,-79.389801
34_1_34C,8648,34,true,1585452502,254,0,278.76,12874,277.04,280.37,False,0,43.7084274,-79.3900375
34_1_34C,8648,34,true,1585452503,254,0,278.76,12874,277.04,280.37,False,0,43.7084274,-79.3900375
34_1_34C,8648,34,true,1585452532,252,22,278.76,12874,277.04,280.37,False,0,43.7080383,-79.3922271
34_1_34C,8648,34,true,1585452533,252,22,278.76,12874,277.04,280.37,False,0,43.7080383,-79.3922271
34_1_34C,8648,34,true,1585452562,254,4,278.76,12874,277.04,280.37,False,0,43.7079887,-79.3926467
34_1_34C,8648,34,true,1585452563,254,4,278.76,12874,277.04,280.37,False,0,43.7079887,-79.3926467
34_1_34C,8648,34,true,1585452592,253,29,278.8,14484,277.04,280.37,False,0,43.7072334,-79.3959274
34_1_34C,8648,34,true,1585452593,253,29,278.8,14484,277.04,280.37,False,0,43.7072334,-79.3959274
34_1_34C,8648,34,true,1585452622,253,0,278.8,14484,277.04,280.37,False,0,43.7068214,-79.3979034
34_1_34C,8648,34,true,1585452623,253,0,278.8,14484,277.04,280.37,False,0,43.7068214,-79.3979034
34_1_34C,8648,34,true,1585452652,255,32,278.8,14484,277.04,280.37,False,0,43.7066307,-79.3988342
34_1_34C,8648,34,true,1585452653,255,32,278.8,14484,277.04,280.37,False,0,43.7066307,-79.3988342
34_1_34C,8648,34,true,1585452682,120,22,278.8,14484,277.04,280.37,False,0,43.705677,-79.4000701
34_1_34C,8648,34,true,1585452683,120,22,278.8,14484,277.04,280.37,False,0,43.705677,-79.4000701
34_1_34C,8648,34,true,1585452712,178,0,278.8,14484,277.04,280.37,False,0,43.7052154,-79.3994445
34_1_34C,8648,34,true,1585452713,178,0,278.8,14484,277.04,280.37,False,0,43.7052154,-79.3994445
34_1_34C,8648,34,true,1585452742,178,0,278.8,14484,277.04,280.37,False,0,43.7052154,-79.3994445
34_1_34C,8648,34,true,1585452743,178,0,278.8,14484,277.04,280.37,False,0,43.7052154,-79.3994445
34_1_34C,8648,34,true,1585452772,178,0,278.8,14484,277.04,280.37,False,0,43.7052154,-79.3994445
34_1_34C,8648,34,true,1585452773,178,0,278.8,14484,277.04,280.37,False,0,43.7052154,-79.3994445
34_1_34C,8648,34,true,1585452803,178,0,278.8,14484,277.04,280.37,False,0,43.7052154,-79.3994445
34_1_34C,8648,34,true,1585452802,178,0,278.8,14484,277.04,280.37,False,0,43.7052154,-79.3994445
34_1_34C,8648,34,true,1585452832,178,0,278.8,14484,277.04,280.37,False,0,43.7052154,-79.3994445
34_1_34C,8648,34,true,1585452833,178,0,278.8,14484,277.04,280.37,False,0,43.7052154,-79.3994445
34_1_34C,8648,34,true,1585452863,178,0,278.8,14484,277.04,280.37,False,0,43.7052154,-79.3994445
34_1_34C,8648,34,true,1585452862,178,0,278.8,14484,277.04,280.37,False,0,43.7052154,-79.3994445
34_1_34C,8648,34,true,1585452892,178,0,278.8,14484,277.04,280.37,False,0,43.7052154,-79.3994445
34_1_34C,8648,34,true,1585452893,178,0,278.8,14484,277.04,280.37,False,0,43.7052154,-79.3994445
34_1_34C,8648,34,true,1585452922,178,0,278.8,14484,277.04,280.37,False,0,43.7052154,-79.3994445
34_1_34C,8648,34,true,1585452923,178,0,278.8,14484,277.04,280.37,False,0,43.7052154,-79.3994445
34_1_34C,8648,34,true,1585452952,178,0,278.8,14484,277.04,280.37,False,0,43.7052154,-79.3994445
34_1_34C,8648,34,true,1585452953,178,0,278.8,14484,277.04,280.37,False,0,43.7052154,-79.3994445
34_1_34C,8648,34,true,1585452983,178,0,278.8,14484,277.04,280.37,False,0,43.7052154,-79.3994445
34_1_34C,8648,34,true,1585452982,178,0,278.8,14484,277.04,280.37,False,0,43.7052154,-79.3994445
34_1_34C,8648,34,true,1585453013,149,14,278.77,14484,277.04,280.37,False,0,43.704792,-79.3993759
34_1_34C,8648,34,true,1585453012,149,14,278.77,14484,277.04,280.37,False,0,43.704792,-79.3993759
34_1_34C,8648,34,true,1585453043,173,0,278.77,14484,277.04,280.37,False,0,43.7049293,-79.3985824
34_1_34C,8648,34,true,1585453042,173,0,278.77,14484,277.04,280.37,False,0,43.7049293,-79.3985824
34_1_34C,8648,34,true,1585453073,173,0,278.77,14484,277.04,280.37,False,0,43.7049293,-79.3985824
34_1_34C,8648,34,true,1585453072,173,0,278.77,14484,277.04,280.37,False,0,43.7049293,-79.3985824
34_1_34C,8648,34,true,1585453102,173,0,278.77,14484,277.04,280.37,False,0,43.7049293,-79.3985824
34_1_34C,8648,34,true,1585453103,173,0,278.77,14484,277.04,280.37,False,0,43.7049293,-79.3985824
34_1_34C,8648,34,true,1585453133,173,0,278.77,14484,277.04,280.37,False,0,43.7049293,-79.3985824
34_1_34C,8648,34,true,1585453132,173,0,278.77,14484,277.04,280.37,False,0,43.7049293,-79.3985824
34_1_34C,8648,34,true,1585453163,327,12,278.77,14484,277.04,280.37,False,0,43.705101,-79.3986587
34_1_34C,8648,34,true,1585453162,327,12,278.77,14484,277.04,280.37,False,0,43.705101,-79.3986587
34_1_34C,8648,34,true,1585453193,309,12,278.77,14484,277.04,280.37,False,0,43.705677,-79.4000701
34_1_34C,8648,34,true,1585453192,309,12,278.77,14484,277.04,280.37,False,0,43.705677,-79.4000701
34_1_34C,8648,34,true,1585454724,162,37,278.69,14484,277.04,280.37,False,0,43.7134857,-79.326889
34_1_34C,8648,34,true,1585454754,118,0,278.69,14484,277.04,280.37,False,0,43.7128916,-79.32646
34_1_34C,8648,34,true,1585454755,118,0,278.69,14484,277.04,280.37,False,0,43.7128916,-79.32646
34_1_34C,8648,34,true,1585454784,118,0,278.69,14484,277.04,280.37,False,0,43.7128829,-79.3264617
34_1_34C,8648,34,true,1585454814,118,0,278.69,14484,277.04,280.37,False,0,43.7128829,-79.3264617
34_1_34C,8648,34,true,1585454844,118,0,278.69,14484,277.04,280.37,False,0,43.7128829,-79.3264617
34_1_34C,8648,34,true,1585454874,118,0,278.69,14484,277.04,280.37,False,0,43.7128829,-79.3264617
34_1_34C,8648,34,true,1585454875,118,0,278.69,14484,277.04,280.37,False,0,43.7128829,-79.3264617
34_1_34C,8648,34,true,1585454904,118,0,278.69,14484,277.04,280.37,False,0,43.7128829,-79.3264617
34_1_34C,8648,34,true,1585454934,118,0,278.69,14484,277.04,280.37,False,0,43.7128829,-79.3264617
34_1_34C,8648,34,true,1585454964,118,0,278.69,14484,277.04,280.37,False,0,43.7128829,-79.3264617
34_1_34C,8648,34,true,1585454965,118,0,278.69,14484,277.04,280.37,False,0,43.7128829,-79.3264617
34_1_34C,8648,34,true,1585454994,118,0,278.69,14484,277.04,280.37,False,0,43.7128829,-79.3264617
34_1_34C,8648,34,true,1585455025,118,0,278.69,14484,277.04,280.37,False,0,43.7128829,-79.3264617
34_1_34C,8648,34,true,1585455024,118,0,278.69,14484,277.04,280.37,False,0,43.7128829,-79.3264617
34_1_34C,8648,34,true,1585455055,118,0,278.69,14484,277.04,280.37,False,0,43.7128829,-79.3264617
34_1_34C,8648,34,true,1585455054,118,0,278.69,14484,277.04,280.37,False,0,43.7128829,-79.3264617
34_1_34C,8648,34,true,1585455084,118,0,278.69,14484,277.04,280.37,False,0,43.7128829,-79.3264617
34_1_34C,8648,34,true,1585455085,118,0,278.69,14484,277.04,280.37,False,0,43.7128829,-79.3264617
34_1_34C,8648,34,true,1585455114,118,0,278.69,14484,277.04,280.37,False,0,43.7128829,-79.3264617
34_1_34C,8648,34,true,1585455115,118,0,278.69,14484,277.04,280.37,False,0,43.7128829,-79.3264617
34_1_34C,8648,34,true,1585455144,118,0,278.69,14484,277.04,280.37,False,0,43.7128829,-79.3264617
34_1_34C,8648,34,true,1585455145,118,0,278.69,14484,277.04,280.37,False,0,43.7128829,-79.3264617
34_1_34C,8648,34,true,1585455174,110,25,278.74,14484,277.04,280.37,False,0,43.7125358,-79.3252334
34_1_34C,8648,34,true,1585455175,110,25,278.74,14484,277.04,280.37,False,0,43.7125358,-79.3252334
34_1_34C,8648,34,true,1585455204,354,34,278.75,14484,277.04,280.37,False,0,43.7144432,-79.3244476
34_1_34C,8648,34,true,1585455205,354,34,278.75,14484,277.04,280.37,False,0,43.7144432,-79.3244476
34_1_34C,8648,34,true,1585455234,321,32,278.76,14484,277.04,280.37,False,0,43.7165374,-79.3253479
34_1_34C,8648,34,true,1585455264,327,28,278.76,14484,277.04,280.37,False,0,43.7190742,-79.3271789
34_1_34C,8648,34,true,1585455265,327,28,278.76,14484,277.04,280.37,False,0,43.7190742,-79.3271789
34_1_34C,8648,34,true,1585455295,355,32,278.76,14484,277.04,280.37,False,0,43.7204971,-79.3281326
34_1_34C,8648,34,true,1585455294,355,32,278.76,14484,277.04,280.37,False,0,43.7204971,-79.3281326
34_1_34C,8648,34,true,1585455324,88,32,278.76,14484,277.04,280.37,False,0,43.722721,-79.3262939
34_1_34C,8648,34,true,1585455325,88,32,278.76,14484,277.04,280.37,False,0,43.722721,-79.3262939
34_1_34C,8648,34,true,1585455355,324,29,278.76,14484,277.04,280.37,False,0,43.7239952,-79.3249511
34_1_34C,8648,34,true,1585455354,324,29,278.76,14484,277.04,280.37,False,0,43.7239952,-79.3249511
34_1_34C,8648,34,true,1585455385,328,0,278.76,14484,277.59,280.37,False,0,43.7250595,-79.3257217
34_1_34C,8648,34,true,1585455384,328,0,278.76,14484,277.59,280.37,False,0,43.7250595,-79.3257217
34_1_34C,8648,34,true,1585455414,353,36,278.76,14484,277.59,280.37,False,0,43.7266811,-79.3275337
34_1_34C,8648,34,true,1585455415,353,36,278.76,14484,277.59,280.37,False,0,43.7266811,-79.3275337
34_1_34C,8648,34,true,1585455444,357,10,278.76,14484,277.59,280.37,False,0,43.7291335,-79.3283709
34_1_34C,8648,34,true,1585455474,176,25,278.76,14484,277.59,280.37,False,0,43.7299187,-79.3284848
34_1_34C,8648,34,true,1585455475,176,25,278.76,14484,277.59,280.37,False,0,43.7299187,-79.3284848
34_1_34C,8648,34,true,1585455504,357,0,278.76,14484,277.59,280.37,False,0,43.7293959,-79.328425
34_1_34C,8648,34,true,1585455505,357,0,278.76,14484,277.59,280.37,False,0,43.7293959,-79.328425
34_1_34C,8648,34,true,1585455534,161,6,278.76,14484,277.59,280.37,False,0,43.7276858,-79.3279677
34_1_34C,8648,34,true,1585455564,252,39,278.76,14484,277.59,280.37,False,0,43.7265997,-79.3311666
34_1_34C,8648,34,true,1585455565,252,39,278.76,14484,277.59,280.37,False,0,43.7265997,-79.3311666
34_1_34C,8648,34,true,1585455596,211,41,278.76,14484,277.04,280.37,False,0,43.7249786,-79.3340197
34_1_34C,8648,34,true,1585455597,211,41,278.76,14484,277.04,280.37,False,0,43.7249786,-79.3340197
34_1_34C,8648,34,true,1585455624,171,26,278.75,14484,277.04,280.37,False,0,43.7234739,-79.336502
34_1_34C,8648,34,true,1585455625,171,26,278.75,14484,277.04,280.37,False,0,43.7234739,-79.336502
34_1_34C,8648,34,true,1585455655,253,31,278.75,14484,277.04,280.37,False,0,43.7213307,-79.3367187
34_1_34C,8648,34,true,1585455654,253,31,278.75,14484,277.04,280.37,False,0,43.7213307,-79.3367187
34_1_34C,8648,34,true,1585455685,245,37,278.75,14484,277.04,280.37,False,0,43.7203585,-79.339318
34_1_34C,8648,34,true,1585455684,245,37,278.75,14484,277.04,280.37,False,0,43.7203585,-79.339318
34_1_34C,8648,34,true,1585455715,245,42,278.75,14484,277.04,280.37,False,0,43.7192231,-79.3429494
34_1_34C,8648,34,true,1585455714,245,42,278.75,14484,277.04,280.37,False,0,43.7192231,-79.3429494
34_1_34C,8648,34,true,1585455745,252,43,278.73,14484,277.04,280.37,False,0,43.7177938,-79.3474939
34_1_34C,8648,34,true,1585455744,252,43,278.73,14484,277.04,280.37,False,0,43.7177938,-79.3474939
34_1_34C,8648,34,true,1585455774,246,9,278.72,14484,277.04,280.37,False,0,43.7174654,-79.3486522
34_1_34C,8648,34,true,1585455775,246,9,278.72,14484,277.04,280.37,False,0,43.7174654,-79.3486522
34_1_34C,8648,34,true,1585455804,249,37,278.72,14484,277.04,280.37,False,0,43.7161027,-79.3530245
34_1_34C,8648,34,true,1585455805,249,37,278.72,14484,277.04,280.37,False,0,43.7161027,-79.3530245
34_1_34C,8648,34,true,1585455834,249,32,278.71,14484,277.04,280.37,False,0,43.7152134,-79.3570674
34_1_34C,8648,34,true,1585455835,249,32,278.71,14484,277.04,280.37,False,0,43.7152134,-79.3570674
34_1_34C,8648,34,true,1585455864,254,33,278.7,14484,277.04,280.37,False,0,43.7145968,-79.3602552
34_1_34C,8648,34,true,1585455865,254,33,278.7,14484,277.04,280.37,False,0,43.7145968,-79.3602552
34_1_34C,8648,34,true,1585455895,254,31,278.7,14484,277.04,280.37,False,0,43.7138547,-79.3633936
34_1_34C,8648,34,true,1585455894,254,31,278.7,14484,277.04,280.37,False,0,43.7138547,-79.3633936
34_1_34C,8648,34,true,1585455924,254,0,278.71,14484,277.04,280.37,False,0,43.7133665,-79.3662121
34_1_34C,8648,34,true,1585455925,254,0,278.71,14484,277.04,280.37,False,0,43.7133665,-79.3662121
34_1_34C,8648,34,true,1585455954,254,0,278.7,14484,277.04,280.37,False,0,43.7133665,-79.3662121
34_1_34C,8648,34,true,1585455955,254,0,278.7,14484,277.04,280.37,False,0,43.7133665,-79.3662121
34_1_34C,8648,34,true,1585455984,253,30,278.7,14484,277.04,280.37,False,0,43.713156,-79.3671079
34_1_34C,8648,34,true,1585455985,253,30,278.7,14484,277.04,280.37,False,0,43.713156,-79.3671079
34_1_34C,8648,34,true,1585456015,254,37,278.7,14484,277.04,280.37,False,0,43.7122883,-79.3712937
34_1_34C,8648,34,true,1585456014,254,37,278.7,14484,277.04,280.37,False,0,43.7122883,-79.3712937
34_1_34C,8648,34,true,1585456045,254,30,278.7,14484,277.04,280.37,False,0,43.7116848,-79.374511
34_1_34C,8648,34,true,1585456044,254,30,278.7,14484,277.04,280.37,False,0,43.7116848,-79.374511
34_1_34C,8648,34,true,1585456074,255,0,278.69,14484,277.04,280.37,False,0,43.7113707,-79.376143
34_1_34C,8648,34,true,1585456075,255,0,278.69,14484,277.04,280.37,False,0,43.7113707,-79.376143
34_1_34C,8648,34,true,1585456104,255,0,278.69,14484,277.04,280.37,False,0,43.7113707,-79.376143
34_1_34C,8648,34,true,1585456105,255,0,278.69,14484,277.04,280.37,False,0,43.7113707,-79.376143
34_1_34C,8648,34,true,1585456135,253,9,278.69,14484,277.04,280.37,False,0,43.7113559,-79.3762218
34_1_34C,8648,34,true,1585456134,253,9,278.69,14484,277.04,280.37,False,0,43.7113559,-79.3762218
34_1_34C,8648,34,true,1585456165,254,31,278.69,14484,277.04,280.37,False,0,43.7105334,-79.3795602
34_1_34C,8648,34,true,1585456164,254,31,278.69,14484,277.04,280.37,False,0,43.7105334,-79.3795602
34_1_34C,8648,34,true,1585456194,254,41,278.69,14484,277.04,280.37,False,0,43.709703,-79.3837884
34_1_34C,8648,34,true,1585456195,254,41,278.69,14484,277.04,280.37,False,0,43.709703,-79.3837884
34_1_34C,8648,34,true,1585456224,254,31,278.69,14484,277.04,280.37,False,0,43.709131,-79.3868248
34_1_34C,8648,34,true,1585456225,254,31,278.69,14484,277.04,280.37,False,0,43.709131,-79.3868248
34_1_34C,8648,34,true,1585456255,252,19,278.69,14484,277.04,280.37,False,0,43.7085411,-79.3894422
34_1_34C,8648,34,true,1585456254,252,19,278.69,14484,277.04,280.37,False,0,43.7085411,-79.3894422
34_1_34C,8648,34,true,1585456285,253,19,278.69,14484,277.04,280.37,False,0,43.7080854,-79.3918422
34_1_34C,8648,34,true,1585456284,253,19,278.69,14484,277.04,280.37,False,0,43.7080854,-79.3918422
34_1_34C,8648,34,true,1585456315,247,28,278.69,14484,277.04,280.37,False,0,43.7075311,-79.3946484
34_1_34C,8648,34,true,1585456314,247,28,278.69,14484,277.04,280.37,False,0,43.7075311,-79.3946484
34_1_34C,8648,34,true,1585456345,255,16,278.68,14484,277.04,280.37,False,0,43.7069662,-79.3972208
34_1_34C,8648,34,true,1585456344,255,16,278.68,14484,277.04,280.37,False,0,43.7069662,-79.3972208
34_1_34C,8648,34,true,1585456375,240,18,278.68,14484,277.04,280.37,False,0,43.7064482,-79.3997511
34_1_34C,8648,34,true,1585456374,240,18,278.68,14484,277.04,280.37,False,0,43.7064482,-79.3997511
34_1_34C,8648,34,true,1585456404,168,25,278.68,14484,277.04,280.37,False,0,43.7053236,-79.399439
34_1_34C,8648,34,true,1585456405,168,25,278.68,14484,277.04,280.37,False,0,43.7053236,-79.399439
34_1_34C,8648,34,true,1585458535,172,14,278.74,14484,277.04,280.37,False,0,43.7131423,-79.3269195
34_1_34C,8648,34,true,1585458536,172,14,278.74,14484,277.04,280.37,False,0,43.7131423,-79.3269195
34_1_34C,8648,34,true,1585458566,188,0,278.74,14484,277.04,280.37,False,0,43.7131423,-79.3269195
34_1_34C,8648,34,true,1585458565,188,0,278.74,14484,277.04,280.37,False,0,43.7131423,-79.3269195
34_1_34C,8648,34,true,1585458596,188,0,278.74,14484,277.04,280.37,False,0,43.7131423,-79.3269195
34_1_34C,8648,34,true,1585458595,188,0,278.74,14484,277.04,280.37,False,0,43.7131423,-79.3269195
34_1_34C,8648,34,true,1585458626,188,0,278.74,14484,277.04,280.37,False,0,43.7131423,-79.3269195
34_1_34C,8648,34,true,1585458625,188,0,278.74,14484,277.04,280.37,False,0,43.7131423,-79.3269195
34_1_34C,8648,34,true,1585458655,188,0,278.74,14484,277.04,280.37,False,0,43.7131423,-79.3269195
34_1_34C,8648,34,true,1585458656,188,0,278.74,14484,277.04,280.37,False,0,43.7131423,-79.3269195
34_1_34C,8648,34,true,1585458685,188,0,278.74,14484,277.04,280.37,False,0,43.7131423,-79.3269195
34_1_34C,8648,34,true,1585458715,188,0,278.74,14484,277.04,280.37,False,0,43.7131423,-79.3269195
34_1_34C,8648,34,true,1585458716,188,0,278.74,14484,277.04,280.37,False,0,43.7131423,-79.3269195
34_1_34C,8648,34,true,1585458745,188,0,278.74,14484,277.04,280.37,False,0,43.7131423,-79.3269195
34_1_34C,8648,34,true,1585458746,188,0,278.74,14484,277.04,280.37,False,0,43.7131423,-79.3269195
34_1_34C,8648,34,true,1585458775,188,0,278.74,14484,277.04,280.37,False,0,43.7131423,-79.3269195
34_1_34C,8648,34,true,1585458776,188,0,278.74,14484,277.04,280.37,False,0,43.7131423,-79.3269195
34_1_34C,8648,34,true,1585458805,188,0,278.74,14484,277.04,280.37,False,0,43.7131423,-79.3269195
34_1_34C,8648,34,true,1585458806,188,0,278.74,14484,277.04,280.37,False,0,43.7131423,-79.3269195
34_1_34C,8648,34,true,1585458835,188,0,278.74,14484,277.04,280.37,False,0,43.7131423,-79.3269195
34_1_34C,8648,34,true,1585458836,188,0,278.74,14484,277.04,280.37,False,0,43.7131423,-79.3269195
34_1_34C,8648,34,true,1585458865,188,0,278.74,14484,277.04,280.37,False,0,43.7131423,-79.3269195
34_1_34C,8648,34,true,1585458866,188,0,278.74,14484,277.04,280.37,False,0,43.7131423,-79.3269195
34_1_34C,8648,34,true,1585458895,188,0,278.74,14484,277.04,280.37,False,0,43.7131423,-79.3269195
34_1_34C,8648,34,true,1585458896,188,0,278.74,14484,277.04,280.37,False,0,43.7131423,-79.3269195
34_1_34C,8648,34,true,1585458925,188,0,278.74,14484,277.04,280.37,False,0,43.7131423,-79.3269195
34_1_34C,8648,34,true,1585458926,188,0,278.74,14484,277.04,280.37,False,0,43.7131423,-79.3269195
34_1_34C,8648,34,true,1585458955,188,0,278.74,14484,277.04,280.37,False,0,43.7131423,-79.3269195
34_1_34C,8648,34,true,1585459136,109,25,278.72,14484,277.04,280.37,False,0,43.712605,-79.3254033
34_1_34C,8648,34,true,1585459165,354,30,278.73,14484,277.04,280.37,False,0,43.7140846,-79.3244094
34_1_34C,8648,34,true,1585459166,354,30,278.73,14484,277.04,280.37,False,0,43.7140846,-79.3244094
34_1_34C,8648,34,true,1585459196,322,38,278.75,14484,277.04,280.37,False,0,43.7165374,-79.3253479
34_1_34C,8648,34,true,1585459195,322,38,278.75,14484,277.04,280.37,False,0,43.7165374,-79.3253479
34_1_34C,8648,34,true,1585459225,326,33,278.75,14484,277.04,280.37,False,0,43.7190742,-79.3271789
34_1_34C,8648,34,true,1585459226,326,33,278.75,14484,277.04,280.37,False,0,43.7190742,-79.3271789
34_1_34C,8648,34,true,1585459255,12,36,278.75,14484,277.04,280.37,False,0,43.721363,-79.3279113
34_1_34C,8648,34,true,1585459307,73,33,278.75,14484,277.04,280.37,False,0,43.7226829,-79.326622
34_1_34C,8648,34,true,1585459338,327,41,278.76,14484,277.59,280.37,False,0,43.726078,-79.3272781
34_1_34C,8648,34,true,1585459337,327,41,278.76,14484,277.59,280.37,False,0,43.726078,-79.3272781
34_1_34C,8648,34,true,1585459368,357,38,278.76,14484,277.59,280.37,False,0,43.7284851,-79.3283157
34_1_34C,8648,34,true,1585459367,357,38,278.76,14484,277.59,280.37,False,0,43.7284851,-79.3283157
34_1_34C,8648,34,true,1585459398,229,14,278.76,14484,277.59,280.37,False,0,43.7302818,-79.3284606
34_1_34C,8648,34,true,1585459397,229,14,278.76,14484,277.59,280.37,False,0,43.7302818,-79.3284606
34_1_34C,8648,34,true,1585459427,170,29,278.76,14484,277.59,280.37,False,0,43.7282981,-79.3283157
34_1_34C,8648,34,true,1585459428,170,29,278.76,14484,277.59,280.37,False,0,43.7282981,-79.3283157
34_1_34C,8648,34,true,1585459457,254,30,278.76,14484,277.59,280.37,False,0,43.7270698,-79.3291702
34_1_34C,8648,34,true,1585459458,254,30,278.76,14484,277.59,280.37,False,0,43.7270698,-79.3291702
34_1_34C,8648,34,true,1585459488,210,45,278.76,14484,277.59,280.37,False,0,43.7253379,-79.3337173
34_1_34C,8648,34,true,1585459487,210,45,278.76,14484,277.59,280.37,False,0,43.7253379,-79.3337173
34_1_34C,8648,34,true,1585459518,232,19,278.73,14484,277.04,280.37,False,0,43.723484,-79.3364334
34_1_34C,8648,34,true,1585459517,232,19,278.73,14484,277.04,280.37,False,0,43.723484,-79.3364334
34_1_34C,8648,34,true,1585459547,248,24,278.73,14484,277.04,280.37,False,0,43.7212562,-79.3366928
34_1_34C,8648,34,true,1585459548,248,24,278.73,14484,277.04,280.37,False,0,43.7212562,-79.3366928
34_1_34C,8648,34,true,1585459577,247,35,278.73,14484,277.04,280.37,False,0,43.7203674,-79.3392868
34_1_34C,8648,34,true,1585459578,247,35,278.73,14484,277.04,280.37,False,0,43.7203674,-79.3392868
34_1_34C,8648,34,true,1585459607,243,39,278.73,14484,277.04,280.37,False,0,43.7192115,-79.342987
34_1_34C,8648,34,true,1585459608,243,39,278.73,14484,277.04,280.37,False,0,43.7192115,-79.342987
34_1_34C,8648,34,true,1585459638,245,39,278.72,14484,277.04,280.37,False,0,43.7178001,-79.3474731
34_1_34C,8648,34,true,1585459637,245,39,278.72,14484,277.04,280.37,False,0,43.7178001,-79.3474731
34_1_34C,8648,34,true,1585459667,248,0,278.72,14484,277.04,280.37,False,0,43.7171592,-79.3497314
34_1_34C,8648,34,true,1585459668,248,0,278.72,14484,277.04,280.37,False,0,43.7171592,-79.3497314
34_1_34C,8648,34,true,1585459698,245,38,278.72,14484,277.04,280.37,False,0,43.7166824,-79.3511123
34_1_34C,8648,34,true,1585459697,245,38,278.72,14484,277.04,280.37,False,0,43.7166824,-79.3511123
34_1_34C,8648,34,true,1585459728,250,33,278.72,14484,277.04,280.37,False,0,43.7156906,-79.3546295
34_1_34C,8648,34,true,1585459727,250,33,278.72,14484,277.04,280.37,False,0,43.7156906,-79.3546295
34_1_34C,8648,34,true,1585459758,247,36,278.7,14484,277.04,280.37,False,0,43.7149925,-79.3581466
34_1_34C,8648,34,true,1585459757,247,36,278.7,14484,277.04,280.37,False,0,43.7149925,-79.3581466
34_1_34C,8648,34,true,1585459787,255,0,278.7,14484,277.04,280.37,False,0,43.7146339,-79.3596496
34_1_34C,8648,34,true,1585459788,255,0,278.7,14484,277.04,280.37,False,0,43.7146339,-79.3596496
34_1_34C,8648,34,true,1585459818,253,27,278.7,14484,277.04,280.37,False,0,43.7144775,-79.3608398
34_1_34C,8648,34,true,1585459817,253,27,278.7,14484,277.04,280.37,False,0,43.7144775,-79.3608398
34_1_34C,8648,34,true,1585459848,254,29,278.7,14484,277.04,280.37,False,0,43.7137832,-79.3637237
34_1_34C,8648,34,true,1585459847,254,29,278.7,14484,277.04,280.37,False,0,43.7137832,-79.3637237
34_1_34C,8648,34,true,1585459877,248,25,278.69,14484,277.04,280.37,False,0,43.7135314,-79.3654403
34_1_34C,8648,34,true,1585459878,248,25,278.69,14484,277.04,280.37,False,0,43.7135314,-79.3654403
34_1_34C,8648,34,true,1585459907,253,2,278.69,14484,277.04,280.37,False,0,43.7131996,-79.3669815
34_1_34C,8648,34,true,1585459908,253,2,278.69,14484,277.04,280.37,False,0,43.7131996,-79.3669815
34_1_34C,8648,34,true,1585459938,252,26,278.69,14484,277.04,280.37,False,0,43.713005,-79.3676605
34_1_34C,8648,34,true,1585459937,252,26,278.69,14484,277.04,280.37,False,0,43.713005,-79.3676605
34_1_34C,8648,34,true,1585459968,255,33,278.69,14484,277.04,280.37,False,0,43.7124862,-79.3701324
34_1_34C,8648,34,true,1585459967,255,33,278.69,14484,277.04,280.37,False,0,43.7124862,-79.3701324
34_1_34C,8648,34,true,1585459998,254,30,278.69,14484,277.04,280.37,False,0,43.7117424,-79.3738021
34_1_34C,8648,34,true,1585460028,254,9,278.69,14484,277.04,280.37,False,0,43.7112426,-79.3768234
34_1_34C,8648,34,true,1585460027,254,9,278.69,14484,277.04,280.37,False,0,43.7112426,-79.3768234
34_1_34C,8648,34,true,1585460058,253,0,278.69,14484,277.04,280.37,False,0,43.7112426,-79.3768234
34_1_34C,8648,34,true,1585460087,253,0,278.69,14484,277.04,280.37,False,0,43.7112426,-79.3768234
34_1_34C,8648,34,true,1585460088,253,0,278.69,14484,277.04,280.37,False,0,43.7112426,-79.3768234
34_1_34C,8648,34,true,1585460117,253,26,278.69,14484,277.04,280.37,False,0,43.7109756,-79.3773803
34_1_34C,8648,34,true,1585460118,253,26,278.69,14484,277.04,280.37,False,0,43.7109756,-79.3773803
34_1_34C,8648,34,true,1585460147,254,38,278.69,14484,277.04,280.37,False,0,43.7105216,-79.379631
34_1_34C,8648,34,true,1585460177,254,39,278.69,14484,277.04,280.37,False,0,43.7096672,-79.3840713
34_1_34C,8648,34,true,1585460207,254,26,278.68,14484,277.04,280.37,False,0,43.7088546,-79.3878784
34_1_34C,8648,34,true,1585460237,254,0,278.68,14484,277.04,280.37,False,0,43.7084274,-79.3900375
34_1_34C,8648,34,true,1585460267,254,0,278.68,14484,277.04,280.37,False,0,43.7084274,-79.3900375
34_1_34C,8648,34,true,1585460268,254,0,278.68,14484,277.04,280.37,False,0,43.7084274,-79.3900375
34_1_34C,8648,34,true,1585460297,254,0,278.68,14484,277.04,280.37,False,0,43.7084274,-79.3900375
34_1_34C,8648,34,true,1585460327,266,26,278.68,14484,277.04,280.37,False,0,43.7081298,-79.3914871
34_1_34C,8648,34,true,1585460358,255,27,278.68,14484,277.04,280.37,False,0,43.7077598,-79.3932876
34_1_34C,8648,34,true,1585460388,254,27,278.68,14484,277.04,280.37,False,0,43.7072334,-79.3959274
34_1_34C,8648,34,true,1585460387,254,27,278.68,14484,277.04,280.37,False,0,43.7072334,-79.3959274
34_1_34C,8648,34,true,1585460418,253,0,278.68,14484,277.04,280.37,False,0,43.7068214,-79.3979034
34_1_34C,8648,34,true,1585460448,254,34,278.68,14484,277.04,280.37,False,0,43.7065811,-79.3990707
34_1_34C,8648,34,true,1585460447,254,34,278.68,14484,277.04,280.37,False,0,43.7065811,-79.3990707
34_1_34C,8648,34,true,1585460478,168,22,278.68,14484,277.04,280.37,False,0,43.7052154,-79.3994445
34_1_34C,8648,34,true,1585460508,8,1,278.67,14484,277.04,280.37,False,0,43.7043151,-79.3985137
