dir,id,route,predable,time,hdg,spd,temp,vis,t_min,t_max,snow,rain,lat,lon
34_1_34A,8710,34,true,1585753563,72,0,279.23,14484,277.15,280.37,False,0,43.7329229,-79.2638428
34_1_34A,8710,34,true,1585753593,71,9,279.23,14484,277.15,280.37,False,0,43.7330551,-79.2632774
34_1_34A,8710,34,true,1585753592,71,9,279.23,14484,277.15,280.37,False,0,43.7330551,-79.2632774
34_1_34A,8710,34,true,1585753623,255,13,279.23,14484,277.15,280.37,False,0,43.7325668,-79.2639389
34_1_34A,8710,34,true,1585753622,255,13,279.23,14484,277.15,280.37,False,0,43.7325668,-79.2639389
34_1_34A,8710,34,true,1585753653,216,0,279.23,14484,277.15,280.37,False,0,43.7323036,-79.2636871
34_1_34A,8710,34,true,1585753683,216,0,279.23,14484,277.15,280.37,False,0,43.7323036,-79.2636871
34_1_34A,8710,34,true,1585753682,216,0,279.23,14484,277.15,280.37,False,0,43.7323036,-79.2636871
34_1_34A,8710,34,true,1585753713,216,1,279.23,14484,277.15,280.37,False,0,43.7327919,-79.2631454
34_1_34A,8710,34,true,1585753712,216,1,279.23,14484,277.15,280.37,False,0,43.7327919,-79.2631454
34_1_34A,8710,34,true,1585753743,342,17,279.23,14484,277.15,280.37,False,0,43.7333602,-79.2632827
34_1_34A,8710,34,true,1585753773,250,25,279.23,14484,277.15,280.37,False,0,43.7332763,-79.2646636
34_1_34A,8710,34,true,1585753772,250,25,279.23,14484,277.15,280.37,False,0,43.7332763,-79.2646636
34_1_34A,8710,34,true,1585753803,253,0,279.25,14484,277.15,280.93,False,0,43.7329864,-79.2663574
34_1_34A,8710,34,true,1585753802,253,0,279.25,14484,277.15,280.93,False,0,43.7329864,-79.2663574
34_1_34A,8710,34,true,1585753833,258,23,279.25,14484,277.15,280.93,False,0,43.7324409,-79.2673187
34_1_34A,8710,34,true,1585753863,251,29,279.25,14484,277.15,280.93,False,0,43.731697,-79.2703094
34_1_34A,8710,34,true,1585753892,216,0,279.25,14484,277.15,280.93,False,0,43.7316055,-79.2711181
34_1_34A,8710,34,true,1585753893,216,0,279.25,14484,277.15,280.93,False,0,43.7316055,-79.2711181
34_1_34A,8710,34,true,1585753923,216,0,279.25,14484,277.15,280.93,False,0,43.7316055,-79.2711181
34_1_34A,8710,34,true,1585753953,216,0,279.25,14484,277.15,280.93,False,0,43.7316055,-79.2711181
34_1_34A,8710,34,true,1585753952,216,0,279.25,14484,277.15,280.93,False,0,43.7316055,-79.2711181
34_1_34A,8710,34,true,1585753983,252,0,279.25,14484,277.15,280.93,False,0,43.7313232,-79.2716751
34_1_34A,8710,34,true,1585753982,252,0,279.25,14484,277.15,280.93,False,0,43.7313232,-79.2716751
34_1_34A,8710,34,true,1585754012,248,19,279.25,14484,277.15,280.93,False,0,43.7312583,-79.271965
34_1_34A,8710,34,true,1585754013,248,19,279.25,14484,277.15,280.93,False,0,43.7312583,-79.271965
34_1_34A,8710,34,true,1585754043,245,4,279.25,14484,277.15,280.93,False,0,43.7310523,-79.273056
34_1_34A,8710,34,true,1585754042,245,4,279.25,14484,277.15,280.93,False,0,43.7310523,-79.273056
34_1_34A,8710,34,true,1585754073,249,8,279.25,14484,277.15,280.93,False,0,43.7309684,-79.2738189
34_1_34A,8710,34,true,1585754103,255,18,279.25,14484,277.15,280.93,False,0,43.7306103,-79.2748588
