dir,id,route,predable,time,hdg,spd,temp,vis,t_min,t_max,snow,rain,lat,lon
34_0_34A,8908,34,true,1585434468,282,12,280.17,14484,277.59,283.15,False,0,43.7056274,-79.3999176
34_0_34A,8908,34,true,1585434469,282,12,280.17,14484,277.59,283.15,False,0,43.7056274,-79.3999176
34_0_34A,8908,34,true,1585434499,72,19,280.17,14484,277.59,283.15,False,0,43.7064895,-79.3995513
34_0_34A,8908,34,true,1585434529,76,0,280.17,14484,277.59,283.15,False,0,43.7066307,-79.3988265
34_0_34A,8908,34,true,1585434530,76,0,280.17,14484,277.59,283.15,False,0,43.7066307,-79.3988265
34_0_34A,8908,34,true,1585434559,75,13,280.17,14484,277.59,283.15,False,0,43.7066307,-79.3988265
34_0_34A,8908,34,true,1585434589,75,22,280.17,14484,277.59,283.15,False,0,43.7071456,-79.39608
34_0_34A,8908,34,true,1585434619,75,23,280.17,14484,277.59,283.15,False,0,43.7075614,-79.3942794
34_0_34A,8908,34,true,1585434649,73,8,280.17,14484,277.59,283.15,False,0,43.7077255,-79.3931427
34_0_34A,8908,34,true,1585434679,74,14,280.17,14484,277.59,283.15,False,0,43.708229,-79.3910064
34_0_34A,8908,34,true,1585434710,74,0,280.17,14484,277.59,283.15,False,0,43.7082786,-79.3907699
34_0_34A,8908,34,true,1585434709,74,0,280.17,14484,277.59,283.15,False,0,43.7082786,-79.3907699
34_0_34A,8908,34,true,1585434739,74,0,280.17,14484,277.59,283.15,False,0,43.7082786,-79.3907699
34_0_34A,8908,34,true,1585434770,74,22,280.17,14484,277.59,283.15,False,0,43.7084465,-79.3899459
34_0_34A,8908,34,true,1585434769,74,22,280.17,14484,277.59,283.15,False,0,43.7084465,-79.3899459
34_0_34A,8908,34,true,1585434799,73,20,280.17,14484,277.59,283.15,False,0,43.7089118,-79.3874435
34_0_34A,8908,34,true,1585434800,73,20,280.17,14484,277.59,283.15,False,0,43.7089118,-79.3874435
34_0_34A,8908,34,true,1585434829,74,24,279.94,14484,277.04,282.04,False,0,43.7097816,-79.3833389
34_0_34A,8908,34,true,1585434859,73,2,279.94,14484,277.04,282.04,False,0,43.7098693,-79.3827056
34_0_34A,8908,34,true,1585434890,73,14,279.94,14484,277.04,282.04,False,0,43.710411,-79.3801956
34_0_34A,8908,34,true,1585434889,73,14,279.94,14484,277.04,282.04,False,0,43.710411,-79.3801956
34_0_34A,8908,34,true,1585434919,77,20,279.94,14484,277.04,282.04,False,0,43.7106094,-79.3791503
34_0_34A,8908,34,true,1585434949,73,2,279.94,14484,277.04,282.04,False,0,43.7108726,-79.377861
34_0_34A,8908,34,true,1585434979,75,0,279.94,14484,277.04,282.04,False,0,43.7108726,-79.377861
34_0_34A,8908,34,true,1585435009,75,0,279.94,14484,277.04,282.04,False,0,43.7108726,-79.377861
34_0_34A,8908,34,true,1585435039,75,0,279.94,14484,277.04,282.04,False,0,43.7108726,-79.377861
34_0_34A,8908,34,true,1585435069,67,17,279.94,14484,277.04,282.04,False,0,43.7112274,-79.3759002
34_0_34A,8908,34,true,1585435070,67,17,279.94,14484,277.04,282.04,False,0,43.7112274,-79.3759002
34_0_34A,8908,34,true,1585435099,74,45,279.94,14484,277.04,282.04,False,0,43.7120742,-79.3721237
34_0_34A,8908,34,true,1585435130,73,37,279.94,14484,277.04,282.04,False,0,43.71315,-79.3667297
34_0_34A,8908,34,true,1585435129,73,37,279.94,14484,277.04,282.04,False,0,43.71315,-79.3667297
34_0_34A,8908,34,true,1585435159,75,0,279.94,14484,277.04,282.04,False,0,43.7134437,-79.3651428
34_0_34A,8908,34,true,1585435189,76,20,279.94,14484,277.04,282.04,False,0,43.7135581,-79.3647308
34_0_34A,8908,34,true,1585435190,76,20,279.94,14484,277.04,282.04,False,0,43.7135581,-79.3647308
34_0_34A,8908,34,true,1585435219,74,0,279.94,14484,277.04,282.04,False,0,43.7139167,-79.3624954
34_0_34A,8908,34,true,1585435220,74,0,279.94,14484,277.04,282.04,False,0,43.7139167,-79.3624954
34_0_34A,8908,34,true,1585435249,73,29,279.94,14484,277.04,282.04,False,0,43.7142002,-79.3614564
34_0_34A,8908,34,true,1585435250,73,29,279.94,14484,277.04,282.04,False,0,43.7142002,-79.3614564
34_0_34A,8908,34,true,1585435279,74,0,279.94,14484,277.04,282.04,False,0,43.7144052,-79.3602187
34_0_34A,8908,34,true,1585435280,74,0,279.94,14484,277.04,282.04,False,0,43.7144052,-79.3602187
34_0_34A,8908,34,true,1585435310,74,28,279.95,14484,277.04,282.04,False,0,43.7150882,-79.3577068
34_0_34A,8908,34,true,1585435309,74,28,279.95,14484,277.04,282.04,False,0,43.7150882,-79.3577068
34_0_34A,8908,34,true,1585435339,64,37,279.97,14484,277.04,282.04,False,0,43.7158225,-79.3540767
34_0_34A,8908,34,true,1585435370,65,32,279.97,14484,277.04,282.04,False,0,43.7169469,-79.3503577
34_0_34A,8908,34,true,1585435369,65,32,279.97,14484,277.04,282.04,False,0,43.7169469,-79.3503577
34_0_34A,8908,34,true,1585435400,69,41,279.97,14484,277.04,282.04,False,0,43.7182419,-79.3460436
34_0_34A,8908,34,true,1585435399,69,41,279.97,14484,277.04,282.04,False,0,43.7182419,-79.3460436
34_0_34A,8908,34,true,1585435429,65,39,279.99,14484,277.04,282.04,False,0,43.7194123,-79.3423177
34_0_34A,8908,34,true,1585435430,65,39,279.99,14484,277.04,282.04,False,0,43.7194123,-79.3423177
34_0_34A,8908,34,true,1585435459,66,11,279.99,14484,277.04,282.04,False,0,43.7203321,-79.3394047
34_0_34A,8908,34,true,1585435460,66,11,279.99,14484,277.04,282.04,False,0,43.7203321,-79.3394047
34_0_34A,8908,34,true,1585435489,78,0,279.99,14484,277.04,282.04,False,0,43.7204139,-79.3391189
34_0_34A,8908,34,true,1585435490,78,0,279.99,14484,277.04,282.04,False,0,43.7204139,-79.3391189
34_0_34A,8908,34,true,1585435519,65,27,279.99,14484,277.04,282.04,False,0,43.7206563,-79.3383289
34_0_34A,8908,34,true,1585435520,65,27,279.99,14484,277.04,282.04,False,0,43.7206563,-79.3383289
34_0_34A,8908,34,true,1585435550,65,15,279.99,14484,277.04,282.04,False,0,43.7205807,-79.3376717
34_0_34A,8908,34,true,1585435549,65,15,279.99,14484,277.04,282.04,False,0,43.7205807,-79.3376717
34_0_34A,8908,34,true,1585435579,67,35,280.01,14484,277.59,282.04,False,0,43.7218242,-79.3345246
34_0_34A,8908,34,true,1585435580,67,35,280.01,14484,277.59,282.04,False,0,43.7218242,-79.3345246
34_0_34A,8908,34,true,1585435610,69,0,280.01,14484,277.59,282.04,False,0,43.7224711,-79.3321935
34_0_34A,8908,34,true,1585435609,69,0,280.01,14484,277.59,282.04,False,0,43.7224711,-79.3321935
34_0_34A,8908,34,true,1585435640,69,0,280.01,14484,277.59,282.04,False,0,43.7224711,-79.3321935
34_0_34A,8908,34,true,1585435639,69,0,280.01,14484,277.59,282.04,False,0,43.7224711,-79.3321935
34_0_34A,8908,34,true,1585435669,69,0,280.01,14484,277.59,282.04,False,0,43.7224711,-79.3321935
34_0_34A,8908,34,true,1585435670,69,0,280.01,14484,277.59,282.04,False,0,43.7224711,-79.3321935
34_0_34A,8908,34,true,1585435699,66,27,280.01,14484,277.59,282.04,False,0,43.722772,-79.3313806
34_0_34A,8908,34,true,1585435700,66,27,280.01,14484,277.59,282.04,False,0,43.722772,-79.3313806
34_0_34A,8908,34,true,1585435729,70,33,280.01,14484,277.59,282.04,False,0,43.7238087,-79.3275243
34_0_34A,8908,34,true,1585435730,70,33,280.01,14484,277.59,282.04,False,0,43.7238087,-79.3275243
34_0_34A,8908,34,true,1585435759,68,13,280,14484,277.59,282.04,False,0,43.7245918,-79.3245347
34_0_34A,8908,34,true,1585435760,68,13,280,14484,277.59,282.04,False,0,43.7245918,-79.3245347
34_0_34A,8908,34,true,1585435789,70,1,280,14484,277.59,282.04,False,0,43.7246149,-79.3244452
34_0_34A,8908,34,true,1585435790,70,1,280,14484,277.59,282.04,False,0,43.7246149,-79.3244452
34_0_34A,8908,34,true,1585435819,71,39,279.96,14484,277.59,282.04,False,0,43.7254913,-79.3210842
34_0_34A,8908,34,true,1585435820,71,39,279.96,14484,277.59,282.04,False,0,43.7254913,-79.3210842
34_0_34A,8908,34,true,1585435849,79,11,279.96,14484,277.59,282.04,False,0,43.7259885,-79.3190702
34_0_34A,8908,34,true,1585435850,79,11,279.96,14484,277.59,282.04,False,0,43.7259885,-79.3190702
34_0_34A,8908,34,true,1585435879,95,33,279.96,14484,277.59,282.04,False,0,43.7262564,-79.315731
