dir,id,route,predable,time,hdg,spd,temp,vis,t_min,t_max,snow,rain,lat,lon
34_0_34A,8836,34,true,1585481934,216,0,278.52,8047,277.04,280.37,False,2,43.7212638,-79.2917175
34_0_34A,8836,34,true,1585481933,216,0,278.52,8047,277.04,280.37,False,2,43.7212638,-79.2917175
34_0_34A,8836,34,true,1585481964,216,0,278.62,8047,277.04,280.37,False,2,43.7212638,-79.2917175
34_0_34A,8836,34,true,1585481963,216,0,278.62,8047,277.04,280.37,False,2,43.7212638,-79.2917175
34_0_34A,8836,34,true,1585481993,216,0,278.62,8047,277.04,280.37,False,2,43.7212638,-79.2917175
34_0_34A,8836,34,true,1585481994,216,0,278.62,8047,277.04,280.37,False,2,43.7212638,-79.2917175
34_0_34A,8836,34,true,1585482023,216,0,278.62,8047,277.04,280.37,False,2,43.7212638,-79.2917175
34_0_34A,8836,34,true,1585482024,216,0,278.62,8047,277.04,280.37,False,2,43.7212638,-79.2917175
34_0_34A,8836,34,true,1585482054,216,0,278.62,8047,277.04,280.37,False,2,43.7212638,-79.2917175
34_0_34A,8836,34,true,1585482084,216,0,278.62,8047,277.04,280.37,False,2,43.7212638,-79.2917175
34_0_34A,8836,34,true,1585482083,216,0,278.62,8047,277.04,280.37,False,2,43.7212638,-79.2917175
34_0_34A,8836,34,true,1585482114,216,0,278.62,8047,277.04,280.37,False,2,43.7212638,-79.2917175
34_0_34A,8836,34,true,1585482113,216,0,278.62,8047,277.04,280.37,False,2,43.7212638,-79.2917175
34_0_34A,8836,34,true,1585482144,216,0,278.62,8047,277.04,280.37,False,2,43.7212638,-79.2917175
34_0_34A,8836,34,true,1585482143,216,0,278.62,8047,277.04,280.37,False,2,43.7212638,-79.2917175
34_0_34A,8836,34,true,1585482173,216,0,278.62,8047,277.04,280.37,False,2,43.7212638,-79.2917175
34_0_34A,8836,34,true,1585482174,216,0,278.62,8047,277.04,280.37,False,2,43.7212638,-79.2917175
34_0_34A,8836,34,true,1585482204,216,0,278.62,8047,277.04,280.37,False,2,43.7212638,-79.2917175
34_0_34A,8836,34,true,1585482203,216,0,278.62,8047,277.04,280.37,False,2,43.7212638,-79.2917175
34_0_34A,8836,34,true,1585482233,216,0,278.62,8047,277.04,280.37,False,2,43.7212638,-79.2917175
34_0_34A,8836,34,true,1585482234,216,0,278.62,8047,277.04,280.37,False,2,43.7212638,-79.2917175
34_0_34A,8836,34,true,1585482264,216,0,278.62,8047,277.04,280.37,False,2,43.7212638,-79.2917175
34_0_34A,8836,34,true,1585482263,216,0,278.62,8047,277.04,280.37,False,2,43.7212638,-79.2917175
34_0_34A,8836,34,true,1585482293,210,3,278.62,8047,277.04,280.37,False,2,43.7212638,-79.2917175
34_0_34A,8836,34,true,1585482294,210,3,278.62,8047,277.04,280.37,False,2,43.7212638,-79.2917175
34_0_34A,8836,34,true,1585482324,157,9,278.62,8047,277.04,280.37,False,2,43.7199983,-79.2928
34_0_34A,8836,34,true,1585482323,157,9,278.62,8047,277.04,280.37,False,2,43.7199983,-79.2928
34_0_34A,8836,34,true,1585482354,73,37,278.62,8047,277.04,280.37,False,2,43.7204066,-79.290155
34_0_34A,8836,34,true,1585482353,73,37,278.62,8047,277.04,280.37,False,2,43.7204066,-79.290155
34_0_34A,8836,34,true,1585482384,343,36,278.62,8047,277.04,280.37,False,2,43.7221066,-79.289355
34_0_34A,8836,34,true,1585482385,343,36,278.62,8047,277.04,280.37,False,2,43.7221066,-79.289355
34_0_34A,8836,34,true,1585482414,343,34,278.62,8047,277.04,280.37,False,2,43.7247116,-79.290465
34_0_34A,8836,34,true,1585482415,343,34,278.62,8047,277.04,280.37,False,2,43.7247116,-79.290465
34_0_34A,8836,34,true,1585482445,336,26,278.61,8047,277.04,280.37,False,2,43.72646,-79.2912983
34_0_34A,8836,34,true,1585482444,336,26,278.61,8047,277.04,280.37,False,2,43.72646,-79.2912983
34_0_34A,8836,34,true,1585482474,216,0,278.61,8047,277.04,280.37,False,2,43.7267466,-79.2914583
34_0_34A,8836,34,true,1585482475,216,0,278.61,8047,277.04,280.37,False,2,43.7267466,-79.2914583
34_0_34A,8836,34,true,1585482504,251,34,278.61,8047,277.04,280.37,False,2,43.726825,-79.2927116
34_0_34A,8836,34,true,1585482505,251,34,278.61,8047,277.04,280.37,False,2,43.726825,-79.2927116
34_0_34A,8836,34,true,1585482534,253,34,278.6,8047,277.04,280.37,False,2,43.7259483,-79.2966333
34_0_34A,8836,34,true,1585482535,253,34,278.6,8047,277.04,280.37,False,2,43.7259483,-79.2966333
34_0_34A,8836,34,true,1585482564,216,0,278.6,8047,277.04,280.37,False,2,43.7258116,-79.29725
34_0_34A,8836,34,true,1585482565,216,0,278.6,8047,277.04,280.37,False,2,43.7258116,-79.29725
34_0_34A,8836,34,true,1585482594,216,0,278.6,8047,277.04,280.37,False,2,43.7258116,-79.29725
34_0_34A,8836,34,true,1585482595,216,0,278.6,8047,277.04,280.37,False,2,43.7258116,-79.29725
34_0_34A,8836,34,true,1585482624,253,30,278.6,8047,277.04,280.37,False,2,43.725715,-79.2976883
34_0_34A,8836,34,true,1585482625,253,30,278.6,8047,277.04,280.37,False,2,43.725715,-79.2976883
34_0_34A,8836,34,true,1585482655,262,31,278.6,8047,277.04,280.37,False,2,43.724905,-79.30193
34_0_34A,8836,34,true,1585482654,262,31,278.6,8047,277.04,280.37,False,2,43.724905,-79.30193
34_0_34A,8836,34,true,1585482684,216,0,278.6,8047,277.04,280.37,False,2,43.7248533,-79.302445
34_0_34A,8836,34,true,1585482685,216,0,278.6,8047,277.04,280.37,False,2,43.7248533,-79.302445
34_0_34A,8836,34,true,1585482714,262,19,278.6,8047,277.04,280.37,False,2,43.72483,-79.302635
34_0_34A,8836,34,true,1585482715,262,19,278.6,8047,277.04,280.37,False,2,43.72483,-79.302635
34_0_34A,8836,34,true,1585482745,282,39,278.62,8047,277.04,280.37,False,2,43.7250583,-79.3067499
34_0_34A,8836,34,true,1585482744,282,39,278.62,8047,277.04,280.37,False,2,43.7250583,-79.3067499
34_0_34A,8836,34,true,1585482775,286,37,278.62,8047,277.04,280.37,False,2,43.72571,-79.31079
34_0_34A,8836,34,true,1585482774,286,37,278.62,8047,277.04,280.37,False,2,43.72571,-79.31079
34_0_34A,8836,34,true,1585482805,274,39,278.62,8047,277.04,280.37,False,2,43.726305,-79.31497
34_0_34A,8836,34,true,1585482804,274,39,278.62,8047,277.04,280.37,False,2,43.726305,-79.31497
34_0_34A,8836,34,true,1585482834,255,36,278.61,8047,277.04,280.37,False,2,43.7260866,-79.3190466
34_0_34A,8836,34,true,1585482835,255,36,278.61,8047,277.04,280.37,False,2,43.7260866,-79.3190466
34_0_34A,8836,34,true,1585482864,251,39,278.61,8047,277.04,280.37,False,2,43.7250633,-79.3230783
34_0_34A,8836,34,true,1585482865,251,39,278.61,8047,277.04,280.37,False,2,43.7250633,-79.3230783
34_0_34A,8836,34,true,1585482895,250,37,278.59,8047,277.04,280.37,False,2,43.72401,-79.327295
34_0_34A,8836,34,true,1585482894,250,37,278.59,8047,277.04,280.37,False,2,43.72401,-79.327295
34_0_34A,8836,34,true,1585482925,249,35,278.59,8047,277.04,279.82,False,2,43.7229466,-79.3312483
34_0_34A,8836,34,true,1585482924,249,35,278.59,8047,277.04,279.82,False,2,43.7229466,-79.3312483
34_0_34A,8836,34,true,1585482955,246,35,278.59,8047,277.04,279.82,False,2,43.7219066,-79.3347783
34_0_34A,8836,34,true,1585482954,246,35,278.59,8047,277.04,279.82,False,2,43.7219066,-79.3347783
34_0_34A,8836,34,true,1585482984,246,33,278.55,8047,276.48,279.82,False,2,43.7208366,-79.3385033
34_0_34A,8836,34,true,1585482985,246,33,278.55,8047,276.48,279.82,False,2,43.7208366,-79.3385033
34_0_34A,8836,34,true,1585483015,245,43,278.55,8047,276.48,279.82,False,2,43.71956,-79.3423916
34_0_34A,8836,34,true,1585483014,245,43,278.55,8047,276.48,279.82,False,2,43.71956,-79.3423916
34_0_34A,8836,34,true,1585483045,246,42,278.53,8047,276.48,279.82,False,2,43.718105,-79.346755
34_0_34A,8836,34,true,1585483044,246,42,278.53,8047,276.48,279.82,False,2,43.718105,-79.346755
34_0_34A,8836,34,true,1585483074,245,40,278.53,8047,276.48,279.82,False,2,43.7168116,-79.3509483
34_0_34A,8836,34,true,1585483075,245,40,278.53,8047,276.48,279.82,False,2,43.7168116,-79.3509483
34_0_34A,8836,34,true,1585483104,248,41,278.53,8047,276.48,279.82,False,2,43.71594,-79.353695
