dir,id,route,predable,time,hdg,spd,temp,vis,t_min,t_max,snow,rain,lat,lon
34_0_34C,8648,34,true,1585440741,216,0,279.41,14484,277.59,281.15,False,0,43.721185,-79.2915066
34_0_34C,8648,34,true,1585440771,216,0,279.41,14484,277.59,281.15,False,0,43.721185,-79.2915066
34_0_34C,8648,34,true,1585440801,216,0,279.41,14484,277.59,281.15,False,0,43.721185,-79.2915066
34_0_34C,8648,34,true,1585440831,216,0,279.41,14484,277.59,281.15,False,0,43.721185,-79.2915066
34_0_34C,8648,34,true,1585440861,216,0,279.41,14484,277.59,281.15,False,0,43.721185,-79.2915066
34_0_34C,8648,34,true,1585440862,216,0,279.41,14484,277.59,281.15,False,0,43.721185,-79.2915066
34_0_34C,8648,34,true,1585440891,216,0,279.41,14484,277.59,281.15,False,0,43.721185,-79.2915066
34_0_34C,8648,34,true,1585440892,216,0,279.41,14484,277.59,281.15,False,0,43.721185,-79.2915066
34_0_34C,8648,34,true,1585440921,216,0,279.41,14484,277.59,281.15,False,0,43.721185,-79.2915066
34_0_34C,8648,34,true,1585440922,216,0,279.41,14484,277.59,281.15,False,0,43.721185,-79.2915066
34_0_34C,8648,34,true,1585440951,216,0,279.41,14484,277.59,281.15,False,0,43.721185,-79.2915066
34_0_34C,8648,34,true,1585440981,216,0,279.41,14484,277.59,281.15,False,0,43.721185,-79.2915066
34_0_34C,8648,34,true,1585440982,216,0,279.41,14484,277.59,281.15,False,0,43.721185,-79.2915066
34_0_34C,8648,34,true,1585441011,216,0,279.41,14484,277.59,281.15,False,0,43.721185,-79.2915066
34_0_34C,8648,34,true,1585441012,216,0,279.41,14484,277.59,281.15,False,0,43.721185,-79.2915066
34_0_34C,8648,34,true,1585441041,216,0,279.41,14484,277.59,281.15,False,0,43.721185,-79.2915066
34_0_34C,8648,34,true,1585441042,216,0,279.41,14484,277.59,281.15,False,0,43.721185,-79.2915066
34_0_34C,8648,34,true,1585441071,216,0,279.41,14484,277.59,281.15,False,0,43.721185,-79.2915066
34_0_34C,8648,34,true,1585441072,216,0,279.41,14484,277.59,281.15,False,0,43.721185,-79.2915066
34_0_34C,8648,34,true,1585441101,216,0,279.41,14484,277.59,281.15,False,0,43.721185,-79.2915066
34_0_34C,8648,34,true,1585441131,216,0,279.41,14484,277.59,281.15,False,0,43.721185,-79.2915066
34_0_34C,8648,34,true,1585441132,216,0,279.41,14484,277.59,281.15,False,0,43.721185,-79.2915066
34_0_34C,8648,34,true,1585441162,216,0,279.41,14484,277.59,281.15,False,0,43.721185,-79.2915066
34_0_34C,8648,34,true,1585441161,216,0,279.41,14484,277.59,281.15,False,0,43.721185,-79.2915066
34_0_34C,8648,34,true,1585441191,216,0,279.41,14484,277.59,281.15,False,0,43.721185,-79.2915066
34_0_34C,8648,34,true,1585441192,216,0,279.41,14484,277.59,281.15,False,0,43.721185,-79.2915066
34_0_34C,8648,34,true,1585441221,216,0,279.41,14484,277.59,281.15,False,0,43.721185,-79.2915066
34_0_34C,8648,34,true,1585441222,216,0,279.41,14484,277.59,281.15,False,0,43.721185,-79.2915066
34_0_34C,8648,34,true,1585441251,216,0,279.41,14484,277.59,281.15,False,0,43.721185,-79.2915066
34_0_34C,8648,34,true,1585441252,216,0,279.41,14484,277.59,281.15,False,0,43.721185,-79.2915066
34_0_34C,8648,34,true,1585441282,216,0,279.41,14484,277.59,281.15,False,0,43.721185,-79.2915066
34_0_34C,8648,34,true,1585441281,216,0,279.41,14484,277.59,281.15,False,0,43.721185,-79.2915066
34_0_34C,8648,34,true,1585441311,216,0,279.41,14484,277.59,281.15,False,0,43.721185,-79.2915066
34_0_34C,8648,34,true,1585441312,216,0,279.41,14484,277.59,281.15,False,0,43.721185,-79.2915066
34_0_34C,8648,34,true,1585441341,216,0,279.34,14484,277.59,281.15,False,0,43.721185,-79.2915066
34_0_34C,8648,34,true,1585441342,216,0,279.34,14484,277.59,281.15,False,0,43.721185,-79.2915066
34_0_34C,8648,34,true,1585441372,216,0,279.34,14484,277.59,281.15,False,0,43.721185,-79.2915066
34_0_34C,8648,34,true,1585441371,216,0,279.34,14484,277.59,281.15,False,0,43.721185,-79.2915066
34_0_34C,8648,34,true,1585441402,216,0,279.34,14484,277.59,281.15,False,0,43.721185,-79.2915066
34_0_34C,8648,34,true,1585441401,216,0,279.34,14484,277.59,281.15,False,0,43.721185,-79.2915066
34_0_34C,8648,34,true,1585441431,204,8,279.34,14484,277.59,281.15,False,0,43.7207666,-79.2915766
34_0_34C,8648,34,true,1585441432,204,8,279.34,14484,277.59,281.15,False,0,43.7207666,-79.2915766
34_0_34C,8648,34,true,1585441462,337,18,279.34,14484,277.59,281.15,False,0,43.72083,-79.292445
34_0_34C,8648,34,true,1585441461,337,18,279.34,14484,277.59,281.15,False,0,43.72083,-79.292445
34_0_34C,8648,34,true,1585441492,199,14,279.34,14484,277.59,281.15,False,0,43.72136,-79.293315
34_0_34C,8648,34,true,1585441491,199,14,279.34,14484,277.59,281.15,False,0,43.72136,-79.293315
34_0_34C,8648,34,true,1585441521,172,14,279.34,14484,277.59,281.15,False,0,43.7201733,-79.2928716
34_0_34C,8648,34,true,1585441551,216,0,279.34,14484,277.59,281.15,False,0,43.7201216,-79.2928566
34_0_34C,8648,34,true,1585441552,216,0,279.34,14484,277.59,281.15,False,0,43.7201216,-79.2928566
34_0_34C,8648,34,true,1585441582,216,0,279.34,14484,277.59,281.15,False,0,43.7201216,-79.2928566
34_0_34C,8648,34,true,1585441581,216,0,279.34,14484,277.59,281.15,False,0,43.7201216,-79.2928566
34_0_34C,8648,34,true,1585441611,216,0,279.34,14484,277.59,281.15,False,0,43.7200466,-79.2928249
34_0_34C,8648,34,true,1585441612,216,0,279.34,14484,277.59,281.15,False,0,43.7200466,-79.2928249
34_0_34C,8648,34,true,1585441641,68,21,279.34,14484,277.59,281.15,False,0,43.7198733,-79.2923233
34_0_34C,8648,34,true,1585441672,49,21,279.34,14484,277.59,281.15,False,0,43.72075,-79.2888183
34_0_34C,8648,34,true,1585441671,49,21,279.34,14484,277.59,281.15,False,0,43.72075,-79.2888183
34_0_34C,8648,34,true,1585441701,343,34,279.34,14484,277.59,281.15,False,0,43.7232883,-79.2898283
34_0_34C,8648,34,true,1585441702,343,34,279.34,14484,277.59,281.15,False,0,43.7232883,-79.2898283
34_0_34C,8648,34,true,1585441731,344,9,279.34,14484,277.59,281.15,False,0,43.7240833,-79.2901516
34_0_34C,8648,34,true,1585441732,344,9,279.34,14484,277.59,281.15,False,0,43.7240833,-79.2901516
34_0_34C,8648,34,true,1585441764,337,26,279.05,14484,277.59,280.37,False,0,43.7265299,-79.291295
34_0_34C,8648,34,true,1585441791,216,0,279.05,14484,277.59,280.37,False,0,43.726765,-79.2914216
34_0_34C,8648,34,true,1585441792,216,0,279.05,14484,277.59,280.37,False,0,43.726765,-79.2914216
34_0_34C,8648,34,true,1585441822,337,14,279.05,14484,277.59,280.37,False,0,43.7268616,-79.2914783
34_0_34C,8648,34,true,1585441821,337,14,279.05,14484,277.59,280.37,False,0,43.7268616,-79.2914783
34_0_34C,8648,34,true,1585441852,253,36,279.05,14484,277.59,280.37,False,0,43.7264066,-79.2945483
34_0_34C,8648,34,true,1585441851,253,36,279.05,14484,277.59,280.37,False,0,43.7264066,-79.2945483
34_0_34C,8648,34,true,1585441881,253,36,279.35,14484,277.59,281.15,False,0,43.725525,-79.2986066
34_0_34C,8648,34,true,1585441882,253,36,279.35,14484,277.59,281.15,False,0,43.725525,-79.2986066
34_0_34C,8648,34,true,1585441912,263,3,279.1,14484,277.59,280.37,False,0,43.7249083,-79.301965
34_0_34C,8648,34,true,1585441911,263,3,279.1,14484,277.59,280.37,False,0,43.7249083,-79.301965
34_0_34C,8648,34,true,1585441941,216,0,279.1,14484,277.59,280.37,False,0,43.7249066,-79.30198
34_0_34C,8648,34,true,1585441942,216,0,279.1,14484,277.59,280.37,False,0,43.7249066,-79.30198
34_0_34C,8648,34,true,1585441971,263,3,279.1,14484,277.59,280.37,False,0,43.7248966,-79.3020866
34_0_34C,8648,34,true,1585441972,263,3,279.1,14484,277.59,280.37,False,0,43.7248966,-79.3020866
34_0_34C,8648,34,true,1585442002,262,24,279.1,14484,277.59,280.37,False,0,43.7248233,-79.3027533
34_0_34C,8648,34,true,1585442001,262,24,279.1,14484,277.59,280.37,False,0,43.7248233,-79.3027533
34_0_34C,8648,34,true,1585442032,277,36,279.04,14484,278.15,279.82,False,0,43.7248783,-79.3053066
