dir,id,route,predable,time,hdg,spd,temp,vis,t_min,t_max,snow,rain,lat,lon
34_1_34A,8845,34,true,1585433570,249,0,280.18,14484,277.59,283.15,False,0,43.7238062,-79.3279689
34_1_34A,8845,34,true,1585433569,249,0,280.18,14484,277.59,283.15,False,0,43.7238062,-79.3279689
34_1_34A,8845,34,true,1585433599,248,5,280.18,14484,277.59,283.15,False,0,43.7230862,-79.3303916
34_1_34A,8845,34,true,1585433600,248,5,280.18,14484,277.59,283.15,False,0,43.7230862,-79.3303916
34_1_34A,8845,34,true,1585433629,247,30,280.18,14484,277.59,283.15,False,0,43.7224769,-79.3323669
34_1_34A,8845,34,true,1585433630,247,30,280.18,14484,277.59,283.15,False,0,43.7224769,-79.3323669
34_1_34A,8845,34,true,1585433659,251,25,280.13,14484,276.48,283.15,False,0,43.7214189,-79.3358556
34_1_34A,8845,34,true,1585433660,251,25,280.13,14484,276.48,283.15,False,0,43.7214189,-79.3358556
34_1_34A,8845,34,true,1585433689,251,0,280.13,14484,276.48,283.15,False,0,43.7208216,-79.3377955
34_1_34A,8845,34,true,1585433690,251,0,280.13,14484,276.48,283.15,False,0,43.7208216,-79.3377955
34_1_34A,8845,34,true,1585433719,244,43,280.13,14484,276.48,283.15,False,0,43.7204061,-79.3399718
34_1_34A,8845,34,true,1585433720,244,43,280.13,14484,276.48,283.15,False,0,43.7204061,-79.3399718
34_1_34A,8845,34,true,1585433750,247,34,280.13,14484,276.48,283.15,False,0,43.7188371,-79.3441522
34_1_34A,8845,34,true,1585433749,247,34,280.13,14484,276.48,283.15,False,0,43.7188371,-79.3441522
34_1_34A,8845,34,true,1585433779,252,34,280.1,14484,276.48,283.15,False,0,43.7176558,-79.3479943
34_1_34A,8845,34,true,1585433780,252,34,280.1,14484,276.48,283.15,False,0,43.7176558,-79.3479943
34_1_34A,8845,34,true,1585433809,248,29,280.1,14484,276.48,283.15,False,0,43.7164708,-79.3517696
34_1_34A,8845,34,true,1585433810,248,29,280.1,14484,276.48,283.15,False,0,43.7164708,-79.3517696
34_1_34A,8845,34,true,1585433839,250,39,280.1,14484,276.48,283.15,False,0,43.7157625,-79.3543217
34_1_34A,8845,34,true,1585433840,250,39,280.1,14484,276.48,283.15,False,0,43.7157625,-79.3543217
34_1_34A,8845,34,true,1585433869,249,36,280.06,14484,276.48,283.15,False,0,43.7149934,-79.358143
34_1_34A,8845,34,true,1585433870,249,36,280.06,14484,276.48,283.15,False,0,43.7149934,-79.358143
34_1_34A,8845,34,true,1585433899,255,0,280.06,14484,276.48,283.15,False,0,43.7146328,-79.3597191
34_1_34A,8845,34,true,1585433900,255,0,280.06,14484,276.48,283.15,False,0,43.7146328,-79.3597191
34_1_34A,8845,34,true,1585433929,253,30,280.06,14484,276.48,283.15,False,0,43.7143415,-79.361496
34_1_34A,8845,34,true,1585433930,253,30,280.06,14484,276.48,283.15,False,0,43.7143415,-79.361496
34_1_34A,8845,34,true,1585433960,254,0,280.06,14484,276.48,283.15,False,0,43.7142574,-79.3619003
34_1_34A,8845,34,true,1585433959,254,0,280.06,14484,276.48,283.15,False,0,43.7142574,-79.3619003
34_1_34A,8845,34,true,1585433989,254,0,280.06,14484,276.48,283.15,False,0,43.714096,-79.3623867
34_1_34A,8845,34,true,1585433990,254,0,280.06,14484,276.48,283.15,False,0,43.714096,-79.3623867
34_1_34A,8845,34,true,1585434019,255,24,280.06,14484,276.48,283.15,False,0,43.7135962,-79.3646214
34_1_34A,8845,34,true,1585434020,255,24,280.06,14484,276.48,283.15,False,0,43.7135962,-79.3646214
34_1_34A,8845,34,true,1585434049,247,16,280.04,14484,276.48,283.15,False,0,43.7135536,-79.3653348
34_1_34A,8845,34,true,1585434050,247,16,280.04,14484,276.48,283.15,False,0,43.7135536,-79.3653348
34_1_34A,8845,34,true,1585434080,254,0,280.04,14484,276.48,283.15,False,0,43.7131996,-79.3669815
34_1_34A,8845,34,true,1585434079,254,0,280.04,14484,276.48,283.15,False,0,43.7131996,-79.3669815
34_1_34A,8845,34,true,1585434109,253,38,280.04,14484,276.48,283.15,False,0,43.7126214,-79.3696162
34_1_34A,8845,34,true,1585434110,253,38,280.04,14484,276.48,283.15,False,0,43.7126214,-79.3696162
34_1_34A,8845,34,true,1585434139,254,28,280.04,14484,276.48,283.15,False,0,43.7116862,-79.3745036
34_1_34A,8845,34,true,1585434140,254,28,280.04,14484,276.48,283.15,False,0,43.7116862,-79.3745036
34_1_34A,8845,34,true,1585434170,245,7,280.17,14484,277.59,283.15,False,0,43.7114181,-79.3758951
34_1_34A,8845,34,true,1585434169,245,7,280.17,14484,277.59,283.15,False,0,43.7114181,-79.3758951
34_1_34A,8845,34,true,1585434200,257,23,280.17,14484,277.59,283.15,False,0,43.7107698,-79.3783161
34_1_34A,8845,34,true,1585434199,257,23,280.17,14484,277.59,283.15,False,0,43.7107698,-79.3783161
34_1_34A,8845,34,true,1585434229,254,32,280.17,14484,277.59,283.15,False,0,43.7101818,-79.381481
34_1_34A,8845,34,true,1585434230,254,32,280.17,14484,277.59,283.15,False,0,43.7101818,-79.381481
34_1_34A,8845,34,true,1585434260,254,41,280.17,14484,277.59,283.15,False,0,43.7095496,-79.3847346
34_1_34A,8845,34,true,1585434259,254,41,280.17,14484,277.59,283.15,False,0,43.7095496,-79.3847346
34_1_34A,8845,34,true,1585434289,254,26,280.02,14484,276.48,283.15,False,0,43.7087863,-79.388557
34_1_34A,8845,34,true,1585434290,254,26,280.02,14484,276.48,283.15,False,0,43.7087863,-79.388557
34_1_34A,8845,34,true,1585434319,254,25,280.02,14484,276.48,283.15,False,0,43.7081974,-79.3911674
34_1_34A,8845,34,true,1585434320,254,25,280.02,14484,276.48,283.15,False,0,43.7081974,-79.3911674
34_1_34A,8845,34,true,1585434350,254,0,280.17,14484,277.59,283.15,False,0,43.7079887,-79.3926467
34_1_34A,8845,34,true,1585434349,254,0,280.17,14484,277.59,283.15,False,0,43.7079887,-79.3926467
34_1_34A,8845,34,true,1585434379,257,29,280.17,14484,277.59,283.15,False,0,43.7076697,-79.3937424
34_1_34A,8845,34,true,1585434409,253,0,280.17,14484,277.59,283.15,False,0,43.7074365,-79.3953062
34_1_34A,8845,34,true,1585434410,253,0,280.17,14484,277.59,283.15,False,0,43.7074365,-79.3953062
34_1_34A,8845,34,true,1585434439,252,6,280.17,14484,277.59,283.15,False,0,43.7074584,-79.3952484
34_1_34A,8845,34,true,1585434440,252,6,280.17,14484,277.59,283.15,False,0,43.7074584,-79.3952484
34_1_34A,8845,34,true,1585434469,254,17,280.17,14484,277.59,283.15,False,0,43.7069129,-79.3974773
34_1_34A,8845,34,true,1585434470,254,17,280.17,14484,277.59,283.15,False,0,43.7069129,-79.3974773
34_1_34A,8845,34,true,1585434499,253,19,280.17,14484,277.59,283.15,False,0,43.7065543,-79.3992134
34_1_34A,8845,34,true,1585434500,253,19,280.17,14484,277.59,283.15,False,0,43.7065543,-79.3992134
34_1_34A,8845,34,true,1585434530,265,5,280.17,14484,277.59,283.15,False,0,43.7063827,-79.4000727
34_1_34A,8845,34,true,1585434560,95,21,280.17,14484,277.59,283.15,False,0,43.7055469,-79.399676
34_1_34A,8845,34,true,1585434559,95,21,280.17,14484,277.59,283.15,False,0,43.7055469,-79.399676
34_1_34A,8845,34,true,1585434589,90,14,280.17,14484,277.59,283.15,False,0,43.7050933,-79.3985671
34_1_34A,8845,34,true,1585434590,90,14,280.17,14484,277.59,283.15,False,0,43.7050933,-79.3985671
34_1_34A,8845,34,true,1585434619,173,0,280.17,14484,277.59,283.15,False,0,43.7050933,-79.3985671
34_1_34A,8845,34,true,1585434620,173,0,280.17,14484,277.59,283.15,False,0,43.7050933,-79.3985671
34_1_34A,8845,34,true,1585434650,334,12,280.17,14484,277.59,283.15,False,0,43.7050933,-79.3985671
34_1_34A,8845,34,true,1585434649,334,12,280.17,14484,277.59,283.15,False,0,43.7050933,-79.3985671
34_1_34A,8845,34,true,1585434679,158,4,280.17,14484,277.59,283.15,False,0,43.7050933,-79.3985671
34_1_34A,8845,34,true,1585434680,158,4,280.17,14484,277.59,283.15,False,0,43.7050933,-79.3985671
34_1_34A,8845,34,true,1585434709,173,0,280.17,14484,277.59,283.15,False,0,43.7050933,-79.3985671
34_1_34A,8845,34,true,1585434710,173,0,280.17,14484,277.59,283.15,False,0,43.7050933,-79.3985671
34_1_34A,8845,34,true,1585434739,173,0,280.17,14484,277.59,283.15,False,0,43.7050933,-79.3985671
34_1_34A,8845,34,true,1585434740,173,0,280.17,14484,277.59,283.15,False,0,43.7050933,-79.3985671
34_1_34A,8845,34,true,1585434770,173,0,280.02,14484,277.59,282.04,False,0,43.7050933,-79.3985671
34_1_34A,8845,34,true,1585434769,173,0,280.02,14484,277.59,282.04,False,0,43.7050933,-79.3985671
34_1_34A,8845,34,true,1585434800,173,0,280.02,14484,277.59,282.04,False,0,43.7050933,-79.3985671
34_1_34A,8845,34,true,1585434799,173,0,280.02,14484,277.59,282.04,False,0,43.7050933,-79.3985671
34_1_34A,8845,34,true,1585434830,173,0,280.02,14484,277.59,282.04,False,0,43.7050933,-79.3985671
34_1_34A,8845,34,true,1585434829,173,0,280.02,14484,277.59,282.04,False,0,43.7050933,-79.3985671
34_1_34A,8845,34,true,1585434860,173,0,280.02,14484,277.59,282.04,False,0,43.7050933,-79.3985671
34_1_34A,8845,34,true,1585434859,173,0,280.02,14484,277.59,282.04,False,0,43.7050933,-79.3985671
34_1_34A,8845,34,true,1585434890,173,0,280.02,14484,277.59,282.04,False,0,43.7050933,-79.3985671
34_1_34A,8845,34,true,1585434889,173,0,280.02,14484,277.59,282.04,False,0,43.7050933,-79.3985671
34_1_34A,8845,34,true,1585434919,173,0,280.02,14484,277.59,282.04,False,0,43.7050933,-79.3985671
34_1_34A,8845,34,true,1585434920,173,0,280.02,14484,277.59,282.04,False,0,43.7050933,-79.3985671
34_1_34A,8845,34,true,1585435550,40,6,279.91,14484,277.04,282.04,False,0,43.7050933,-79.3985671
34_1_34A,8845,34,true,1585435549,40,6,279.91,14484,277.04,282.04,False,0,43.7050933,-79.3985671
34_1_34A,8845,34,true,1585435580,173,0,279.91,14484,277.04,282.04,False,0,43.70509,-79.3985166
34_1_34A,8845,34,true,1585435579,173,0,279.91,14484,277.04,282.04,False,0,43.70509,-79.3985166
34_1_34A,8845,34,true,1585435610,173,0,279.91,14484,277.04,282.04,False,0,43.70509,-79.3985166
34_1_34A,8845,34,true,1585435609,173,0,279.91,14484,277.04,282.04,False,0,43.70509,-79.3985166
34_1_34A,8845,34,true,1585437891,64,9,279.68,14484,277.59,281.48,False,0,43.7329464,-79.2637389
34_1_34A,8845,34,true,1585437921,67,0,279.68,14484,277.59,281.48,False,0,43.7330497,-79.2632947
34_1_34A,8845,34,true,1585437920,67,0,279.68,14484,277.59,281.48,False,0,43.7330497,-79.2632947
34_1_34A,8845,34,true,1585437950,67,0,279.68,14484,277.59,281.48,False,0,43.7330497,-79.2632947
34_1_34A,8845,34,true,1585437951,67,0,279.68,14484,277.59,281.48,False,0,43.7330497,-79.2632947
34_1_34A,8845,34,true,1585437981,67,0,279.68,14484,277.59,281.48,False,0,43.7330497,-79.2632947
34_1_34A,8845,34,true,1585437980,67,0,279.68,14484,277.59,281.48,False,0,43.7330497,-79.2632947
34_1_34A,8845,34,true,1585438011,67,0,279.68,14484,277.59,281.48,False,0,43.7330497,-79.2632947
34_1_34A,8845,34,true,1585438010,67,0,279.68,14484,277.59,281.48,False,0,43.7330497,-79.2632947
34_1_34A,8845,34,true,1585438040,67,0,279.68,14484,277.59,281.48,False,0,43.7330497,-79.2632947
34_1_34A,8845,34,true,1585438071,67,0,279.68,14484,277.59,281.48,False,0,43.7330497,-79.2632947
34_1_34A,8845,34,true,1585438101,67,0,279.68,14484,277.59,281.48,False,0,43.7330497,-79.2632947
34_1_34A,8845,34,true,1585438131,67,0,279.68,14484,277.59,281.48,False,0,43.7330497,-79.2632947
34_1_34A,8845,34,true,1585438161,67,0,279.8,14484,278.15,281.48,False,0,43.7330497,-79.2632947
34_1_34A,8845,34,true,1585438191,67,0,279.8,14484,278.15,281.48,False,0,43.7330497,-79.2632947
34_1_34A,8845,34,true,1585438220,256,16,279.8,14484,278.15,281.48,False,0,43.7324483,-79.26335
34_1_34A,8845,34,true,1585438221,256,16,279.8,14484,278.15,281.48,False,0,43.7324483,-79.26335
34_1_34A,8845,34,true,1585438251,40,9,279.8,14484,278.15,281.48,False,0,43.7322502,-79.2640686
34_1_34A,8845,34,true,1585438250,40,9,279.8,14484,278.15,281.48,False,0,43.7322502,-79.2640686
34_1_34A,8845,34,true,1585438281,216,0,279.8,14484,278.15,281.48,False,0,43.7323036,-79.2636871
34_1_34A,8845,34,true,1585438280,216,0,279.8,14484,278.15,281.48,False,0,43.7323036,-79.2636871
34_1_34A,8845,34,true,1585438311,11,18,279.8,14484,278.15,281.48,False,0,43.7329711,-79.2631759
34_1_34A,8845,34,true,1585438341,252,32,279.78,14484,278.15,281.48,False,0,43.7331047,-79.2652587
34_1_34A,8845,34,true,1585438340,252,32,279.78,14484,278.15,281.48,False,0,43.7331047,-79.2652587
34_1_34A,8845,34,true,1585438371,258,24,279.78,14484,278.15,281.48,False,0,43.7324409,-79.2673187
34_1_34A,8845,34,true,1585438370,258,24,279.78,14484,278.15,281.48,False,0,43.7324409,-79.2673187
34_1_34A,8845,34,true,1585438401,265,0,279.78,14484,278.15,281.48,False,0,43.7324142,-79.2677459
34_1_34A,8845,34,true,1585438400,265,0,279.78,14484,278.15,281.48,False,0,43.7324142,-79.2677459
34_1_34A,8845,34,true,1585438433,265,0,279.78,14484,278.15,281.48,False,0,43.7324142,-79.2677459
34_1_34A,8845,34,true,1585438461,251,36,279.78,14484,278.15,281.48,False,0,43.7319183,-79.269104
34_1_34A,8845,34,true,1585438460,251,36,279.78,14484,278.15,281.48,False,0,43.7319183,-79.269104
34_1_34A,8845,34,true,1585438490,252,0,279.78,14484,278.15,281.48,False,0,43.7313232,-79.2716751
34_1_34A,8845,34,true,1585438491,252,0,279.78,14484,278.15,281.48,False,0,43.7313232,-79.2716751
34_1_34A,8845,34,true,1585438520,245,14,279.78,14484,278.15,281.48,False,0,43.7310256,-79.2733078
34_1_34A,8845,34,true,1585438521,245,14,279.78,14484,278.15,281.48,False,0,43.7310256,-79.2733078
34_1_34A,8845,34,true,1585438551,253,25,279.78,14484,278.15,281.48,False,0,43.730709,-79.2744216
34_1_34A,8845,34,true,1585438581,252,7,279.8,14484,278.15,281.48,False,0,43.7301673,-79.2775497
34_1_34A,8845,34,true,1585438580,252,7,279.8,14484,278.15,281.48,False,0,43.7301673,-79.2775497
34_1_34A,8845,34,true,1585438611,253,0,279.8,14484,278.15,281.48,False,0,43.7301673,-79.2775497
34_1_34A,8845,34,true,1585438610,253,0,279.8,14484,278.15,281.48,False,0,43.7301673,-79.2775497
34_1_34A,8845,34,true,1585438641,251,29,279.8,14484,278.15,281.48,False,0,43.7299079,-79.2780838
34_1_34A,8845,34,true,1585438640,251,29,279.8,14484,278.15,281.48,False,0,43.7299079,-79.2780838
34_1_34A,8845,34,true,1585438671,253,33,279.8,14484,278.15,281.48,False,0,43.7296333,-79.2794494
34_1_34A,8845,34,true,1585438670,253,33,279.8,14484,278.15,281.48,False,0,43.7296333,-79.2794494
34_1_34A,8845,34,true,1585438701,253,33,279.8,14484,278.15,281.48,False,0,43.7287139,-79.2842178
34_1_34A,8845,34,true,1585438700,253,33,279.8,14484,278.15,281.48,False,0,43.7287139,-79.2842178
34_1_34A,8845,34,true,1585438731,253,35,279.8,14484,278.15,281.48,False,0,43.7284045,-79.2850929
34_1_34A,8845,34,true,1585438730,253,35,279.8,14484,278.15,281.48,False,0,43.7284045,-79.2850929
34_1_34A,8845,34,true,1585438761,253,6,279.8,14484,278.15,281.48,False,0,43.7281073,-79.2867066
34_1_34A,8845,34,true,1585439364,286,28,279.57,14484,277.59,281.48,False,0,43.7251982,-79.3080374
34_1_34A,8845,34,true,1585439363,286,28,279.57,14484,277.59,281.48,False,0,43.7251982,-79.3080374
34_1_34A,8845,34,true,1585439391,282,32,279.57,14484,277.59,281.48,False,0,43.7257575,-79.3118247
34_1_34A,8845,34,true,1585439421,282,0,279.57,14484,277.59,281.48,False,0,43.7258949,-79.3126754
34_1_34A,8845,34,true,1585439420,282,0,279.57,14484,277.59,281.48,False,0,43.7258949,-79.3126754
34_1_34A,8845,34,true,1585439451,282,0,279.57,14484,277.59,281.48,False,0,43.7258949,-79.3126754
34_1_34A,8845,34,true,1585439480,282,0,279.57,14484,277.59,281.48,False,0,43.7258949,-79.3126754
34_1_34A,8845,34,true,1585439481,282,0,279.57,14484,277.59,281.48,False,0,43.7258949,-79.3126754
34_1_34A,8845,34,true,1585439511,268,37,279.59,14484,278.15,281.15,False,0,43.7262757,-79.3161651
34_1_34A,8845,34,true,1585439541,266,0,279.59,14484,278.15,281.15,False,0,43.7262291,-79.3173169
34_1_34A,8845,34,true,1585439571,263,14,279.59,14484,278.15,281.15,False,0,43.7262246,-79.3174879
34_1_34A,8845,34,true,1585439601,248,31,279.59,14484,278.15,281.15,False,0,43.7256984,-79.3202898
34_1_34A,8845,34,true,1585439631,249,37,279.55,14484,277.59,281.15,False,0,43.7246972,-79.3241186
34_1_34A,8845,34,true,1585439630,249,37,279.55,14484,277.59,281.15,False,0,43.7246972,-79.3241186
34_1_34A,8845,34,true,1585439661,252,0,279.53,14484,277.59,281.15,False,0,43.7243461,-79.3261718
34_1_34A,8845,34,true,1585439691,249,38,279.53,14484,277.59,281.15,False,0,43.7236189,-79.3285806
34_1_34A,8845,34,true,1585439721,248,30,279.53,14484,277.59,281.15,False,0,43.7228969,-79.331536
34_1_34A,8845,34,true,1585439751,247,37,279.53,14484,277.59,281.15,False,0,43.721544,-79.335444
34_1_34A,8845,34,true,1585439752,247,37,279.53,14484,277.59,281.15,False,0,43.721544,-79.335444
34_1_34A,8845,34,true,1585439781,251,0,279.53,14484,277.59,281.15,False,0,43.7208128,-79.3378248
34_1_34A,8845,34,true,1585439811,251,0,279.53,14484,277.59,281.15,False,0,43.7208128,-79.3378248
34_1_34A,8845,34,true,1585439841,246,37,279.53,14484,277.59,281.15,False,0,43.7203269,-79.3395703
34_1_34A,8845,34,true,1585439871,245,47,279.53,14484,277.59,281.15,False,0,43.7192208,-79.342957
34_1_34A,8845,34,true,1585439901,250,43,279.54,14484,277.04,281.48,False,0,43.7177502,-79.3476396
34_1_34A,8845,34,true,1585439931,248,0,279.54,14484,277.04,281.48,False,0,43.7173135,-79.349184
34_1_34A,8845,34,true,1585439962,248,0,279.54,14484,277.04,281.48,False,0,43.7173135,-79.349184
34_1_34A,8845,34,true,1585439961,248,0,279.49,14484,277.59,281.15,False,0,43.7173135,-79.349184
34_1_34A,8845,34,true,1585439991,246,43,279.49,14484,277.59,281.15,False,0,43.7168425,-79.3506552
34_1_34A,8845,34,true,1585440021,260,39,279.47,14484,277.59,281.15,False,0,43.7155657,-79.3552007
34_1_34A,8845,34,true,1585440022,260,39,279.47,14484,277.59,281.15,False,0,43.7155657,-79.3552007
34_1_34A,8845,34,true,1585440051,250,8,279.45,14484,277.59,281.15,False,0,43.7147469,-79.3591658
34_1_34A,8845,34,true,1585440081,255,0,279.45,14484,277.59,281.15,False,0,43.7147469,-79.3591658
34_1_34A,8845,34,true,1585440111,251,30,279.45,14484,277.59,281.15,False,0,43.7145692,-79.3603961
34_1_34A,8845,34,true,1585440112,251,30,279.45,14484,277.59,281.15,False,0,43.7145692,-79.3603961
34_1_34A,8845,34,true,1585440141,255,6,279.45,14484,277.59,281.15,False,0,43.7136543,-79.3643386
34_1_34A,8845,34,true,1585440171,256,19,279.45,14484,277.59,281.15,False,0,43.7135921,-79.3646418
34_1_34A,8845,34,true,1585440201,255,39,279.45,14484,277.59,281.15,False,0,43.7134067,-79.3660249
34_1_34A,8845,34,true,1585440231,253,36,279.45,14484,277.59,281.15,False,0,43.712624,-79.3696084
34_1_34A,8845,34,true,1585440261,255,33,279.45,14484,277.59,281.15,False,0,43.7117361,-79.3738365
34_1_34A,8845,34,true,1585440291,254,23,279.47,14484,277.59,281.15,False,0,43.7111598,-79.3769476
34_1_34A,8845,34,true,1585440322,254,0,279.47,14484,277.59,281.15,False,0,43.7105293,-79.3800735
34_1_34A,8845,34,true,1585440321,254,0,279.47,14484,277.59,281.15,False,0,43.7105293,-79.3800735
34_1_34A,8845,34,true,1585440351,253,33,279.47,14484,277.59,281.15,False,0,43.7100393,-79.3823014
34_1_34A,8845,34,true,1585440381,254,33,279.39,14484,277.59,281.15,False,0,43.7091949,-79.3861444
34_1_34A,8845,34,true,1585440411,254,29,279.39,14484,277.59,281.15,False,0,43.7085668,-79.3893092
34_1_34A,8845,34,true,1585440412,254,29,279.39,14484,277.59,281.15,False,0,43.7085668,-79.3893092
34_1_34A,8845,34,true,1585440441,257,26,279.39,14484,277.59,281.15,False,0,43.7080628,-79.3920249
34_1_34A,8845,34,true,1585440442,257,26,279.39,14484,277.59,281.15,False,0,43.7080628,-79.3920249
34_1_34A,8845,34,true,1585440471,254,0,279.39,14484,277.59,281.15,False,0,43.7080156,-79.3924089
34_1_34A,8845,34,true,1585440501,253,22,279.39,14484,277.59,281.15,False,0,43.7075331,-79.3946299
34_1_34A,8845,34,true,1585440502,253,22,279.39,14484,277.59,281.15,False,0,43.7075331,-79.3946299
34_1_34A,8845,34,true,1585440531,246,2,279.47,14484,277.59,281.15,False,0,43.7074584,-79.3952484
34_1_34A,8845,34,true,1585440532,246,2,279.47,14484,277.59,281.15,False,0,43.7074584,-79.3952484
34_1_34A,8845,34,true,1585440562,254,23,279.47,14484,277.59,281.15,False,0,43.7069491,-79.3973029
34_1_34A,8845,34,true,1585440561,254,23,279.4,14484,277.59,281.15,False,0,43.7069491,-79.3973029
34_1_34A,8845,34,true,1585440591,253,10,279.4,14484,277.59,281.15,False,0,43.7068384,-79.3978257
34_1_34A,8845,34,true,1585440622,257,5,279.4,14484,277.59,281.15,False,0,43.7063605,-79.4001911
34_1_34A,8845,34,true,1585440621,257,5,279.4,14484,277.59,281.15,False,0,43.7063605,-79.4001911
34_1_34A,8845,34,true,1585440651,170,21,279.4,14484,277.59,281.15,False,0,43.7050933,-79.3985671
34_1_34A,8845,34,true,1585440681,351,22,279.4,14484,277.59,281.15,False,0,43.7050933,-79.3985671
34_1_34A,8845,34,true,1585440711,337,5,279.4,14484,277.59,281.15,False,0,43.7050933,-79.3985671
34_1_34A,8845,34,true,1585440712,337,5,279.4,14484,277.59,281.15,False,0,43.7050933,-79.3985671
34_1_34A,8845,34,true,1585440741,202,6,279.4,14484,277.59,281.15,False,0,43.7050933,-79.3985671
34_1_34A,8845,34,true,1585440771,173,0,279.4,14484,277.59,281.15,False,0,43.7050933,-79.3985671
34_1_34A,8845,34,true,1585440772,173,0,279.4,14484,277.59,281.15,False,0,43.7050933,-79.3985671
34_1_34A,8845,34,true,1585440801,173,0,279.4,14484,277.59,281.15,False,0,43.7050933,-79.3985671
34_1_34A,8845,34,true,1585440831,173,0,279.4,14484,277.59,281.15,False,0,43.7050933,-79.3985671
34_1_34A,8845,34,true,1585440861,173,0,279.4,14484,277.59,281.15,False,0,43.7050933,-79.3985671
34_1_34A,8845,34,true,1585440862,173,0,279.4,14484,277.59,281.15,False,0,43.7050933,-79.3985671
34_1_34A,8845,34,true,1585440891,173,0,279.4,14484,277.59,281.15,False,0,43.7050933,-79.3985671
34_1_34A,8845,34,true,1585440892,173,0,279.4,14484,277.59,281.15,False,0,43.7050933,-79.3985671
34_1_34A,8845,34,true,1585440921,173,0,279.4,14484,277.59,281.15,False,0,43.7050933,-79.3985671
34_1_34A,8845,34,true,1585440922,173,0,279.4,14484,277.59,281.15,False,0,43.7050933,-79.3985671
34_1_34A,8845,34,true,1585440951,173,1,279.4,14484,277.59,281.15,False,0,43.7050933,-79.3985671
34_1_34A,8845,34,true,1585440981,352,14,279.4,14484,277.59,281.15,False,0,43.7050933,-79.3985671
34_1_34A,8845,34,true,1585440982,352,14,279.4,14484,277.59,281.15,False,0,43.7050933,-79.3985671
34_1_34A,8845,34,true,1585441011,347,16,279.4,14484,277.59,281.15,False,0,43.7050933,-79.3985671
34_1_34A,8845,34,true,1585441012,347,16,279.4,14484,277.59,281.15,False,0,43.7050933,-79.3985671
34_1_34A,8845,34,true,1585443112,72,0,279.06,14484,277.59,280.37,False,0,43.733036,-79.2633391
34_1_34A,8845,34,true,1585443141,240,13,279.06,14484,277.59,280.37,False,0,43.7323566,-79.26362
34_1_34A,8845,34,true,1585443142,240,13,279.06,14484,277.59,280.37,False,0,43.7323566,-79.26362
34_1_34A,8845,34,true,1585443171,72,0,279.06,14484,277.59,280.37,False,0,43.7322083,-79.2638933
34_1_34A,8845,34,true,1585443172,72,0,279.06,14484,277.59,280.37,False,0,43.7322083,-79.2638933
34_1_34A,8845,34,true,1585443202,72,0,279.06,14484,277.59,280.37,False,0,43.7322083,-79.2638933
34_1_34A,8845,34,true,1585443201,72,0,279.06,14484,277.59,280.37,False,0,43.7322083,-79.2638933
34_1_34A,8845,34,true,1585443232,72,0,279.06,14484,277.59,280.37,False,0,43.7322083,-79.2638933
34_1_34A,8845,34,true,1585443231,72,0,279.06,14484,277.59,280.37,False,0,43.7322083,-79.2638933
34_1_34A,8845,34,true,1585443262,72,0,279.06,14484,277.59,280.37,False,0,43.7322083,-79.2638933
34_1_34A,8845,34,true,1585443291,72,0,279.06,14484,277.59,280.37,False,0,43.7322083,-79.2638933
34_1_34A,8845,34,true,1585443292,72,0,279.06,14484,277.59,280.37,False,0,43.7322083,-79.2638933
34_1_34A,8845,34,true,1585443322,72,0,279.06,14484,277.59,280.37,False,0,43.7322083,-79.2638933
34_1_34A,8845,34,true,1585443321,72,0,279.06,14484,277.59,280.37,False,0,43.7322083,-79.2638933
34_1_34A,8845,34,true,1585443352,72,0,279.06,14484,277.59,280.37,False,0,43.7322083,-79.2638933
34_1_34A,8845,34,true,1585443382,72,0,279.06,14484,277.59,280.37,False,0,43.7324638,-79.2641983
34_1_34A,8845,34,true,1585443412,72,0,279.06,14484,277.59,280.37,False,0,43.7324638,-79.2641983
34_1_34A,8845,34,true,1585443442,72,0,279.06,14484,277.59,280.37,False,0,43.7324638,-79.2641983
34_1_34A,8845,34,true,1585443441,72,0,279.06,14484,277.59,280.37,False,0,43.7324638,-79.2641983
34_1_34A,8845,34,true,1585443472,72,0,279.06,14484,277.59,280.37,False,0,43.7324638,-79.2641983
34_1_34A,8845,34,true,1585443502,72,0,279.06,14484,277.59,280.37,False,0,43.7324638,-79.2641983
34_1_34A,8845,34,true,1585443532,72,0,279.06,14484,277.59,280.37,False,0,43.7324638,-79.2641983
34_1_34A,8845,34,true,1585443531,72,0,279.06,14484,277.59,280.37,False,0,43.7324638,-79.2641983
34_1_34A,8845,34,true,1585443562,72,0,279.06,14484,277.59,280.37,False,0,43.7324638,-79.2641983
34_1_34A,8845,34,true,1585443595,72,0,279.06,14484,277.59,280.37,False,0,43.7324638,-79.2641983
34_1_34A,8845,34,true,1585443622,72,0,279.06,14484,277.59,280.37,False,0,43.7324638,-79.2641983
34_1_34A,8845,34,true,1585443652,72,0,279.06,14484,277.59,280.37,False,0,43.7324638,-79.2641983
34_1_34A,8845,34,true,1585443651,72,0,279.06,14484,277.59,280.37,False,0,43.7324638,-79.2641983
34_1_34A,8845,34,true,1585443682,72,0,279.03,14484,277.59,280.37,False,0,43.7324638,-79.2641983
34_1_34A,8845,34,true,1585443711,72,0,279.03,14484,277.59,280.37,False,0,43.7324638,-79.2641983
34_1_34A,8845,34,true,1585443712,72,0,279.03,14484,277.59,280.37,False,0,43.7324638,-79.2641983
34_1_34A,8845,34,true,1585443742,72,0,279.03,14484,277.59,280.37,False,0,43.7324638,-79.2641983
34_1_34A,8845,34,true,1585443741,72,0,279.03,14484,277.59,280.37,False,0,43.7324638,-79.2641983
34_1_34A,8845,34,true,1585443772,72,0,279.03,14484,277.59,280.37,False,0,43.7324638,-79.2641983
34_1_34A,8845,34,true,1585443802,72,0,279.03,14484,277.59,280.37,False,0,43.7324638,-79.2641983
34_1_34A,8845,34,true,1585443832,72,0,279.03,14484,277.59,280.37,False,0,43.7324638,-79.2641983
34_1_34A,8845,34,true,1585443862,72,0,279.03,14484,277.59,280.37,False,0,43.7324638,-79.2641983
34_1_34A,8845,34,true,1585443892,72,0,279.03,14484,277.59,280.37,False,0,43.7324638,-79.2641983
34_1_34A,8845,34,true,1585443922,62,14,279.03,14484,277.59,280.37,False,0,43.7323951,-79.2641983
34_1_34A,8845,34,true,1585443921,62,14,279.03,14484,277.59,280.37,False,0,43.7323951,-79.2641983
34_1_34A,8845,34,true,1585443952,71,14,279.03,14484,277.59,280.37,False,0,43.7327919,-79.2631454
34_1_34A,8845,34,true,1585443982,247,24,279.03,14484,277.59,280.37,False,0,43.7334327,-79.2639389
34_1_34A,8845,34,true,1585444012,257,0,279.05,14484,277.59,280.37,False,0,43.7330818,-79.2654418
34_1_34A,8845,34,true,1585444042,256,38,279.05,14484,277.59,280.37,False,0,43.7324409,-79.2673187
34_1_34A,8845,34,true,1585444072,265,0,279.09,14484,278.15,280.37,False,0,43.7324142,-79.2677459
34_1_34A,8845,34,true,1585444102,265,0,279.09,14484,278.15,280.37,False,0,43.7324142,-79.2677459
34_1_34A,8845,34,true,1585444132,251,26,279.09,14484,278.15,280.37,False,0,43.7316703,-79.2705535
34_1_34A,8845,34,true,1585444133,251,26,279.09,14484,278.15,280.37,False,0,43.7316703,-79.2705535
34_1_34A,8845,34,true,1585444162,255,20,279.09,14484,278.15,280.37,False,0,43.7314758,-79.2712936
34_1_34A,8845,34,true,1585444163,255,20,279.09,14484,278.15,280.37,False,0,43.7314758,-79.2712936
34_1_34A,8845,34,true,1585444192,248,45,279.09,14484,278.15,280.37,False,0,43.7310256,-79.2733078
34_1_34A,8845,34,true,1585444222,253,33,279.09,14484,278.15,280.37,False,0,43.7307519,-79.2742317
34_1_34A,8845,34,true,1585444252,252,18,279.08,14484,278.15,280.37,False,0,43.7300866,-79.2776623
34_1_34A,8845,34,true,1585444253,252,18,279.08,14484,278.15,280.37,False,0,43.7300866,-79.2776623
34_1_34A,8845,34,true,1585444283,253,32,279.08,14484,278.15,280.37,False,0,43.7296945,-79.2791748
34_1_34A,8845,34,true,1585444282,253,32,279.08,14484,278.15,280.37,False,0,43.7296945,-79.2791748
34_1_34A,8845,34,true,1585444312,249,28,279.08,14484,278.15,280.37,False,0,43.7293723,-79.2811348
34_1_34A,8845,34,true,1585444313,249,28,279.08,14484,278.15,280.37,False,0,43.7293723,-79.2811348
34_1_34A,8845,34,true,1585444342,253,41,279.08,14484,278.15,280.37,False,0,43.7281482,-79.2863253
34_1_34A,8845,34,true,1585444343,253,41,279.08,14484,278.15,280.37,False,0,43.7281482,-79.2863253
34_1_34A,8845,34,true,1585444373,254,0,279.08,14484,278.15,280.37,False,0,43.7280854,-79.2869071
34_1_34A,8845,34,true,1585444372,254,0,279.08,14484,278.15,280.37,False,0,43.7280854,-79.2869071
34_1_34A,8845,34,true,1585444402,254,0,279.08,14484,278.15,280.37,False,0,43.7280854,-79.2869071
34_1_34A,8845,34,true,1585444433,252,26,279.08,14484,278.15,280.37,False,0,43.7279506,-79.2874534
34_1_34A,8845,34,true,1585444432,252,26,279.08,14484,278.15,280.37,False,0,43.7279506,-79.2874534
34_1_34A,8845,34,true,1585444462,252,40,279.08,14484,278.15,280.37,False,0,43.7270534,-79.2914641
34_1_34A,8845,34,true,1585444463,252,40,279.08,14484,278.15,280.37,False,0,43.7270534,-79.2914641
34_1_34A,8845,34,true,1585444493,253,34,279.08,14484,278.15,280.37,False,0,43.725959,-79.2965635
34_1_34A,8845,34,true,1585444523,254,0,279.08,14484,278.15,280.37,False,0,43.7258567,-79.2971725
34_1_34A,8845,34,true,1585444553,253,20,279.08,14484,278.15,280.37,False,0,43.725773,-79.2972982
34_1_34A,8845,34,true,1585444583,250,0,279.07,14484,278.15,280.37,False,0,43.7247413,-79.3019117
34_1_34A,8845,34,true,1585444613,273,49,279.07,14484,278.15,280.37,False,0,43.7247532,-79.3038809
34_1_34A,8845,34,true,1585444643,281,47,279.05,14484,278.15,280.37,False,0,43.7253548,-79.3090377
34_1_34A,8845,34,true,1585444673,282,0,279.05,14484,278.15,280.37,False,0,43.7259304,-79.312882
34_1_34A,8845,34,true,1585444674,282,0,279.05,14484,278.15,280.37,False,0,43.7259304,-79.312882
34_1_34A,8845,34,true,1585444703,272,49,279.07,14484,278.15,280.37,False,0,43.72623,-79.3153224
34_1_34A,8845,34,true,1585444733,266,0,279.07,14484,278.15,280.37,False,0,43.7262427,-79.3171539
34_1_34A,8845,34,true,1585444734,266,0,279.07,14484,278.15,280.37,False,0,43.7262427,-79.3171539
34_1_34A,8845,34,true,1585444763,256,43,279.07,14484,278.15,280.37,False,0,43.7260723,-79.3185736
34_1_34A,8845,34,true,1585444793,251,43,278.99,14484,277.59,280.37,False,0,43.7248455,-79.3235712
34_1_34A,8845,34,true,1585444823,249,46,279.03,14484,277.59,280.37,False,0,43.723616,-79.3285842
34_1_34A,8845,34,true,1585444824,249,46,279.03,14484,277.59,280.37,False,0,43.723616,-79.3285842
34_1_34A,8845,34,true,1585444853,248,46,279.03,14484,277.59,280.37,False,0,43.7222858,-79.3329911
34_1_34A,8845,34,true,1585444854,248,46,279.03,14484,277.59,280.37,False,0,43.7222858,-79.3329911
34_1_34A,8845,34,true,1585444883,252,37,279.03,14484,277.59,280.37,False,0,43.7208427,-79.3377283
34_1_34A,8845,34,true,1585444913,246,46,278.99,14484,277.59,280.37,False,0,43.7203735,-79.3396746
34_1_34A,8845,34,true,1585444914,246,46,278.99,14484,277.59,280.37,False,0,43.7203735,-79.3396746
34_1_34A,8845,34,true,1585444943,244,50,278.99,14484,277.59,280.37,False,0,43.7190435,-79.3435107
34_1_34A,8845,34,true,1585444944,244,50,278.99,14484,277.59,280.37,False,0,43.7190435,-79.3435107
34_1_34A,8845,34,true,1585444973,245,42,278.98,14484,277.59,280.37,False,0,43.7172186,-79.3495219
34_1_34A,8845,34,true,1585444974,245,42,278.98,14484,277.59,280.37,False,0,43.7172186,-79.3495219
34_1_34A,8845,34,true,1585445005,249,47,278.98,14484,277.59,280.37,False,0,43.7157748,-79.3542691
34_1_34A,8845,34,true,1585445033,251,39,279.01,14484,277.59,280.37,False,0,43.7146711,-79.3594848
34_1_34A,8845,34,true,1585445034,251,39,279.01,14484,277.59,280.37,False,0,43.7146711,-79.3594848
34_1_34A,8845,34,true,1585445063,254,36,279.01,14484,277.59,280.37,False,0,43.7138188,-79.3635609
34_1_34A,8845,34,true,1585445064,254,36,279.01,14484,277.59,280.37,False,0,43.7138188,-79.3635609
34_1_34A,8845,34,true,1585445093,253,33,279.01,14484,277.59,280.37,False,0,43.7131499,-79.3671254
34_1_34A,8845,34,true,1585445124,254,35,279.01,14484,277.59,280.37,False,0,43.7122877,-79.3712974
34_1_34A,8845,34,true,1585445123,254,35,279.01,14484,277.59,280.37,False,0,43.7122877,-79.3712974
34_1_34A,8845,34,true,1585445153,259,29,279.01,14484,277.59,280.37,False,0,43.7116855,-79.3745073
34_1_34A,8845,34,true,1585445154,259,29,279.01,14484,277.59,280.37,False,0,43.7116855,-79.3745073
34_1_34A,8845,34,true,1585445183,255,0,278.97,14484,277.59,280.37,False,0,43.7113411,-79.3763005
34_1_34A,8845,34,true,1585445184,255,0,278.97,14484,277.59,280.37,False,0,43.7113411,-79.3763005
34_1_34A,8845,34,true,1585445213,255,0,278.97,14484,277.59,280.37,False,0,43.7113411,-79.3763005
34_1_34A,8845,34,true,1585445214,255,0,278.97,14484,277.59,280.37,False,0,43.7113411,-79.3763005
34_1_34A,8845,34,true,1585445244,256,39,278.97,14484,277.59,280.37,False,0,43.7105323,-79.3795672
34_1_34A,8845,34,true,1585445243,256,39,278.97,14484,277.59,280.37,False,0,43.7105323,-79.3795672
34_1_34A,8845,34,true,1585445273,253,39,278.97,14484,277.59,280.37,False,0,43.7097273,-79.3836102
34_1_34A,8845,34,true,1585445303,255,34,278.97,14484,277.59,280.37,False,0,43.7088619,-79.3878379
34_1_34A,8845,34,true,1585445333,255,9,278.97,14484,277.59,280.37,False,0,43.7083914,-79.3902172
34_1_34A,8845,34,true,1585445334,255,9,278.97,14484,277.59,280.37,False,0,43.7083914,-79.3902172
34_1_34A,8845,34,true,1585445364,253,26,278.97,14484,277.59,280.37,False,0,43.7079328,-79.392772
34_1_34A,8845,34,true,1585445363,253,26,278.97,14484,277.59,280.37,False,0,43.7079328,-79.392772
34_1_34A,8845,34,true,1585445394,253,28,278.97,14484,277.59,280.37,False,0,43.7071332,-79.3964131
34_1_34A,8845,34,true,1585445393,253,28,278.97,14484,277.59,280.37,False,0,43.7071332,-79.3964131
34_1_34A,8845,34,true,1585445424,253,0,278.97,14484,277.59,280.37,False,0,43.7067752,-79.3981239
34_1_34A,8845,34,true,1585445423,253,0,278.97,14484,277.59,280.37,False,0,43.7067752,-79.3981239
34_1_34A,8845,34,true,1585445453,253,0,278.91,14484,277.59,280.37,False,0,43.7064181,-79.3998994
34_1_34A,8845,34,true,1585445454,253,0,278.91,14484,277.59,280.37,False,0,43.7064181,-79.3998994
34_1_34A,8845,34,true,1585445484,103,21,278.91,14484,277.59,280.37,False,0,43.7054902,-79.3995029
34_1_34A,8845,34,true,1585445483,103,21,278.91,14484,277.59,280.37,False,0,43.7054902,-79.3995029
34_1_34A,8845,34,true,1585445513,118,13,278.91,14484,277.59,280.37,False,0,43.7050933,-79.3985671
34_1_34A,8845,34,true,1585445544,173,0,278.91,14484,277.59,280.37,False,0,43.7050933,-79.3985671
34_1_34A,8845,34,true,1585445543,173,0,278.91,14484,277.59,280.37,False,0,43.7050933,-79.3985671
34_1_34A,8845,34,true,1585445573,169,3,278.91,14484,277.59,280.37,False,0,43.7050933,-79.3985671
34_1_34A,8845,34,true,1585445574,169,3,278.91,14484,277.59,280.37,False,0,43.7050933,-79.3985671
34_1_34A,8845,34,true,1585445604,173,0,278.91,14484,277.59,280.37,False,0,43.7050933,-79.3985671
34_1_34A,8845,34,true,1585445603,173,0,278.91,14484,277.59,280.37,False,0,43.7050933,-79.3985671
34_1_34A,8845,34,true,1585445634,173,0,278.91,14484,277.59,280.37,False,0,43.7050933,-79.3985671
34_1_34A,8845,34,true,1585445633,173,0,278.91,14484,277.59,280.37,False,0,43.7050933,-79.3985671
34_1_34A,8845,34,true,1585445664,173,0,278.91,14484,277.59,280.37,False,0,43.7050933,-79.3985671
34_1_34A,8845,34,true,1585445663,173,0,278.91,14484,277.59,280.37,False,0,43.7050933,-79.3985671
34_1_34A,8845,34,true,1585445693,173,0,278.91,14484,277.59,280.37,False,0,43.7050933,-79.3985671
34_1_34A,8845,34,true,1585445694,173,0,278.91,14484,277.59,280.37,False,0,43.7050933,-79.3985671
34_1_34A,8845,34,true,1585445723,173,0,278.91,14484,277.59,280.37,False,0,43.7050933,-79.3985671
34_1_34A,8845,34,true,1585445724,173,0,278.91,14484,277.59,280.37,False,0,43.7050933,-79.3985671
34_1_34A,8845,34,true,1585445753,173,0,278.91,14484,277.59,280.37,False,0,43.7050933,-79.3985671
34_1_34A,8845,34,true,1585445754,173,0,278.91,14484,277.59,280.37,False,0,43.7050933,-79.3985671
34_1_34A,8845,34,true,1585445784,173,0,278.91,14484,277.59,280.37,False,0,43.7050933,-79.3985671
34_1_34A,8845,34,true,1585445783,173,0,278.91,14484,277.59,280.37,False,0,43.7050933,-79.3985671
34_1_34A,8845,34,true,1585445813,173,0,278.91,14484,277.59,280.37,False,0,43.7050933,-79.3985671
34_1_34A,8845,34,true,1585445814,173,0,278.91,14484,277.59,280.37,False,0,43.7050933,-79.3985671
34_1_34A,8845,34,true,1585445843,173,0,278.91,14484,277.59,280.37,False,0,43.7050933,-79.3985671
34_1_34A,8845,34,true,1585445844,173,0,278.91,14484,277.59,280.37,False,0,43.7050933,-79.3985671
34_1_34A,8845,34,true,1585445875,173,0,278.91,14484,277.59,280.37,False,0,43.7050933,-79.3985671
34_1_34A,8845,34,true,1585445874,173,0,278.91,14484,277.59,280.37,False,0,43.7050933,-79.3985671
34_1_34A,8845,34,true,1585446384,142,16,278.83,14484,277.59,279.82,False,0,43.7050933,-79.3985671
34_1_34A,8845,34,true,1585446383,142,16,278.83,14484,277.59,279.82,False,0,43.7050933,-79.3985671
34_1_34A,8845,34,true,1585448391,67,0,278.84,14484,277.59,279.82,False,0,43.733052,-79.2632873
34_1_34A,8845,34,true,1585448421,216,0,278.84,14484,277.59,279.82,False,0,43.7322333,-79.263785
34_1_34A,8845,34,true,1585448422,216,0,278.84,14484,277.59,279.82,False,0,43.7322333,-79.263785
34_1_34A,8845,34,true,1585448451,216,0,278.84,14484,277.59,279.82,False,0,43.7322333,-79.263785
34_1_34A,8845,34,true,1585448452,216,0,278.84,14484,277.59,279.82,False,0,43.7322333,-79.263785
34_1_34A,8845,34,true,1585448481,216,0,278.84,14484,277.59,279.82,False,0,43.7322333,-79.263785
34_1_34A,8845,34,true,1585448482,216,0,278.84,14484,277.59,279.82,False,0,43.7322333,-79.263785
34_1_34A,8845,34,true,1585448511,216,0,278.84,14484,277.59,279.82,False,0,43.7322333,-79.263785
34_1_34A,8845,34,true,1585448512,216,0,278.84,14484,277.59,279.82,False,0,43.7322333,-79.263785
34_1_34A,8845,34,true,1585448542,216,0,278.84,14484,277.59,279.82,False,0,43.7322333,-79.263785
34_1_34A,8845,34,true,1585448541,216,0,278.84,14484,277.59,279.82,False,0,43.7322333,-79.263785
34_1_34A,8845,34,true,1585448571,216,0,278.82,14484,277.59,279.82,False,0,43.7322333,-79.263785
34_1_34A,8845,34,true,1585448604,216,0,278.82,14484,277.59,279.82,False,0,43.7322333,-79.263785
34_1_34A,8845,34,true,1585448605,216,0,278.82,14484,277.59,279.82,False,0,43.7322333,-79.263785
34_1_34A,8845,34,true,1585448631,216,0,278.82,14484,277.59,279.82,False,0,43.7322333,-79.263785
34_1_34A,8845,34,true,1585448661,216,0,278.82,14484,277.59,279.82,False,0,43.7322333,-79.263785
34_1_34A,8845,34,true,1585448662,216,0,278.82,14484,277.59,279.82,False,0,43.7322333,-79.263785
34_1_34A,8845,34,true,1585448691,216,0,278.82,14484,277.59,279.82,False,0,43.7322333,-79.263785
34_1_34A,8845,34,true,1585448722,216,0,278.82,14484,277.59,279.82,False,0,43.7322333,-79.263785
34_1_34A,8845,34,true,1585448721,216,0,278.82,14484,277.59,279.82,False,0,43.7322333,-79.263785
34_1_34A,8845,34,true,1585448752,216,0,278.82,14484,277.59,279.82,False,0,43.7322333,-79.263785
34_1_34A,8845,34,true,1585448751,216,0,278.82,14484,277.59,279.82,False,0,43.7322333,-79.263785
34_1_34A,8845,34,true,1585448781,216,0,278.82,14484,277.59,279.82,False,0,43.7322333,-79.263785
34_1_34A,8845,34,true,1585448811,216,0,278.82,14484,277.59,279.82,False,0,43.7322333,-79.263785
34_1_34A,8845,34,true,1585448812,216,0,278.82,14484,277.59,279.82,False,0,43.7322333,-79.263785
34_1_34A,8845,34,true,1585448844,216,0,278.82,14484,277.59,279.82,False,0,43.7322333,-79.263785
34_1_34A,8845,34,true,1585448871,216,0,278.82,14484,277.59,279.82,False,0,43.7322333,-79.263785
34_1_34A,8845,34,true,1585448872,216,0,278.82,14484,277.59,279.82,False,0,43.7322333,-79.263785
34_1_34A,8845,34,true,1585448901,216,0,278.82,14484,277.59,279.82,False,0,43.7322333,-79.263785
34_1_34A,8845,34,true,1585448902,216,0,278.82,14484,277.59,279.82,False,0,43.7322333,-79.263785
34_1_34A,8845,34,true,1585448931,216,0,278.82,14484,277.59,279.82,False,0,43.7322333,-79.263785
34_1_34A,8845,34,true,1585448932,216,0,278.82,14484,277.59,279.82,False,0,43.7322333,-79.263785
34_1_34A,8845,34,true,1585448961,216,0,278.82,14484,277.59,279.82,False,0,43.7322333,-79.263785
34_1_34A,8845,34,true,1585448962,216,0,278.82,14484,277.59,279.82,False,0,43.7322333,-79.263785
34_1_34A,8845,34,true,1585448991,216,0,278.82,14484,277.59,279.82,False,0,43.7322333,-79.263785
34_1_34A,8845,34,true,1585449021,216,0,278.82,14484,277.59,279.82,False,0,43.7322333,-79.263785
34_1_34A,8845,34,true,1585449022,216,0,278.82,14484,277.59,279.82,False,0,43.7322333,-79.263785
34_1_34A,8845,34,true,1585449051,216,0,278.82,14484,277.59,279.82,False,0,43.7322333,-79.263785
34_1_34A,8845,34,true,1585449052,216,0,278.82,14484,277.59,279.82,False,0,43.7322333,-79.263785
34_1_34A,8845,34,true,1585449082,216,0,278.82,14484,277.59,279.82,False,0,43.7322333,-79.263785
34_1_34A,8845,34,true,1585449081,216,0,278.82,14484,277.59,279.82,False,0,43.7322333,-79.263785
34_1_34A,8845,34,true,1585449112,216,0,278.82,14484,277.59,279.82,False,0,43.7322333,-79.263785
34_1_34A,8845,34,true,1585449111,216,0,278.82,14484,277.59,279.82,False,0,43.7322333,-79.263785
34_1_34A,8845,34,true,1585449141,216,0,278.82,14484,277.59,279.82,False,0,43.7322333,-79.263785
34_1_34A,8845,34,true,1585449142,216,0,278.82,14484,277.59,279.82,False,0,43.7322333,-79.263785
34_1_34A,8845,34,true,1585449171,216,0,278.82,12874,277.59,279.82,False,0,43.7322333,-79.263785
34_1_34A,8845,34,true,1585449172,216,0,278.82,12874,277.59,279.82,False,0,43.7322333,-79.263785
34_1_34A,8845,34,true,1585449202,216,0,278.82,12874,277.59,279.82,False,0,43.7322333,-79.263785
34_1_34A,8845,34,true,1585449201,216,0,278.82,12874,277.59,279.82,False,0,43.7322333,-79.263785
34_1_34A,8845,34,true,1585449231,216,0,278.82,12874,277.59,279.82,False,0,43.7322333,-79.263785
34_1_34A,8845,34,true,1585449232,216,0,278.82,12874,277.59,279.82,False,0,43.7322333,-79.263785
34_1_34A,8845,34,true,1585449261,216,0,278.82,12874,277.59,279.82,False,0,43.7322333,-79.263785
34_1_34A,8845,34,true,1585449262,216,0,278.82,12874,277.59,279.82,False,0,43.7322333,-79.263785
34_1_34A,8845,34,true,1585449292,283,12,278.82,12874,277.59,279.82,False,0,43.732521,-79.2641601
34_1_34A,8845,34,true,1585449291,283,12,278.82,12874,277.59,279.82,False,0,43.732521,-79.2641601
34_1_34A,8845,34,true,1585449321,216,0,278.82,12874,277.59,279.82,False,0,43.7323036,-79.2636871
34_1_34A,8845,34,true,1585449322,216,0,278.82,12874,277.59,279.82,False,0,43.7323036,-79.2636871
34_1_34A,8845,34,true,1585449351,339,25,278.82,12874,277.59,279.82,False,0,43.7333984,-79.2633056
34_1_34A,8845,34,true,1585449352,339,25,278.82,12874,277.59,279.82,False,0,43.7333984,-79.2633056
34_1_34A,8845,34,true,1585449382,253,0,278.81,12874,277.59,279.82,False,0,43.7329864,-79.2663574
34_1_34A,8845,34,true,1585449381,253,0,278.81,12874,277.59,279.82,False,0,43.7329864,-79.2663574
34_1_34A,8845,34,true,1585449411,251,34,278.81,12874,277.59,279.82,False,0,43.7321701,-79.2681121
34_1_34A,8845,34,true,1585449412,251,34,278.81,12874,277.59,279.82,False,0,43.7321701,-79.2681121
34_1_34A,8845,34,true,1585449442,252,0,278.9,12874,278.15,279.82,False,0,43.7313232,-79.2716751
34_1_34A,8845,34,true,1585449441,252,0,278.9,12874,278.15,279.82,False,0,43.7313232,-79.2716751
34_1_34A,8845,34,true,1585449472,246,41,278.9,12874,278.15,279.82,False,0,43.7310256,-79.2733078
34_1_34A,8845,34,true,1585449502,252,32,278.9,12874,278.15,279.82,False,0,43.7302436,-79.2769317
34_1_34A,8845,34,true,1585449501,252,32,278.9,12874,278.15,279.82,False,0,43.7302436,-79.2769317
34_1_34A,8845,34,true,1585449531,252,31,278.9,12874,278.15,279.82,False,0,43.7299079,-79.2780838
34_1_34A,8845,34,true,1585449532,252,31,278.9,12874,278.15,279.82,False,0,43.7299079,-79.2780838
34_1_34A,8845,34,true,1585449562,253,35,278.9,12874,278.15,279.82,False,0,43.7296333,-79.2794494
34_1_34A,8845,34,true,1585449561,253,35,278.9,12874,278.15,279.82,False,0,43.7296333,-79.2794494
34_1_34A,8845,34,true,1585449591,253,51,278.9,12874,278.15,279.82,False,0,43.7288856,-79.2835083
34_1_34A,8845,34,true,1585449592,253,51,278.9,12874,278.15,279.82,False,0,43.7288856,-79.2835083
34_1_34A,8845,34,true,1585449622,252,0,278.9,12874,278.15,279.82,False,0,43.7280387,-79.2873306
34_1_34A,8845,34,true,1585449621,252,0,278.9,12874,278.15,279.82,False,0,43.7280387,-79.2873306
34_1_34A,8845,34,true,1585449651,252,0,278.9,12874,278.15,279.82,False,0,43.7280387,-79.2873306
34_1_34A,8845,34,true,1585449652,252,0,278.9,12874,278.15,279.82,False,0,43.7280387,-79.2873306
34_1_34A,8845,34,true,1585449682,252,0,278.9,12874,278.15,279.82,False,0,43.7280387,-79.2873306
34_1_34A,8845,34,true,1585449681,252,0,278.9,12874,278.15,279.82,False,0,43.7280387,-79.2873306
34_1_34A,8845,34,true,1585449712,252,38,278.9,12874,278.15,279.82,False,0,43.7272931,-79.29018
34_1_34A,8845,34,true,1585449711,252,38,278.9,12874,278.15,279.82,False,0,43.7272931,-79.29018
34_1_34A,8845,34,true,1585449742,216,0,278.9,12874,278.15,279.82,False,0,43.7271156,-79.2913284
34_1_34A,8845,34,true,1585449741,216,0,278.9,12874,278.15,279.82,False,0,43.7271156,-79.2913284
34_1_34A,8845,34,true,1585449771,253,0,278.9,12874,278.15,279.82,False,0,43.7268174,-79.2924231
34_1_34A,8845,34,true,1585449772,253,0,278.9,12874,278.15,279.82,False,0,43.7268174,-79.2924231
34_1_34A,8845,34,true,1585449802,252,44,278.9,12874,278.15,279.82,False,0,43.7264964,-79.2939705
34_1_34A,8845,34,true,1585449801,252,44,278.9,12874,278.15,279.82,False,0,43.7264964,-79.2939705
34_1_34A,8845,34,true,1585449831,253,0,278.83,12874,277.59,279.82,False,0,43.7254957,-79.298114
34_1_34A,8845,34,true,1585449832,253,0,278.83,12874,277.59,279.82,False,0,43.7254957,-79.298114
34_1_34A,8845,34,true,1585449862,257,44,278.84,12874,277.59,279.82,False,0,43.7249839,-79.3006713
34_1_34A,8845,34,true,1585449861,257,44,278.84,12874,277.59,279.82,False,0,43.7249839,-79.3006713
34_1_34A,8845,34,true,1585449892,273,44,278.84,12874,277.59,279.82,False,0,43.7247806,-79.3038261
34_1_34A,8845,34,true,1585449891,273,44,278.84,12874,277.59,279.82,False,0,43.7247806,-79.3038261
34_1_34A,8845,34,true,1585449922,281,45,278.89,12874,278.15,279.82,False,0,43.725262,-79.3084422
34_1_34A,8845,34,true,1585449921,281,45,278.89,12874,278.15,279.82,False,0,43.725262,-79.3084422
34_1_34A,8845,34,true,1585449952,282,5,278.89,12874,278.15,279.82,False,0,43.7258903,-79.3126458
34_1_34A,8845,34,true,1585449951,282,5,278.89,12874,278.15,279.82,False,0,43.7258903,-79.3126458
34_1_34A,8845,34,true,1585449982,282,0,278.89,12874,278.15,279.82,False,0,43.7258903,-79.3126458
34_1_34A,8845,34,true,1585449981,282,0,278.89,12874,278.15,279.82,False,0,43.7258903,-79.3126458
34_1_34A,8845,34,true,1585450012,282,0,278.89,12874,278.15,279.82,False,0,43.7258903,-79.3126458
34_1_34A,8845,34,true,1585450011,282,0,278.89,12874,278.15,279.82,False,0,43.7258903,-79.3126458
34_1_34A,8845,34,true,1585450042,272,49,278.77,12874,277.59,279.82,False,0,43.7262154,-79.3151054
34_1_34A,8845,34,true,1585450041,272,49,278.77,12874,277.59,279.82,False,0,43.7262154,-79.3151054
34_1_34A,8845,34,true,1585450071,246,45,278.77,12874,277.59,279.82,False,0,43.725811,-79.3198509
34_1_34A,8845,34,true,1585450072,246,45,278.77,12874,277.59,279.82,False,0,43.725811,-79.3198509
34_1_34A,8845,34,true,1585450102,250,40,278.83,12874,277.59,279.82,False,0,43.7245021,-79.3248671
34_1_34A,8845,34,true,1585450132,251,34,278.76,12874,277.59,279.82,False,0,43.7241091,-79.3264054
34_1_34A,8845,34,true,1585450164,249,0,278.76,12874,277.59,279.82,False,0,43.7238171,-79.3278986
34_1_34A,8845,34,true,1585450163,249,0,278.76,12874,277.59,279.82,False,0,43.7238171,-79.3278986
34_1_34A,8845,34,true,1585450192,249,43,278.76,12874,277.59,279.82,False,0,43.7230344,-79.3308439
34_1_34A,8845,34,true,1585450191,249,43,278.76,12874,277.59,279.82,False,0,43.7230344,-79.3308439
34_1_34A,8845,34,true,1585450222,251,36,278.76,12874,277.59,279.82,False,0,43.7224873,-79.3323322
34_1_34A,8845,34,true,1585450221,251,36,278.76,12874,277.59,279.82,False,0,43.7224873,-79.3323322
34_1_34A,8845,34,true,1585450252,251,40,278.8,12874,277.59,279.82,False,0,43.7210372,-79.3370902
34_1_34A,8845,34,true,1585450251,251,40,278.8,12874,277.59,279.82,False,0,43.7210372,-79.3370902
34_1_34A,8845,34,true,1585450282,251,0,278.79,12874,277.04,280.37,False,0,43.7208328,-79.3377595
34_1_34A,8845,34,true,1585450313,251,0,278.79,12874,277.04,280.37,False,0,43.7208328,-79.3377595
34_1_34A,8845,34,true,1585450341,244,46,278.79,12874,277.04,280.37,False,0,43.7203996,-79.3399838
34_1_34A,8845,34,true,1585450342,244,46,278.79,12874,277.04,280.37,False,0,43.7203996,-79.3399838
34_1_34A,8845,34,true,1585450372,244,48,278.79,12874,277.04,280.37,False,0,43.7190729,-79.3434249
34_1_34A,8845,34,true,1585450371,244,48,278.79,12874,277.04,280.37,False,0,43.7190729,-79.3434249
34_1_34A,8845,34,true,1585450402,244,47,278.75,12874,277.59,279.82,False,0,43.7172175,-79.3495258
34_1_34A,8845,34,true,1585450432,249,46,278.75,12874,277.59,279.82,False,0,43.7158226,-79.3540752
34_1_34A,8845,34,true,1585450433,249,46,278.75,12874,277.59,279.82,False,0,43.7158226,-79.3540752
34_1_34A,8845,34,true,1585450462,252,37,278.76,12874,277.04,280.37,False,0,43.7146687,-79.3594955
34_1_34A,8845,34,true,1585450492,254,0,278.76,12874,277.04,280.37,False,0,43.7143009,-79.3616895
34_1_34A,8845,34,true,1585450522,253,34,278.74,12874,277.59,279.82,False,0,43.7135513,-79.3653457
34_1_34A,8845,34,true,1585450521,253,34,278.74,12874,277.59,279.82,False,0,43.7135513,-79.3653457
34_1_34A,8845,34,true,1585450552,254,34,278.74,12874,277.59,279.82,False,0,43.7126227,-79.3696123
34_1_34A,8845,34,true,1585450551,254,34,278.74,12874,277.59,279.82,False,0,43.7126227,-79.3696123
34_1_34A,8845,34,true,1585450582,255,35,278.74,12874,277.59,279.82,False,0,43.7118062,-79.3735032
34_1_34A,8845,34,true,1585450581,255,35,278.74,12874,277.59,279.82,False,0,43.7118062,-79.3735032
34_1_34A,8845,34,true,1585450612,245,22,278.81,12874,277.59,280.37,False,0,43.7113566,-79.3762181
34_1_34A,8845,34,true,1585450644,255,0,278.81,12874,277.59,280.37,False,0,43.7113085,-79.376469
34_1_34A,8845,34,true,1585450672,255,0,278.81,12874,277.59,280.37,False,0,43.7113085,-79.376469
34_1_34A,8845,34,true,1585450671,255,0,278.81,12874,277.59,280.37,False,0,43.7113085,-79.376469
34_1_34A,8845,34,true,1585450702,253,39,278.81,12874,277.59,280.37,False,0,43.7104518,-79.3802409
34_1_34A,8845,34,true,1585450732,254,39,278.81,12874,277.59,280.37,False,0,43.7096741,-79.3840158
34_1_34A,8845,34,true,1585450731,254,39,278.81,12874,277.59,280.37,False,0,43.7096741,-79.3840158
34_1_34A,8845,34,true,1585450762,252,23,278.74,12874,277.04,280.37,False,0,43.708798,-79.3885307
34_1_34A,8845,34,true,1585450792,254,0,278.74,12874,277.04,280.37,False,0,43.7084985,-79.3896658
34_1_34A,8845,34,true,1585450791,254,0,278.74,12874,277.04,280.37,False,0,43.7084985,-79.3896658
34_1_34A,8845,34,true,1585450822,254,0,278.74,12874,277.04,280.37,False,0,43.7084985,-79.3896658
34_1_34A,8845,34,true,1585450821,254,0,278.74,12874,277.04,280.37,False,0,43.7084985,-79.3896658
34_1_34A,8845,34,true,1585450852,267,24,278.74,12874,277.04,280.37,False,0,43.7081468,-79.3914078
34_1_34A,8845,34,true,1585450851,267,24,278.74,12874,277.04,280.37,False,0,43.7081468,-79.3914078
34_1_34A,8845,34,true,1585450882,254,0,278.73,12874,277.04,280.37,False,0,43.7079887,-79.3926467
34_1_34A,8845,34,true,1585450912,251,33,278.73,12874,277.04,280.37,False,0,43.7075327,-79.3946336
34_1_34A,8845,34,true,1585450942,253,33,278.8,12874,277.59,280.37,False,0,43.707269,-79.3957697
34_1_34A,8845,34,true,1585450972,253,31,278.8,12874,277.59,280.37,False,0,43.7065677,-79.3991421
34_1_34A,8845,34,true,1585450971,253,31,278.8,12874,277.59,280.37,False,0,43.7065677,-79.3991421
34_1_34A,8845,34,true,1585451002,166,24,278.8,12874,277.59,280.37,False,0,43.70608,-79.4001956
34_1_34A,8845,34,true,1585451032,93,20,278.8,12874,277.59,280.37,False,0,43.7050933,-79.3985671
34_1_34A,8845,34,true,1585451031,93,20,278.8,12874,277.59,280.37,False,0,43.7050933,-79.3985671
34_1_34A,8845,34,true,1585451061,173,0,278.8,12874,277.59,280.37,False,0,43.7050933,-79.3985671
34_1_34A,8845,34,true,1585451062,173,0,278.8,12874,277.59,280.37,False,0,43.7050933,-79.3985671
34_1_34A,8845,34,true,1585451092,173,0,278.8,12874,277.59,280.37,False,0,43.7050933,-79.3985671
34_1_34A,8845,34,true,1585451122,173,0,278.8,12874,277.59,280.37,False,0,43.7050933,-79.3985671
34_1_34A,8845,34,true,1585451152,173,0,278.8,12874,277.59,280.37,False,0,43.7050933,-79.3985671
34_1_34A,8845,34,true,1585451182,173,0,278.8,12874,277.59,280.37,False,0,43.7050933,-79.3985671
34_1_34A,8845,34,true,1585451212,173,0,278.8,12874,277.59,280.37,False,0,43.7050933,-79.3985671
34_1_34A,8845,34,true,1585451213,173,0,278.8,12874,277.59,280.37,False,0,43.7050933,-79.3985671
34_1_34A,8845,34,true,1585451242,173,0,278.74,12874,277.04,280.37,False,0,43.7050933,-79.3985671
34_1_34A,8845,34,true,1585451272,173,0,278.74,12874,277.04,280.37,False,0,43.7050933,-79.3985671
34_1_34A,8845,34,true,1585451302,173,0,278.74,12874,277.04,280.37,False,0,43.7050933,-79.3985671
34_1_34A,8845,34,true,1585451332,173,0,278.74,12874,277.04,280.37,False,0,43.7050933,-79.3985671
34_1_34A,8845,34,true,1585451333,173,0,278.74,12874,277.04,280.37,False,0,43.7050933,-79.3985671
34_1_34A,8845,34,true,1585451363,1,18,278.74,12874,277.04,280.37,False,0,43.7050933,-79.3985671
34_1_34A,8845,34,true,1585451362,1,18,278.74,12874,277.04,280.37,False,0,43.7050933,-79.3985671
34_1_34A,8845,34,true,1585451392,281,17,278.74,12874,277.04,280.37,False,0,43.7050933,-79.3985671
34_1_34A,8845,34,true,1585453223,67,0,278.91,14484,277.59,280.37,False,0,43.733049,-79.2632972
34_1_34A,8845,34,true,1585453222,67,0,278.91,14484,277.59,280.37,False,0,43.733049,-79.2632972
34_1_34A,8845,34,true,1585453253,172,17,278.91,14484,277.59,280.37,False,0,43.7328091,-79.2632161
34_1_34A,8845,34,true,1585453252,172,17,278.91,14484,277.59,280.37,False,0,43.7328091,-79.2632161
34_1_34A,8845,34,true,1585453283,29,10,278.91,14484,277.59,280.37,False,0,43.7322502,-79.2640686
34_1_34A,8845,34,true,1585453282,29,10,278.91,14484,277.59,280.37,False,0,43.7322502,-79.2640686
34_1_34A,8845,34,true,1585453313,216,0,278.91,14484,277.59,280.37,False,0,43.7323951,-79.2641983
34_1_34A,8845,34,true,1585453312,216,0,278.91,14484,277.59,280.37,False,0,43.7323951,-79.2641983
34_1_34A,8845,34,true,1585453342,216,0,278.91,14484,277.59,280.37,False,0,43.7323951,-79.2641983
34_1_34A,8845,34,true,1585453343,216,0,278.91,14484,277.59,280.37,False,0,43.7323951,-79.2641983
34_1_34A,8845,34,true,1585453373,216,0,278.91,14484,277.59,280.37,False,0,43.7323951,-79.2641983
34_1_34A,8845,34,true,1585453372,216,0,278.91,14484,277.59,280.37,False,0,43.7323951,-79.2641983
34_1_34A,8845,34,true,1585453402,216,0,278.91,14484,277.59,280.37,False,0,43.7323951,-79.2641983
34_1_34A,8845,34,true,1585453403,216,0,278.91,14484,277.59,280.37,False,0,43.7323951,-79.2641983
34_1_34A,8845,34,true,1585453434,216,0,278.91,14484,277.59,280.37,False,0,43.7323951,-79.2641983
34_1_34A,8845,34,true,1585453435,216,0,278.91,14484,277.59,280.37,False,0,43.7323951,-79.2641983
34_1_34A,8845,34,true,1585453464,216,0,278.91,14484,277.59,280.37,False,0,43.7323951,-79.2641983
34_1_34A,8845,34,true,1585453463,216,0,278.91,14484,277.59,280.37,False,0,43.7323951,-79.2641983
34_1_34A,8845,34,true,1585453494,216,0,278.91,14484,277.59,280.37,False,0,43.7323951,-79.2641983
34_1_34A,8845,34,true,1585453493,216,0,278.91,14484,277.59,280.37,False,0,43.7323951,-79.2641983
34_1_34A,8845,34,true,1585453524,216,0,278.91,14484,277.59,280.37,False,0,43.7323951,-79.2641983
34_1_34A,8845,34,true,1585453523,216,0,278.91,14484,277.59,280.37,False,0,43.7323951,-79.2641983
34_1_34A,8845,34,true,1585453553,216,0,278.91,14484,277.59,280.37,False,0,43.7323951,-79.2641983
34_1_34A,8845,34,true,1585453554,216,0,278.91,14484,277.59,280.37,False,0,43.7323951,-79.2641983
34_1_34A,8845,34,true,1585453584,216,0,278.91,14484,277.59,280.37,False,0,43.7323951,-79.2641983
34_1_34A,8845,34,true,1585453583,216,0,278.91,14484,277.59,280.37,False,0,43.7323951,-79.2641983
34_1_34A,8845,34,true,1585453613,216,0,278.91,14484,277.59,280.37,False,0,43.7323951,-79.2641983
34_1_34A,8845,34,true,1585453614,216,0,278.91,14484,277.59,280.37,False,0,43.7323951,-79.2641983
34_1_34A,8845,34,true,1585453644,99,13,278.91,14484,277.59,280.37,False,0,43.7324638,-79.2641983
34_1_34A,8845,34,true,1585453643,99,13,278.91,14484,277.59,280.37,False,0,43.7324638,-79.2641983
34_1_34A,8845,34,true,1585453673,216,0,278.91,14484,277.59,280.37,False,0,43.7323036,-79.2636871
34_1_34A,8845,34,true,1585453674,216,0,278.91,14484,277.59,280.37,False,0,43.7323036,-79.2636871
34_1_34A,8845,34,true,1585453703,247,36,278.91,14484,277.59,280.37,False,0,43.7333984,-79.2640762
34_1_34A,8845,34,true,1585453704,247,36,278.91,14484,277.59,280.37,False,0,43.7333984,-79.2640762
34_1_34A,8845,34,true,1585453733,254,28,278.81,14484,277.59,280.37,False,0,43.7327957,-79.2666015
34_1_34A,8845,34,true,1585453734,254,28,278.81,14484,277.59,280.37,False,0,43.7327957,-79.2666015
34_1_34A,8845,34,true,1585453764,265,0,278.81,14484,277.59,280.37,False,0,43.7324142,-79.2677459
34_1_34A,8845,34,true,1585453794,265,0,278.81,14484,277.59,280.37,False,0,43.7324142,-79.2677459
34_1_34A,8845,34,true,1585453793,265,0,278.81,14484,277.59,280.37,False,0,43.7324142,-79.2677459
34_1_34A,8845,34,true,1585453824,265,0,278.81,14484,277.59,280.37,False,0,43.7324142,-79.2677459
34_1_34A,8845,34,true,1585453823,265,0,278.81,14484,277.59,280.37,False,0,43.7324142,-79.2677459
34_1_34A,8845,34,true,1585453854,251,35,278.81,14484,277.59,280.37,False,0,43.7316703,-79.2705535
34_1_34A,8845,34,true,1585453853,251,35,278.81,14484,277.59,280.37,False,0,43.7316703,-79.2705535
34_1_34A,8845,34,true,1585453883,251,31,278.81,14484,277.59,280.37,False,0,43.7313232,-79.2716751
34_1_34A,8845,34,true,1585453884,251,31,278.81,14484,277.59,280.37,False,0,43.7313232,-79.2716751
34_1_34A,8845,34,true,1585453914,254,18,278.89,14484,277.59,280.37,False,0,43.7305488,-79.2751312
34_1_34A,8845,34,true,1585453944,253,46,278.89,14484,277.59,280.37,False,0,43.729721,-79.2790451
34_1_34A,8845,34,true,1585453974,254,0,278.89,14484,277.59,280.37,False,0,43.7294235,-79.2804031
34_1_34A,8845,34,true,1585453973,254,0,278.89,14484,277.59,280.37,False,0,43.7294235,-79.2804031
34_1_34A,8845,34,true,1585454004,254,0,278.89,14484,277.59,280.37,False,0,43.7294235,-79.2804031
34_1_34A,8845,34,true,1585454034,252,52,278.89,14484,277.59,280.37,False,0,43.7287139,-79.2842178
34_1_34A,8845,34,true,1585454064,252,42,278.75,14484,277.59,280.37,False,0,43.7275772,-79.2887954
34_1_34A,8845,34,true,1585454094,216,0,278.75,14484,277.59,280.37,False,0,43.7271156,-79.2913284
34_1_34A,8845,34,true,1585454124,253,32,278.75,14484,277.59,280.37,False,0,43.7269058,-79.2919387
34_1_34A,8845,34,true,1585454154,253,44,278.75,14484,277.59,280.37,False,0,43.725933,-79.29673
34_1_34A,8845,34,true,1585454153,253,44,278.75,14484,277.59,280.37,False,0,43.725933,-79.29673
34_1_34A,8845,34,true,1585454183,261,40,278.74,14484,277.59,280.37,False,0,43.7247467,-79.3018798
34_1_34A,8845,34,true,1585454184,261,40,278.74,14484,277.59,280.37,False,0,43.7247467,-79.3018798
34_1_34A,8845,34,true,1585454214,282,48,278.74,14484,277.59,280.37,False,0,43.7250213,-79.3064117
34_1_34A,8845,34,true,1585454244,287,44,278.74,14484,277.59,280.37,False,0,43.7256011,-79.3108062
34_1_34A,8845,34,true,1585454274,282,0,278.74,14484,277.59,280.37,False,0,43.7260665,-79.3130874
34_1_34A,8845,34,true,1585454304,273,44,278.74,14484,277.59,280.37,False,0,43.7262268,-79.3152923
34_1_34A,8845,34,true,1585454334,259,20,278.74,14484,277.59,280.37,False,0,43.7263221,-79.3180999
34_1_34A,8845,34,true,1585454364,250,39,278.74,14484,277.59,280.37,False,0,43.7253646,-79.3215713
34_1_34A,8845,34,true,1585454394,251,46,278.77,14484,277.04,280.37,False,0,43.7240371,-79.3266525
34_1_34A,8845,34,true,1585454424,249,44,278.77,14484,277.04,280.37,False,0,43.7230415,-79.3307876
34_1_34A,8845,34,true,1585454454,244,0,278.77,14484,277.04,280.37,False,0,43.722721,-79.3318023
34_1_34A,8845,34,true,1585454485,250,48,278.77,14484,277.04,280.37,False,0,43.7222442,-79.3331298
34_1_34A,8845,34,true,1585454484,250,48,278.77,14484,277.04,280.37,False,0,43.7222442,-79.3331298
34_1_34A,8845,34,true,1585454514,251,38,278.7,14484,277.04,280.37,False,0,43.7208251,-79.3377838
34_1_34A,8845,34,true,1585454544,243,48,278.7,14484,277.04,280.37,False,0,43.7201461,-79.3404693
34_1_34A,8845,34,true,1585454574,246,53,278.68,14484,277.04,280.37,False,0,43.7183456,-79.3457107
34_1_34A,8845,34,true,1585454604,246,49,278.68,14484,277.04,280.37,False,0,43.7166824,-79.3511123
34_1_34A,8845,34,true,1585454634,265,40,278.68,14484,277.04,280.37,False,0,43.7154273,-79.3559036
34_1_34A,8845,34,true,1585454635,265,40,278.68,14484,277.04,280.37,False,0,43.7154273,-79.3559036
34_1_34A,8845,34,true,1585454664,255,0,278.67,14484,277.04,280.37,False,0,43.7147445,-79.3591766
34_1_34A,8845,34,true,1585454665,255,0,278.67,14484,277.04,280.37,False,0,43.7147445,-79.3591766
34_1_34A,8845,34,true,1585454694,252,36,278.67,14484,277.04,280.37,False,0,43.7143287,-79.361557
34_1_34A,8845,34,true,1585454724,254,0,278.67,14484,277.04,280.37,False,0,43.7136344,-79.3644332
34_1_34A,8845,34,true,1585454754,254,0,278.67,14484,277.04,280.37,False,0,43.7136344,-79.3644332
34_1_34A,8845,34,true,1585454755,254,0,278.67,14484,277.04,280.37,False,0,43.7136344,-79.3644332
34_1_34A,8845,34,true,1585454784,254,32,278.66,14484,277.04,280.37,False,0,43.7132759,-79.3666305
34_1_34A,8845,34,true,1585454814,254,37,278.66,14484,277.04,280.37,False,0,43.7124862,-79.3701324
34_1_34A,8845,34,true,1585454844,255,31,278.66,14484,277.04,280.37,False,0,43.7117271,-79.3738861
34_1_34A,8845,34,true,1585454874,255,0,278.66,14484,277.04,280.37,False,0,43.711296,-79.3765335
34_1_34A,8845,34,true,1585454875,255,0,278.66,14484,277.04,280.37,False,0,43.711296,-79.3765335
34_1_34A,8845,34,true,1585454904,255,0,278.66,14484,277.04,280.37,False,0,43.711296,-79.3765335
34_1_34A,8845,34,true,1585454934,255,0,278.66,14484,277.04,280.37,False,0,43.711296,-79.3765335
34_1_34A,8845,34,true,1585454965,252,14,278.66,14484,277.04,280.37,False,0,43.7112503,-79.3767776
34_1_34A,8845,34,true,1585454964,252,14,278.66,14484,277.04,280.37,False,0,43.7112503,-79.3767776
34_1_34A,8845,34,true,1585454994,254,31,278.66,14484,277.04,280.37,False,0,43.7105369,-79.3795394
34_1_34A,8845,34,true,1585455025,253,27,278.66,14484,277.04,280.37,False,0,43.7104295,-79.3802887
34_1_34A,8845,34,true,1585455024,253,27,278.66,14484,277.04,280.37,False,0,43.7104295,-79.3802887
34_1_34A,8845,34,true,1585455055,254,40,278.66,14484,277.04,280.37,False,0,43.7095496,-79.3847346
34_1_34A,8845,34,true,1585455054,254,40,278.66,14484,277.04,280.37,False,0,43.7095496,-79.3847346
34_1_34A,8845,34,true,1585455084,254,27,278.65,14484,277.04,280.37,False,0,43.7088009,-79.3885242
34_1_34A,8845,34,true,1585455085,254,27,278.65,14484,277.04,280.37,False,0,43.7088009,-79.3885242
34_1_34A,8845,34,true,1585455114,254,0,278.65,14484,277.04,280.37,False,0,43.7085224,-79.3895389
34_1_34A,8845,34,true,1585455115,254,0,278.65,14484,277.04,280.37,False,0,43.7085224,-79.3895389
34_1_34A,8845,34,true,1585455144,254,0,278.65,14484,277.04,280.37,False,0,43.7085224,-79.3895389
34_1_34A,8845,34,true,1585455145,254,0,278.65,14484,277.04,280.37,False,0,43.7085224,-79.3895389
34_1_34A,8845,34,true,1585455174,255,19,278.69,14484,277.04,280.37,False,0,43.7080628,-79.3920249
34_1_34A,8845,34,true,1585455175,255,19,278.69,14484,277.04,280.37,False,0,43.7080628,-79.3920249
34_1_34A,8845,34,true,1585455204,253,28,278.69,14484,277.04,280.37,False,0,43.7074068,-79.3953845
34_1_34A,8845,34,true,1585455205,253,28,278.69,14484,277.04,280.37,False,0,43.7074068,-79.3953845
34_1_34A,8845,34,true,1585455234,253,0,278.69,14484,277.04,280.37,False,0,43.7068817,-79.3976265
34_1_34A,8845,34,true,1585455235,253,0,278.69,14484,277.04,280.37,False,0,43.7068817,-79.3976265
34_1_34A,8845,34,true,1585455264,253,0,278.69,14484,277.04,280.37,False,0,43.7064815,-79.3995735
34_1_34A,8845,34,true,1585455265,253,0,278.69,14484,277.04,280.37,False,0,43.7064815,-79.3995735
34_1_34A,8845,34,true,1585455295,249,2,278.69,14484,277.04,280.37,False,0,43.7064774,-79.3995957
34_1_34A,8845,34,true,1585455294,249,2,278.69,14484,277.04,280.37,False,0,43.7064774,-79.3995957
34_1_34A,8845,34,true,1585455324,101,17,278.69,14484,277.04,280.37,False,0,43.7055271,-79.3996165
34_1_34A,8845,34,true,1585455325,101,17,278.69,14484,277.04,280.37,False,0,43.7055271,-79.3996165
34_1_34A,8845,34,true,1585455355,348,27,278.69,14484,277.04,280.37,False,0,43.7050933,-79.3985671
34_1_34A,8845,34,true,1585455354,348,27,278.69,14484,277.04,280.37,False,0,43.7050933,-79.3985671
34_1_34A,8845,34,true,1585455385,322,14,278.69,14484,277.04,280.37,False,0,43.7050933,-79.3985671
34_1_34A,8845,34,true,1585455384,322,14,278.69,14484,277.04,280.37,False,0,43.7050933,-79.3985671
34_1_34A,8845,34,true,1585455414,173,0,278.69,14484,277.04,280.37,False,0,43.7050933,-79.3985671
34_1_34A,8845,34,true,1585455415,173,0,278.69,14484,277.04,280.37,False,0,43.7050933,-79.3985671
34_1_34A,8845,34,true,1585455444,173,0,278.69,14484,277.04,280.37,False,0,43.7050933,-79.3985671
34_1_34A,8845,34,true,1585455445,173,0,278.69,14484,277.04,280.37,False,0,43.7050933,-79.3985671
34_1_34A,8845,34,true,1585455474,173,0,278.69,14484,277.04,280.37,False,0,43.7050933,-79.3985671
34_1_34A,8845,34,true,1585455475,173,0,278.69,14484,277.04,280.37,False,0,43.7050933,-79.3985671
34_1_34A,8845,34,true,1585455504,173,0,278.69,14484,277.04,280.37,False,0,43.7050933,-79.3985671
34_1_34A,8845,34,true,1585455505,173,0,278.69,14484,277.04,280.37,False,0,43.7050933,-79.3985671
34_1_34A,8845,34,true,1585455534,173,0,278.69,14484,277.04,280.37,False,0,43.7050933,-79.3985671
34_1_34A,8845,34,true,1585455535,173,0,278.69,14484,277.04,280.37,False,0,43.7050933,-79.3985671
34_1_34A,8845,34,true,1585455564,173,0,278.69,14484,277.04,280.37,False,0,43.7050933,-79.3985671
34_1_34A,8845,34,true,1585455565,173,0,278.69,14484,277.04,280.37,False,0,43.7050933,-79.3985671
34_1_34A,8845,34,true,1585455596,173,0,278.69,14484,277.04,280.37,False,0,43.7050933,-79.3985671
34_1_34A,8845,34,true,1585455597,173,0,278.69,14484,277.04,280.37,False,0,43.7050933,-79.3985671
34_1_34A,8845,34,true,1585455624,173,0,278.69,14484,277.04,280.37,False,0,43.7050933,-79.3985671
34_1_34A,8845,34,true,1585455625,173,0,278.69,14484,277.04,280.37,False,0,43.7050933,-79.3985671
34_1_34A,8845,34,true,1585455655,173,0,278.69,14484,277.04,280.37,False,0,43.7050933,-79.3985671
34_1_34A,8845,34,true,1585455654,173,0,278.69,14484,277.04,280.37,False,0,43.7050933,-79.3985671
34_1_34A,8845,34,true,1585455685,173,0,278.69,14484,277.04,280.37,False,0,43.7050933,-79.3985671
34_1_34A,8845,34,true,1585455684,173,0,278.69,14484,277.04,280.37,False,0,43.7050933,-79.3985671
34_1_34A,8845,34,true,1585455715,173,0,278.69,14484,277.04,280.37,False,0,43.7050933,-79.3985671
34_1_34A,8845,34,true,1585455714,173,0,278.69,14484,277.04,280.37,False,0,43.7050933,-79.3985671
34_1_34A,8845,34,true,1585457397,60,28,278.76,14484,277.59,280.37,False,0,43.7329553,-79.2636995
34_1_34A,8845,34,true,1585457425,175,0,278.76,14484,277.59,280.37,False,0,43.73274,-79.2630133
34_1_34A,8845,34,true,1585457455,54,13,278.76,14484,277.59,280.37,False,0,43.7325966,-79.2641583
34_1_34A,8845,34,true,1585457484,216,0,278.76,14484,277.59,280.37,False,0,43.7326216,-79.2640883
34_1_34A,8845,34,true,1585457485,216,0,278.76,14484,277.59,280.37,False,0,43.7326216,-79.2640883
34_1_34A,8845,34,true,1585457515,216,0,278.76,14484,277.59,280.37,False,0,43.7326216,-79.2640883
34_1_34A,8845,34,true,1585457516,216,0,278.76,14484,277.59,280.37,False,0,43.7326216,-79.2640883
34_1_34A,8845,34,true,1585457545,216,0,278.76,14484,277.59,280.37,False,0,43.7326216,-79.2640883
34_1_34A,8845,34,true,1585457575,216,0,278.76,14484,277.59,280.37,False,0,43.7326216,-79.2640883
34_1_34A,8845,34,true,1585457605,216,0,278.76,14484,277.59,280.37,False,0,43.7326216,-79.2640883
34_1_34A,8845,34,true,1585457635,216,0,278.76,14484,277.59,280.37,False,0,43.7326216,-79.2640883
34_1_34A,8845,34,true,1585457665,216,0,278.76,14484,277.59,280.37,False,0,43.7326216,-79.2640883
34_1_34A,8845,34,true,1585457666,216,0,278.76,14484,277.59,280.37,False,0,43.7326216,-79.2640883
34_1_34A,8845,34,true,1585457695,216,0,278.76,14484,277.59,280.37,False,0,43.7326216,-79.2640883
34_1_34A,8845,34,true,1585457725,216,0,278.76,14484,277.59,280.37,False,0,43.7323951,-79.2641983
34_1_34A,8845,34,true,1585457726,216,0,278.76,14484,277.59,280.37,False,0,43.7323951,-79.2641983
34_1_34A,8845,34,true,1585457758,216,0,278.76,14484,277.59,280.37,False,0,43.7323951,-79.2641983
34_1_34A,8845,34,true,1585457785,216,0,278.76,14484,277.59,280.37,False,0,43.7323951,-79.2641983
34_1_34A,8845,34,true,1585457815,216,0,278.76,14484,277.59,280.37,False,0,43.7323951,-79.2641983
34_1_34A,8845,34,true,1585457845,216,0,278.76,14484,277.59,280.37,False,0,43.7323951,-79.2641983
34_1_34A,8845,34,true,1585457846,216,0,278.76,14484,277.59,280.37,False,0,43.7323951,-79.2641983
34_1_34A,8845,34,true,1585457875,216,0,278.76,14484,277.59,280.37,False,0,43.7323951,-79.2641983
34_1_34A,8845,34,true,1585457905,216,0,278.76,14484,277.59,280.37,False,0,43.7323951,-79.2641983
34_1_34A,8845,34,true,1585457906,216,0,278.76,14484,277.59,280.37,False,0,43.7323951,-79.2641983
34_1_34A,8845,34,true,1585457935,216,0,278.76,14484,277.59,280.37,False,0,43.7323951,-79.2641983
34_1_34A,8845,34,true,1585457965,216,0,278.76,14484,277.59,280.37,False,0,43.7323951,-79.2641983
34_1_34A,8845,34,true,1585457995,216,0,278.83,14484,277.59,280.37,False,0,43.7323951,-79.2641983
34_1_34A,8845,34,true,1585458025,216,0,278.83,14484,277.59,280.37,False,0,43.7323951,-79.2641983
34_1_34A,8845,34,true,1585458055,216,0,278.83,14484,277.59,280.37,False,0,43.7323722,-79.2634582
34_1_34A,8845,34,true,1585458085,216,0,278.83,14484,277.59,280.37,False,0,43.7327919,-79.2631454
34_1_34A,8845,34,true,1585458086,216,0,278.83,14484,277.59,280.37,False,0,43.7327919,-79.2631454
34_1_34A,8845,34,true,1585458115,248,38,278.83,14484,277.59,280.37,False,0,43.7333602,-79.2642669
34_1_34A,8845,34,true,1585458116,248,38,278.83,14484,277.59,280.37,False,0,43.7333602,-79.2642669
34_1_34A,8845,34,true,1585458146,253,0,278.76,14484,277.59,280.37,False,0,43.7329864,-79.2663574
34_1_34A,8845,34,true,1585458145,253,0,278.76,14484,277.59,280.37,False,0,43.7329864,-79.2663574
34_1_34A,8845,34,true,1585458175,251,43,278.76,14484,277.59,280.37,False,0,43.7319717,-79.2688674
34_1_34A,8845,34,true,1585458205,249,36,278.76,14484,277.59,280.37,False,0,43.7313232,-79.2716751
34_1_34A,8845,34,true,1585458235,252,0,278.76,14484,277.59,280.37,False,0,43.7309722,-79.273796
34_1_34A,8845,34,true,1585458265,253,38,278.75,14484,277.59,280.37,False,0,43.7302436,-79.2769317
34_1_34A,8845,34,true,1585458266,253,38,278.75,14484,277.59,280.37,False,0,43.7302436,-79.2769317
34_1_34A,8845,34,true,1585458295,253,0,278.75,14484,277.59,280.37,False,0,43.7301673,-79.2775497
34_1_34A,8845,34,true,1585458326,252,5,278.75,14484,277.59,280.37,False,0,43.7301673,-79.2775497
34_1_34A,8845,34,true,1585458325,252,5,278.75,14484,277.59,280.37,False,0,43.7301673,-79.2775497
34_1_34A,8845,34,true,1585458355,250,42,278.8,14484,277.59,280.37,False,0,43.7291564,-79.2816696
34_1_34A,8845,34,true,1585458356,250,42,278.8,14484,277.59,280.37,False,0,43.7291564,-79.2816696
34_1_34A,8845,34,true,1585458385,252,30,278.8,14484,277.59,280.37,False,0,43.7283592,-79.2852935
34_1_34A,8845,34,true,1585458416,252,0,278.8,14484,277.59,280.37,False,0,43.7280387,-79.2873306
34_1_34A,8845,34,true,1585458415,252,0,278.8,14484,277.59,280.37,False,0,43.7280387,-79.2873306
34_1_34A,8845,34,true,1585458446,252,0,278.8,14484,277.59,280.37,False,0,43.7280387,-79.2873306
34_1_34A,8845,34,true,1585458445,252,0,278.8,14484,277.59,280.37,False,0,43.7280387,-79.2873306
34_1_34A,8845,34,true,1585458475,252,42,278.8,14484,277.59,280.37,False,0,43.7275276,-79.2890319
34_1_34A,8845,34,true,1585458505,251,43,278.8,14484,277.59,280.37,False,0,43.7266464,-79.2933883
34_1_34A,8845,34,true,1585458506,251,43,278.8,14484,277.59,280.37,False,0,43.7266464,-79.2933883
34_1_34A,8845,34,true,1585458535,253,32,278.79,14484,277.59,280.37,False,0,43.725933,-79.29673
34_1_34A,8845,34,true,1585458536,253,32,278.79,14484,277.59,280.37,False,0,43.725933,-79.29673
34_1_34A,8845,34,true,1585458566,254,0,278.79,14484,277.59,280.37,False,0,43.7258567,-79.2971725
34_1_34A,8845,34,true,1585458565,254,0,278.79,14484,277.59,280.37,False,0,43.7258567,-79.2971725
34_1_34A,8845,34,true,1585458596,252,46,278.79,14484,277.59,280.37,False,0,43.7252807,-79.2990493
34_1_34A,8845,34,true,1585458595,252,46,278.79,14484,277.59,280.37,False,0,43.7252807,-79.2990493
34_1_34A,8845,34,true,1585458626,274,52,278.78,14484,277.59,280.37,False,0,43.7247238,-79.3045196
34_1_34A,8845,34,true,1585458625,274,52,278.78,14484,277.59,280.37,False,0,43.7247238,-79.3045196
34_1_34A,8845,34,true,1585458655,282,48,278.76,14484,277.59,280.37,False,0,43.7253417,-79.3089447
34_1_34A,8845,34,true,1585458656,282,48,278.76,14484,277.59,280.37,False,0,43.7253417,-79.3089447
34_1_34A,8845,34,true,1585458685,282,0,278.76,14484,277.59,280.37,False,0,43.7261352,-79.3131713
34_1_34A,8845,34,true,1585458715,282,0,278.76,14484,277.59,280.37,False,0,43.7261352,-79.3131713
34_1_34A,8845,34,true,1585458716,282,0,278.76,14484,277.59,280.37,False,0,43.7261352,-79.3131713
34_1_34A,8845,34,true,1585458745,264,43,278.76,14484,277.59,280.37,False,0,43.7262229,-79.3175964
34_1_34A,8845,34,true,1585458746,264,43,278.76,14484,277.59,280.37,False,0,43.7262229,-79.3175964
34_1_34A,8845,34,true,1585458775,256,40,278.76,14484,277.59,280.37,False,0,43.7260475,-79.3187179
34_1_34A,8845,34,true,1585458776,256,40,278.76,14484,277.59,280.37,False,0,43.7260475,-79.3187179
34_1_34A,8845,34,true,1585458805,250,41,278.75,14484,277.04,280.37,False,0,43.7248229,-79.3236389
34_1_34A,8845,34,true,1585458806,250,41,278.75,14484,277.04,280.37,False,0,43.7248229,-79.3236389
34_1_34A,8845,34,true,1585458835,249,53,278.76,14484,277.04,280.37,False,0,43.723442,-79.3289566
34_1_34A,8845,34,true,1585458836,249,53,278.76,14484,277.04,280.37,False,0,43.723442,-79.3289566
34_1_34A,8845,34,true,1585458865,246,18,278.76,14484,277.04,280.37,False,0,43.722721,-79.3318023
34_1_34A,8845,34,true,1585458866,246,18,278.76,14484,277.04,280.37,False,0,43.722721,-79.3318023
34_1_34A,8845,34,true,1585458895,249,50,278.75,14484,277.04,280.37,False,0,43.7211074,-79.3368682
34_1_34A,8845,34,true,1585458896,249,50,278.75,14484,277.04,280.37,False,0,43.7211074,-79.3368682
34_1_34A,8845,34,true,1585458925,246,51,278.75,14484,277.04,280.37,False,0,43.7195129,-79.3419647
34_1_34A,8845,34,true,1585458926,246,51,278.75,14484,277.04,280.37,False,0,43.7195129,-79.3419647
34_1_34A,8845,34,true,1585458955,246,55,278.71,14484,277.04,280.37,False,0,43.7177314,-79.347702
34_1_34A,8845,34,true,1585458956,246,55,278.71,14484,277.04,280.37,False,0,43.7177314,-79.347702
34_1_34A,8845,34,true,1585458985,248,0,278.71,14484,277.04,280.37,False,0,43.7171592,-79.3497314
34_1_34A,8845,34,true,1585458986,248,0,278.71,14484,277.04,280.37,False,0,43.7171592,-79.3497314
34_1_34A,8845,34,true,1585459015,247,52,278.71,14484,277.04,280.37,False,0,43.7167587,-79.3508834
34_1_34A,8845,34,true,1585459016,247,52,278.71,14484,277.04,280.37,False,0,43.7167587,-79.3508834
34_1_34A,8845,34,true,1585459045,258,43,278.71,14484,277.04,280.37,False,0,43.7153816,-79.3561477
34_1_34A,8845,34,true,1585459075,250,16,278.69,14484,277.04,280.37,False,0,43.7146339,-79.3596496
34_1_34A,8845,34,true,1585459106,253,51,278.69,14484,277.04,280.37,False,0,43.7139854,-79.3627624
34_1_34A,8845,34,true,1585459136,254,0,278.68,14484,277.04,280.37,False,0,43.7131996,-79.3669815
34_1_34A,8845,34,true,1585459165,253,46,278.68,14484,277.04,280.37,False,0,43.7127838,-79.3688659
34_1_34A,8845,34,true,1585459166,253,46,278.68,14484,277.04,280.37,False,0,43.7127838,-79.3688659
34_1_34A,8845,34,true,1585459196,254,40,278.68,14484,277.04,280.37,False,0,43.7119941,-79.3725357
34_1_34A,8845,34,true,1585459195,254,40,278.68,14484,277.04,280.37,False,0,43.7119941,-79.3725357
34_1_34A,8845,34,true,1585459225,254,16,278.68,14484,277.04,280.37,False,0,43.7110481,-79.3771972
34_1_34A,8845,34,true,1585459226,254,16,278.68,14484,277.04,280.37,False,0,43.7110481,-79.3771972
34_1_34A,8845,34,true,1585459255,254,41,278.68,14484,277.04,280.37,False,0,43.7103157,-79.3806762
34_1_34A,8845,34,true,1585459307,260,33,278.68,14484,277.04,280.37,False,0,43.7096672,-79.3840713
34_1_34A,8845,34,true,1585459338,255,13,278.67,14484,277.04,280.37,False,0,43.7084732,-79.389801
34_1_34A,8845,34,true,1585459337,255,13,278.67,14484,277.04,280.37,False,0,43.7084732,-79.389801
34_1_34A,8845,34,true,1585459368,253,21,278.67,14484,277.04,280.37,False,0,43.7080383,-79.3922271
34_1_34A,8845,34,true,1585459367,253,21,278.67,14484,277.04,280.37,False,0,43.7080383,-79.3922271
34_1_34A,8845,34,true,1585459398,254,0,278.67,14484,277.04,280.37,False,0,43.7079887,-79.3926467
34_1_34A,8845,34,true,1585459397,254,0,278.67,14484,277.04,280.37,False,0,43.7079887,-79.3926467
34_1_34A,8845,34,true,1585459427,254,0,278.67,14484,277.04,280.37,False,0,43.7079887,-79.3926467
34_1_34A,8845,34,true,1585459428,254,0,278.67,14484,277.04,280.37,False,0,43.7079887,-79.3926467
34_1_34A,8845,34,true,1585459457,254,0,278.67,14484,277.04,280.37,False,0,43.7079887,-79.3926467
34_1_34A,8845,34,true,1585459458,254,0,278.67,14484,277.04,280.37,False,0,43.7079887,-79.3926467
34_1_34A,8845,34,true,1585459488,254,0,278.67,14484,277.04,280.37,False,0,43.7079887,-79.3926467
34_1_34A,8845,34,true,1585459487,254,0,278.67,14484,277.04,280.37,False,0,43.7079887,-79.3926467
34_1_34A,8845,34,true,1585459518,253,17,278.67,14484,277.04,280.37,False,0,43.7079279,-79.392783
34_1_34A,8845,34,true,1585459517,253,17,278.67,14484,277.04,280.37,False,0,43.7079279,-79.392783
34_1_34A,8845,34,true,1585459547,251,29,278.67,14484,277.04,280.37,False,0,43.7070874,-79.3966499
34_1_34A,8845,34,true,1585459548,251,29,278.67,14484,277.04,280.37,False,0,43.7070874,-79.3966499
34_1_34A,8845,34,true,1585459577,254,12,278.67,14484,277.04,280.37,False,0,43.7067649,-79.3981723
34_1_34A,8845,34,true,1585459578,254,12,278.67,14484,277.04,280.37,False,0,43.7067649,-79.3981723
34_1_34A,8845,34,true,1585459607,253,0,278.67,14484,277.04,280.37,False,0,43.7064347,-79.3998206
34_1_34A,8845,34,true,1585459608,253,0,278.67,14484,277.04,280.37,False,0,43.7064347,-79.3998206
34_1_34A,8845,34,true,1585459638,101,22,278.67,14484,277.04,280.37,False,0,43.7055155,-79.399581
34_1_34A,8845,34,true,1585459637,101,22,278.67,14484,277.04,280.37,False,0,43.7055155,-79.399581
34_1_34A,8845,34,true,1585459667,173,0,278.67,14484,277.04,280.37,False,0,43.7050933,-79.3985671
34_1_34A,8845,34,true,1585459668,173,0,278.67,14484,277.04,280.37,False,0,43.7050933,-79.3985671
34_1_34A,8845,34,true,1585459698,173,0,278.67,14484,277.04,280.37,False,0,43.7050933,-79.3985671
34_1_34A,8845,34,true,1585459697,173,0,278.67,14484,277.04,280.37,False,0,43.7050933,-79.3985671
34_1_34A,8845,34,true,1585459728,173,0,278.67,14484,277.04,280.37,False,0,43.7050933,-79.3985671
34_1_34A,8845,34,true,1585459727,173,0,278.67,14484,277.04,280.37,False,0,43.7050933,-79.3985671
34_1_34A,8845,34,true,1585459758,173,0,278.67,14484,277.04,280.37,False,0,43.7050933,-79.3985671
34_1_34A,8845,34,true,1585459757,173,0,278.67,14484,277.04,280.37,False,0,43.7050933,-79.3985671
34_1_34A,8845,34,true,1585459787,291,17,278.67,14484,277.04,280.37,False,0,43.7050933,-79.3985671
34_1_34A,8845,34,true,1585459788,291,17,278.67,14484,277.04,280.37,False,0,43.7050933,-79.3985671
