dir,id,route,predable,time,hdg,spd,temp,vis,t_min,t_max,snow,rain,lat,lon
34_1_34A,8802,34,true,1585480943,216,0,278.38,14484,277.04,279.82,False,2,43.7208816,-79.2920666
34_1_34A,8802,34,true,1585480974,216,0,278.38,14484,277.04,279.82,False,2,43.7208566,-79.2920716
34_1_34A,8802,34,true,1585480973,216,0,278.38,14484,277.04,279.82,False,2,43.7208566,-79.2920716
34_1_34A,8802,34,true,1585481003,216,0,278.38,14484,277.04,279.82,False,2,43.7208566,-79.2920716
34_1_34A,8802,34,true,1585481004,216,0,278.38,14484,277.04,279.82,False,2,43.7208566,-79.2920716
34_1_34A,8802,34,true,1585481033,216,0,278.38,14484,277.04,279.82,False,2,43.7208566,-79.2920716
34_1_34A,8802,34,true,1585481034,216,0,278.38,14484,277.04,279.82,False,2,43.7208566,-79.2920716
34_1_34A,8802,34,true,1585481063,216,0,278.38,14484,277.04,279.82,False,2,43.7208566,-79.2920716
34_1_34A,8802,34,true,1585481064,216,0,278.38,14484,277.04,279.82,False,2,43.7208566,-79.2920716
34_1_34A,8802,34,true,1585481094,216,0,278.38,14484,277.04,279.82,False,2,43.7208433,-79.2920933
34_1_34A,8802,34,true,1585481093,216,0,278.38,14484,277.04,279.82,False,2,43.7208433,-79.2920933
34_1_34A,8802,34,true,1585481123,216,0,278.38,14484,277.04,279.82,False,2,43.7208433,-79.2920933
34_1_34A,8802,34,true,1585481124,216,0,278.38,14484,277.04,279.82,False,2,43.7208433,-79.2920933
34_1_34A,8802,34,true,1585481153,216,0,278.38,14484,277.04,279.82,False,2,43.7208266,-79.2921099
34_1_34A,8802,34,true,1585481154,216,0,278.38,14484,277.04,279.82,False,2,43.7208266,-79.2921099
34_1_34A,8802,34,true,1585481184,216,0,278.38,14484,277.04,279.82,False,2,43.7208266,-79.2921099
34_1_34A,8802,34,true,1585481183,216,0,278.38,14484,277.04,279.82,False,2,43.7208266,-79.2921099
34_1_34A,8802,34,true,1585481213,216,0,278.38,14484,277.04,279.82,False,2,43.7208266,-79.2921099
34_1_34A,8802,34,true,1585481214,216,0,278.38,14484,277.04,279.82,False,2,43.7208266,-79.2921099
34_1_34A,8802,34,true,1585481243,216,0,278.38,14484,277.04,279.82,False,2,43.7208266,-79.2921099
34_1_34A,8802,34,true,1585481273,209,4,278.38,14484,277.04,279.82,False,2,43.7207183,-79.2921983
34_1_34A,8802,34,true,1585481274,209,4,278.38,14484,277.04,279.82,False,2,43.7207183,-79.2921983
34_1_34A,8802,34,true,1585481303,136,11,278.38,14484,277.04,279.82,False,2,43.7198916,-79.292715
34_1_34A,8802,34,true,1585481304,136,11,278.38,14484,277.04,279.82,False,2,43.7198916,-79.292715
34_1_34A,8802,34,true,1585481333,73,42,278.38,14484,277.04,279.82,False,2,43.7206883,-79.2888733
34_1_34A,8802,34,true,1585481334,73,42,278.38,14484,277.04,279.82,False,2,43.7206883,-79.2888733
34_1_34A,8802,34,true,1585481363,73,11,278.52,8047,277.04,280.37,False,2,43.7214566,-79.2852433
34_1_34A,8802,34,true,1585481393,72,42,278.55,8047,277.04,280.37,False,2,43.7219516,-79.283095
34_1_34A,8802,34,true,1585481394,72,42,278.55,8047,277.04,280.37,False,2,43.7219516,-79.283095
34_1_34A,8802,34,true,1585481424,71,44,278.55,8047,277.04,280.37,False,2,43.7231083,-79.2780433
34_1_34A,8802,34,true,1585481423,71,44,278.55,8047,277.04,280.37,False,2,43.7231083,-79.2780433
34_1_34A,8802,34,true,1585481453,337,40,278.55,8047,277.04,280.37,False,2,43.7244133,-79.2755866
34_1_34A,8802,34,true,1585481454,337,40,278.55,8047,277.04,280.37,False,2,43.7244133,-79.2755866
34_1_34A,8802,34,true,1585481483,341,42,278.41,14484,277.04,279.82,False,2,43.7278883,-79.2771566
34_1_34A,8802,34,true,1585481484,341,42,278.41,14484,277.04,279.82,False,2,43.7278883,-79.2771566
34_1_34A,8802,34,true,1585481514,75,33,278.41,14484,277.04,279.82,False,2,43.7301016,-79.2769266
34_1_34A,8802,34,true,1585481513,75,33,278.41,14484,277.04,279.82,False,2,43.7301016,-79.2769266
34_1_34A,8802,34,true,1585481544,73,18,278.42,14484,277.04,279.82,False,2,43.7307233,-79.2740333
34_1_34A,8802,34,true,1585481543,73,18,278.42,14484,277.04,279.82,False,2,43.7307233,-79.2740333
34_1_34A,8802,34,true,1585481574,71,44,278.42,14484,277.04,279.82,False,2,43.7316166,-79.2702183
34_1_34A,8802,34,true,1585481573,71,44,278.42,14484,277.04,279.82,False,2,43.7316166,-79.2702183
34_1_34A,8802,34,true,1585481603,127,28,278.42,14484,277.04,279.82,False,2,43.7321733,-79.2662066
34_1_34A,8802,34,true,1585481604,127,28,278.42,14484,277.04,279.82,False,2,43.7321733,-79.2662066
34_1_34A,8802,34,true,1585481633,63,15,278.61,8047,277.04,280.37,False,2,43.7324905,-79.2636871
34_1_34A,8802,34,true,1585481634,63,15,278.61,8047,277.04,280.37,False,2,43.7324905,-79.2636871
34_1_34A,8802,34,true,1585481663,164,10,278.61,8047,277.04,280.37,False,2,43.7326933,-79.2629533
34_1_34A,8802,34,true,1585481664,164,10,278.61,8047,277.04,280.37,False,2,43.7326933,-79.2629533
34_1_34A,8802,34,true,1585481693,246,6,278.61,8047,277.04,280.37,False,2,43.7325897,-79.2636947
34_1_34A,8802,34,true,1585481694,246,6,278.61,8047,277.04,280.37,False,2,43.7325897,-79.2636947
34_1_34A,8802,34,true,1585481723,216,0,278.61,8047,277.04,280.37,False,2,43.7325897,-79.2636947
34_1_34A,8802,34,true,1585481724,216,0,278.61,8047,277.04,280.37,False,2,43.7325897,-79.2636947
34_1_34A,8802,34,true,1585481753,80,3,278.61,8047,277.04,280.37,False,2,43.7323036,-79.2636871
34_1_34A,8802,34,true,1585481754,80,3,278.61,8047,277.04,280.37,False,2,43.7323036,-79.2636871
34_1_34A,8802,34,true,1585481783,216,0,278.61,8047,277.04,280.37,False,2,43.7323036,-79.2636871
34_1_34A,8802,34,true,1585481784,216,0,278.61,8047,277.04,280.37,False,2,43.7323036,-79.2636871
34_1_34A,8802,34,true,1585481813,60,5,278.61,8047,277.04,280.37,False,2,43.7327919,-79.2631454
34_1_34A,8802,34,true,1585481814,60,5,278.61,8047,277.04,280.37,False,2,43.7327919,-79.2631454
34_1_34A,8802,34,true,1585481843,251,30,278.61,8047,277.04,280.37,False,2,43.7331199,-79.2652053
34_1_34A,8802,34,true,1585481844,251,30,278.61,8047,277.04,280.37,False,2,43.7331199,-79.2652053
34_1_34A,8802,34,true,1585481873,253,0,278.61,8047,277.04,280.37,False,2,43.7329864,-79.2663574
34_1_34A,8802,34,true,1585481874,253,0,278.61,8047,277.04,280.37,False,2,43.7329864,-79.2663574
34_1_34A,8802,34,true,1585481903,265,0,278.61,8047,277.04,280.37,False,2,43.7324142,-79.2677459
34_1_34A,8802,34,true,1585481904,265,0,278.61,8047,277.04,280.37,False,2,43.7324142,-79.2677459
34_1_34A,8802,34,true,1585481934,265,0,278.61,8047,277.04,280.37,False,2,43.7324142,-79.2677459
34_1_34A,8802,34,true,1585481933,265,0,278.61,8047,277.04,280.37,False,2,43.7324142,-79.2677459
34_1_34A,8802,34,true,1585481964,265,0,278.61,8047,277.04,280.37,False,2,43.7324142,-79.2677459
34_1_34A,8802,34,true,1585481963,265,0,278.61,8047,277.04,280.37,False,2,43.7324142,-79.2677459
34_1_34A,8802,34,true,1585481993,251,34,278.61,8047,277.04,280.37,False,2,43.7316764,-79.2704981
34_1_34A,8802,34,true,1585481994,251,34,278.61,8047,277.04,280.37,False,2,43.7316764,-79.2704981
34_1_34A,8802,34,true,1585482023,247,26,278.61,8047,277.04,280.37,False,2,43.7312587,-79.2719634
34_1_34A,8802,34,true,1585482024,247,26,278.61,8047,277.04,280.37,False,2,43.7312587,-79.2719634
34_1_34A,8802,34,true,1585482054,247,18,278.61,8047,277.04,280.37,False,2,43.7309044,-79.2739338
34_1_34A,8802,34,true,1585482084,253,26,278.61,8047,277.04,280.37,False,2,43.730245,-79.2769203
34_1_34A,8802,34,true,1585482083,253,26,278.61,8047,277.04,280.37,False,2,43.730245,-79.2769203
34_1_34A,8802,34,true,1585482114,253,33,278.61,8047,277.04,280.37,False,2,43.7294695,-79.2801993
34_1_34A,8802,34,true,1585482113,253,33,278.61,8047,277.04,280.37,False,2,43.7294695,-79.2801993
34_1_34A,8802,34,true,1585482144,253,30,278.61,8047,277.04,280.37,False,2,43.7289706,-79.2831571
34_1_34A,8802,34,true,1585482143,253,30,278.61,8047,277.04,280.37,False,2,43.7289706,-79.2831571
