dir,id,route,predable,time,hdg,spd,temp,vis,t_min,t_max,snow,rain,lat,lon
34_0_34A,8908,34,true,1585434468,282,12,280.17,14484,277.59,283.15,False,0,43.7056274,-79.3999176
34_0_34A,8908,34,true,1585434469,282,12,280.17,14484,277.59,283.15,False,0,43.7056274,-79.3999176
34_0_34A,8908,34,true,1585434499,72,19,280.17,14484,277.59,283.15,False,0,43.7064895,-79.3995513
34_0_34A,8908,34,true,1585434529,76,0,280.17,14484,277.59,283.15,False,0,43.7066307,-79.3988265
34_0_34A,8908,34,true,1585434530,76,0,280.17,14484,277.59,283.15,False,0,43.7066307,-79.3988265
34_0_34A,8908,34,true,1585434559,75,13,280.17,14484,277.59,283.15,False,0,43.7066307,-79.3988265
34_0_34A,8908,34,true,1585434589,75,22,280.17,14484,277.59,283.15,False,0,43.7071456,-79.39608
34_0_34A,8908,34,true,1585434619,75,23,280.17,14484,277.59,283.15,False,0,43.7075614,-79.3942794
34_0_34A,8908,34,true,1585434649,73,8,280.17,14484,277.59,283.15,False,0,43.7077255,-79.3931427
34_0_34A,8908,34,true,1585434679,74,14,280.17,14484,277.59,283.15,False,0,43.708229,-79.3910064
34_0_34A,8908,34,true,1585434710,74,0,280.17,14484,277.59,283.15,False,0,43.7082786,-79.3907699
34_0_34A,8908,34,true,1585434709,74,0,280.17,14484,277.59,283.15,False,0,43.7082786,-79.3907699
34_0_34A,8908,34,true,1585434739,74,0,280.17,14484,277.59,283.15,False,0,43.7082786,-79.3907699
34_0_34A,8908,34,true,1585434770,74,22,280.17,14484,277.59,283.15,False,0,43.7084465,-79.3899459
34_0_34A,8908,34,true,1585434769,74,22,280.17,14484,277.59,283.15,False,0,43.7084465,-79.3899459
34_0_34A,8908,34,true,1585434799,73,20,280.17,14484,277.59,283.15,False,0,43.7089118,-79.3874435
34_0_34A,8908,34,true,1585434800,73,20,280.17,14484,277.59,283.15,False,0,43.7089118,-79.3874435
34_0_34A,8908,34,true,1585434829,74,24,279.94,14484,277.04,282.04,False,0,43.7097816,-79.3833389
34_0_34A,8908,34,true,1585434859,73,2,279.94,14484,277.04,282.04,False,0,43.7098693,-79.3827056
34_0_34A,8908,34,true,1585434890,73,14,279.94,14484,277.04,282.04,False,0,43.710411,-79.3801956
34_0_34A,8908,34,true,1585434889,73,14,279.94,14484,277.04,282.04,False,0,43.710411,-79.3801956
34_0_34A,8908,34,true,1585434919,77,20,279.94,14484,277.04,282.04,False,0,43.7106094,-79.3791503
34_0_34A,8908,34,true,1585434949,73,2,279.94,14484,277.04,282.04,False,0,43.7108726,-79.377861
34_0_34A,8908,34,true,1585434979,75,0,279.94,14484,277.04,282.04,False,0,43.7108726,-79.377861
34_0_34A,8908,34,true,1585435009,75,0,279.94,14484,277.04,282.04,False,0,43.7108726,-79.377861
34_0_34A,8908,34,true,1585435039,75,0,279.94,14484,277.04,282.04,False,0,43.7108726,-79.377861
34_0_34A,8908,34,true,1585435069,67,17,279.94,14484,277.04,282.04,False,0,43.7112274,-79.3759002
34_0_34A,8908,34,true,1585435070,67,17,279.94,14484,277.04,282.04,False,0,43.7112274,-79.3759002
34_0_34A,8908,34,true,1585435099,74,45,279.94,14484,277.04,282.04,False,0,43.7120742,-79.3721237
34_0_34A,8908,34,true,1585435130,73,37,279.94,14484,277.04,282.04,False,0,43.71315,-79.3667297
34_0_34A,8908,34,true,1585435129,73,37,279.94,14484,277.04,282.04,False,0,43.71315,-79.3667297
34_0_34A,8908,34,true,1585435159,75,0,279.94,14484,277.04,282.04,False,0,43.7134437,-79.3651428
34_0_34A,8908,34,true,1585435189,76,20,279.94,14484,277.04,282.04,False,0,43.7135581,-79.3647308
34_0_34A,8908,34,true,1585435190,76,20,279.94,14484,277.04,282.04,False,0,43.7135581,-79.3647308
34_0_34A,8908,34,true,1585435219,74,0,279.94,14484,277.04,282.04,False,0,43.7139167,-79.3624954
34_0_34A,8908,34,true,1585435220,74,0,279.94,14484,277.04,282.04,False,0,43.7139167,-79.3624954
34_0_34A,8908,34,true,1585435249,73,29,279.94,14484,277.04,282.04,False,0,43.7142002,-79.3614564
34_0_34A,8908,34,true,1585435250,73,29,279.94,14484,277.04,282.04,False,0,43.7142002,-79.3614564
34_0_34A,8908,34,true,1585435279,74,0,279.94,14484,277.04,282.04,False,0,43.7144052,-79.3602187
34_0_34A,8908,34,true,1585435280,74,0,279.94,14484,277.04,282.04,False,0,43.7144052,-79.3602187
34_0_34A,8908,34,true,1585435310,74,28,279.95,14484,277.04,282.04,False,0,43.7150882,-79.3577068
34_0_34A,8908,34,true,1585435309,74,28,279.95,14484,277.04,282.04,False,0,43.7150882,-79.3577068
34_0_34A,8908,34,true,1585435339,64,37,279.97,14484,277.04,282.04,False,0,43.7158225,-79.3540767
34_0_34A,8908,34,true,1585435370,65,32,279.97,14484,277.04,282.04,False,0,43.7169469,-79.3503577
34_0_34A,8908,34,true,1585435369,65,32,279.97,14484,277.04,282.04,False,0,43.7169469,-79.3503577
34_0_34A,8908,34,true,1585435400,69,41,279.97,14484,277.04,282.04,False,0,43.7182419,-79.3460436
34_0_34A,8908,34,true,1585435399,69,41,279.97,14484,277.04,282.04,False,0,43.7182419,-79.3460436
34_0_34A,8908,34,true,1585435429,65,39,279.99,14484,277.04,282.04,False,0,43.7194123,-79.3423177
34_0_34A,8908,34,true,1585435430,65,39,279.99,14484,277.04,282.04,False,0,43.7194123,-79.3423177
34_0_34A,8908,34,true,1585435459,66,11,279.99,14484,277.04,282.04,False,0,43.7203321,-79.3394047
34_0_34A,8908,34,true,1585435460,66,11,279.99,14484,277.04,282.04,False,0,43.7203321,-79.3394047
34_0_34A,8908,34,true,1585435489,78,0,279.99,14484,277.04,282.04,False,0,43.7204139,-79.3391189
34_0_34A,8908,34,true,1585435490,78,0,279.99,14484,277.04,282.04,False,0,43.7204139,-79.3391189
34_0_34A,8908,34,true,1585435519,65,27,279.99,14484,277.04,282.04,False,0,43.7206563,-79.3383289
34_0_34A,8908,34,true,1585435520,65,27,279.99,14484,277.04,282.04,False,0,43.7206563,-79.3383289
34_0_34A,8908,34,true,1585435550,65,15,279.99,14484,277.04,282.04,False,0,43.7205807,-79.3376717
34_0_34A,8908,34,true,1585435549,65,15,279.99,14484,277.04,282.04,False,0,43.7205807,-79.3376717
34_0_34A,8908,34,true,1585435579,67,35,280.01,14484,277.59,282.04,False,0,43.7218242,-79.3345246
34_0_34A,8908,34,true,1585435580,67,35,280.01,14484,277.59,282.04,False,0,43.7218242,-79.3345246
34_0_34A,8908,34,true,1585435610,69,0,280.01,14484,277.59,282.04,False,0,43.7224711,-79.3321935
34_0_34A,8908,34,true,1585435609,69,0,280.01,14484,277.59,282.04,False,0,43.7224711,-79.3321935
34_0_34A,8908,34,true,1585435640,69,0,280.01,14484,277.59,282.04,False,0,43.7224711,-79.3321935
34_0_34A,8908,34,true,1585435639,69,0,280.01,14484,277.59,282.04,False,0,43.7224711,-79.3321935
34_0_34A,8908,34,true,1585435669,69,0,280.01,14484,277.59,282.04,False,0,43.7224711,-79.3321935
34_0_34A,8908,34,true,1585435670,69,0,280.01,14484,277.59,282.04,False,0,43.7224711,-79.3321935
34_0_34A,8908,34,true,1585435699,66,27,280.01,14484,277.59,282.04,False,0,43.722772,-79.3313806
34_0_34A,8908,34,true,1585435700,66,27,280.01,14484,277.59,282.04,False,0,43.722772,-79.3313806
34_0_34A,8908,34,true,1585435729,70,33,280.01,14484,277.59,282.04,False,0,43.7238087,-79.3275243
34_0_34A,8908,34,true,1585435730,70,33,280.01,14484,277.59,282.04,False,0,43.7238087,-79.3275243
34_0_34A,8908,34,true,1585435759,68,13,280,14484,277.59,282.04,False,0,43.7245918,-79.3245347
34_0_34A,8908,34,true,1585435760,68,13,280,14484,277.59,282.04,False,0,43.7245918,-79.3245347
34_0_34A,8908,34,true,1585435789,70,1,280,14484,277.59,282.04,False,0,43.7246149,-79.3244452
34_0_34A,8908,34,true,1585435790,70,1,280,14484,277.59,282.04,False,0,43.7246149,-79.3244452
34_0_34A,8908,34,true,1585435819,71,39,279.96,14484,277.59,282.04,False,0,43.7254913,-79.3210842
34_0_34A,8908,34,true,1585435820,71,39,279.96,14484,277.59,282.04,False,0,43.7254913,-79.3210842
34_0_34A,8908,34,true,1585435849,79,11,279.96,14484,277.59,282.04,False,0,43.7259885,-79.3190702
34_0_34A,8908,34,true,1585435850,79,11,279.96,14484,277.59,282.04,False,0,43.7259885,-79.3190702
34_0_34A,8908,34,true,1585435879,95,33,279.96,14484,277.59,282.04,False,0,43.7262564,-79.315731
34_0_34A,8908,34,true,1585435880,95,33,279.96,14484,277.59,282.04,False,0,43.7262564,-79.315731
34_0_34A,8908,34,true,1585435910,96,0,279.97,14484,277.59,282.04,False,0,43.7261394,-79.3143289
34_0_34A,8908,34,true,1585435909,96,0,279.97,14484,277.59,282.04,False,0,43.7261394,-79.3143289
34_0_34A,8908,34,true,1585435939,96,0,279.97,14484,277.59,282.04,False,0,43.7261394,-79.3143289
34_0_34A,8908,34,true,1585435970,103,8,279.97,14484,277.59,282.04,False,0,43.7261327,-79.3142811
34_0_34A,8908,34,true,1585435969,103,8,279.97,14484,277.59,282.04,False,0,43.7261327,-79.3142811
34_0_34A,8908,34,true,1585435999,101,33,279.97,14484,277.59,282.04,False,0,43.7256722,-79.3113061
34_0_34A,8908,34,true,1585436000,101,33,279.97,14484,277.59,282.04,False,0,43.7256722,-79.3113061
34_0_34A,8908,34,true,1585436029,101,33,279.97,14484,277.59,282.04,False,0,43.7251201,-79.3075034
34_0_34A,8908,34,true,1585436030,101,33,279.97,14484,277.59,282.04,False,0,43.7251201,-79.3075034
34_0_34A,8908,34,true,1585436059,97,22,279.96,14484,277.59,282.04,False,0,43.7247369,-79.3046421
34_0_34A,8908,34,true,1585436060,97,22,279.96,14484,277.59,282.04,False,0,43.7247369,-79.3046421
34_0_34A,8908,34,true,1585436089,81,19,279.96,14484,277.59,282.04,False,0,43.7246833,-79.3026336
34_0_34A,8908,34,true,1585436090,81,19,279.96,14484,277.59,282.04,False,0,43.7246833,-79.3026336
34_0_34A,8908,34,true,1585436119,81,12,279.96,14484,277.59,282.04,False,0,43.7247524,-79.3017527
34_0_34A,8908,34,true,1585436120,81,12,279.96,14484,277.59,282.04,False,0,43.7247524,-79.3017527
34_0_34A,8908,34,true,1585436150,76,0,279.96,14484,277.59,282.04,False,0,43.7248141,-79.3013707
34_0_34A,8908,34,true,1585436149,76,0,279.96,14484,277.59,282.04,False,0,43.7248141,-79.3013707
34_0_34A,8908,34,true,1585436180,76,0,279.96,14484,277.59,282.04,False,0,43.7248141,-79.3013707
34_0_34A,8908,34,true,1585436179,76,0,279.96,14484,277.59,282.04,False,0,43.7248141,-79.3013707
34_0_34A,8908,34,true,1585436210,76,21,279.96,14484,277.59,282.04,False,0,43.7248817,-79.3009715
34_0_34A,8908,34,true,1585436209,76,21,279.96,14484,277.59,282.04,False,0,43.7248817,-79.3009715
34_0_34A,8908,34,true,1585436240,76,0,279.99,14484,277.59,282.04,False,0,43.7254264,-79.2984173
34_0_34A,8908,34,true,1585436239,76,0,279.99,14484,277.59,282.04,False,0,43.7254264,-79.2984173
34_0_34A,8908,34,true,1585436270,76,0,279.99,14484,277.59,282.04,False,0,43.7254264,-79.2984173
34_0_34A,8908,34,true,1585436269,76,0,279.99,14484,277.59,282.04,False,0,43.7254264,-79.2984173
34_0_34A,8908,34,true,1585436300,73,12,279.99,14484,277.59,282.04,False,0,43.725506,-79.298071
34_0_34A,8908,34,true,1585436299,73,12,279.99,14484,277.59,282.04,False,0,43.725506,-79.298071
34_0_34A,8908,34,true,1585436329,73,36,279.97,14484,277.59,282.04,False,0,43.72635,-79.2942983
34_0_34A,8908,34,true,1585436330,73,36,279.97,14484,277.59,282.04,False,0,43.72635,-79.2942983
34_0_34A,8908,34,true,1585436359,73,0,279.97,14484,277.59,282.04,False,0,43.7269401,-79.2909545
34_0_34A,8908,34,true,1585436360,73,0,279.97,14484,277.59,282.04,False,0,43.7269401,-79.2909545
34_0_34A,8908,34,true,1585436389,73,23,279.97,14484,277.59,282.04,False,0,43.7271092,-79.2905087
34_0_34A,8908,34,true,1585436390,73,23,279.97,14484,277.59,282.04,False,0,43.7271092,-79.2905087
34_0_34A,8908,34,true,1585436420,73,13,279.97,14484,277.59,282.04,False,0,43.7275426,-79.2884856
34_0_34A,8908,34,true,1585436419,73,13,279.97,14484,277.59,282.04,False,0,43.7275426,-79.2884856
34_0_34A,8908,34,true,1585436449,73,0,279.97,14484,277.59,282.04,False,0,43.7275909,-79.2881447
34_0_34A,8908,34,true,1585436450,73,0,279.97,14484,277.59,282.04,False,0,43.7275909,-79.2881447
34_0_34A,8908,34,true,1585436480,72,30,279.97,14484,277.59,282.04,False,0,43.7280734,-79.2865656
34_0_34A,8908,34,true,1585436479,72,30,279.97,14484,277.59,282.04,False,0,43.7280734,-79.2865656
34_0_34A,8908,34,true,1585436510,74,30,279.93,14484,277.59,282.04,False,0,43.7288239,-79.2827023
34_0_34A,8908,34,true,1585436509,74,30,279.93,14484,277.59,282.04,False,0,43.7288239,-79.2827023
34_0_34A,8908,34,true,1585436539,73,26,279.93,14484,277.59,282.04,False,0,43.7295636,-79.2797837
34_0_34A,8908,34,true,1585436540,73,26,279.93,14484,277.59,282.04,False,0,43.7295636,-79.2797837
34_0_34A,8908,34,true,1585436569,73,28,279.93,14484,277.59,282.04,False,0,43.7301462,-79.2769581
34_0_34A,8908,34,true,1585436570,73,28,279.93,14484,277.59,282.04,False,0,43.7301462,-79.2769581
34_0_34A,8908,34,true,1585436600,73,0,279.93,14484,277.59,282.04,False,0,43.7302736,-79.2763649
34_0_34A,8908,34,true,1585436599,73,0,279.93,14484,277.59,282.04,False,0,43.7302736,-79.2763649
34_0_34A,8908,34,true,1585436631,72,24,279.91,14484,277.59,282.04,False,0,43.73067,-79.2745925
34_0_34A,8908,34,true,1585436632,72,24,279.91,14484,277.59,282.04,False,0,43.73067,-79.2745925
34_0_34A,8908,34,true,1585436659,72,20,279.91,14484,277.59,282.04,False,0,43.7308658,-79.2736732
34_0_34A,8908,34,true,1585436660,72,20,279.91,14484,277.59,282.04,False,0,43.7308658,-79.2736732
34_0_34A,8908,34,true,1585436689,73,0,279.91,14484,277.59,282.04,False,0,43.7312353,-79.272077
34_0_34A,8908,34,true,1585436690,73,0,279.91,14484,277.59,282.04,False,0,43.7312353,-79.272077
34_0_34A,8908,34,true,1585436720,71,29,279.91,14484,277.59,282.04,False,0,43.7313677,-79.2711372
34_0_34A,8908,34,true,1585436719,71,29,279.91,14484,277.59,282.04,False,0,43.7313677,-79.2711372
34_0_34A,8908,34,true,1585436749,74,8,279.91,14484,277.59,282.04,False,0,43.7319053,-79.268845
34_0_34A,8908,34,true,1585436750,74,8,279.91,14484,277.59,282.04,False,0,43.7319053,-79.268845
34_0_34A,8908,34,true,1585436780,72,0,279.91,14484,277.59,282.04,False,0,43.7319082,-79.2688265
34_0_34A,8908,34,true,1585436779,72,0,279.91,14484,277.59,282.04,False,0,43.7319082,-79.2688265
34_0_34A,8908,34,true,1585436810,72,0,279.91,14484,277.59,282.04,False,0,43.7319082,-79.2688265
34_0_34A,8908,34,true,1585436809,72,0,279.91,14484,277.59,282.04,False,0,43.7319082,-79.2688265
34_0_34A,8908,34,true,1585436839,74,19,279.91,14484,277.59,282.04,False,0,43.732211,-79.267723
34_0_34A,8908,34,true,1585436840,74,19,279.91,14484,277.59,282.04,False,0,43.732211,-79.267723
34_0_34A,8908,34,true,1585436870,110,17,279.91,14484,277.59,282.04,False,0,43.7322958,-79.266349
34_0_34A,8908,34,true,1585436869,110,17,279.91,14484,277.59,282.04,False,0,43.7322958,-79.266349
34_0_34A,8908,34,true,1585436899,78,0,279.91,14484,277.59,282.04,False,0,43.7326554,-79.2650625
34_0_34A,8908,34,true,1585436900,78,0,279.91,14484,277.59,282.04,False,0,43.7326554,-79.2650625
34_0_34A,8908,34,true,1585436930,78,0,279.91,14484,277.59,282.04,False,0,43.7326554,-79.2650625
34_0_34A,8908,34,true,1585436929,78,0,279.91,14484,277.59,282.04,False,0,43.7326554,-79.2650625
34_0_34A,8908,34,true,1585436960,72,0,279.92,14484,277.59,282.04,False,0,43.7328153,-79.2643194
34_0_34A,8908,34,true,1585436959,72,0,279.92,14484,277.59,282.04,False,0,43.7328153,-79.2643194
34_0_34A,8908,34,true,1585436990,43,5,279.92,14484,277.59,282.04,False,0,43.7328396,-79.2642119
34_0_34A,8908,34,true,1585436989,43,5,279.92,14484,277.59,282.04,False,0,43.7328396,-79.2642119
34_0_34A,8908,34,true,1585437020,163,10,279.92,14484,277.59,282.04,False,0,43.7330467,-79.2633046
34_0_34A,8908,34,true,1585437050,175,0,279.92,14484,277.59,282.04,False,0,43.7328741,-79.2631659
34_0_34A,8908,34,true,1585437080,175,0,279.92,14484,277.59,282.04,False,0,43.7328741,-79.2631659
34_0_34A,8908,34,true,1585437109,175,0,279.92,14484,277.59,282.04,False,0,43.7328741,-79.2631659
34_0_34A,8908,34,true,1585437140,175,0,279.92,14484,277.59,282.04,False,0,43.7328741,-79.2631659
34_0_34A,8908,34,true,1585437170,175,0,279.92,14484,277.59,282.04,False,0,43.7328741,-79.2631659
34_0_34A,8908,34,true,1585437199,175,0,279.92,14484,277.59,282.04,False,0,43.7328741,-79.2631659
34_0_34A,8908,34,true,1585437200,175,0,279.92,14484,277.59,282.04,False,0,43.7328741,-79.2631659
34_0_34A,8908,34,true,1585437230,175,0,279.92,14484,277.59,282.04,False,0,43.7328741,-79.2631659
34_0_34A,8908,34,true,1585437260,175,0,279.92,14484,277.59,282.04,False,0,43.7328741,-79.2631659
34_0_34A,8908,34,true,1585437290,175,0,279.92,14484,277.59,282.04,False,0,43.7328741,-79.2631659
34_0_34A,8908,34,true,1585437320,175,0,279.92,14484,277.59,282.04,False,0,43.7328741,-79.2631659
34_0_34A,8908,34,true,1585437380,175,0,279.92,14484,277.59,282.04,False,0,43.7328741,-79.2631659
34_0_34A,8908,34,true,1585437409,175,0,279.92,14484,277.59,282.04,False,0,43.7328741,-79.2631659
34_0_34A,8908,34,true,1585437440,175,0,279.92,14484,277.59,282.04,False,0,43.7328741,-79.2631659
34_0_34A,8908,34,true,1585437469,175,0,279.92,14484,277.59,282.04,False,0,43.7328741,-79.2631659
34_0_34A,8908,34,true,1585437499,175,0,279.92,14484,277.59,282.04,False,0,43.7328741,-79.2631659
34_0_34A,8908,34,true,1585437500,175,0,279.92,14484,277.59,282.04,False,0,43.7328741,-79.2631659
34_0_34A,8908,34,true,1585437530,175,0,279.92,14484,277.59,282.04,False,0,43.7328741,-79.2631659
34_0_34A,8908,34,true,1585437560,175,0,279.68,14484,277.59,281.48,False,0,43.7328741,-79.2631659
34_0_34A,8908,34,true,1585437590,175,0,279.68,14484,277.59,281.48,False,0,43.7328741,-79.2631659
34_0_34A,8908,34,true,1585437620,175,0,279.68,14484,277.59,281.48,False,0,43.7328741,-79.2631659
34_0_34A,8908,34,true,1585440261,75,26,279.47,14484,277.59,281.15,False,0,43.7066802,-79.39859
34_0_34A,8908,34,true,1585440260,75,26,279.47,14484,277.59,281.15,False,0,43.7066802,-79.39859
34_0_34A,8908,34,true,1585440290,75,20,279.47,14484,277.59,281.15,False,0,43.7071456,-79.39608
34_0_34A,8908,34,true,1585440291,75,20,279.47,14484,277.59,281.15,False,0,43.7071456,-79.39608
34_0_34A,8908,34,true,1585440321,76,0,279.47,14484,277.59,281.15,False,0,43.7072067,-79.3956069
34_0_34A,8908,34,true,1585440320,76,0,279.47,14484,277.59,281.15,False,0,43.7072067,-79.3956069
34_0_34A,8908,34,true,1585440350,78,23,279.39,14484,277.59,281.15,False,0,43.7076712,-79.3935558
34_0_34A,8908,34,true,1585440351,78,23,279.39,14484,277.59,281.15,False,0,43.7076712,-79.3935558
34_0_34A,8908,34,true,1585440381,74,0,279.39,14484,277.59,281.15,False,0,43.707756,-79.3929367
34_0_34A,8908,34,true,1585440380,74,0,279.39,14484,277.59,281.15,False,0,43.707756,-79.3929367
34_0_34A,8908,34,true,1585440411,76,23,279.39,14484,277.59,281.15,False,0,43.7081674,-79.3913079
34_0_34A,8908,34,true,1585440410,76,23,279.39,14484,277.59,281.15,False,0,43.7081674,-79.3913079
34_0_34A,8908,34,true,1585440441,71,27,279.39,14484,277.59,281.15,False,0,43.7086372,-79.3889198
34_0_34A,8908,34,true,1585440440,71,27,279.39,14484,277.59,281.15,False,0,43.7086372,-79.3889198
34_0_34A,8908,34,true,1585440471,74,0,279.39,14484,277.59,281.15,False,0,43.7091064,-79.3863296
34_0_34A,8908,34,true,1585440470,74,0,279.39,14484,277.59,281.15,False,0,43.7091064,-79.3863296
34_0_34A,8908,34,true,1585440501,74,33,279.47,14484,277.59,281.15,False,0,43.7094457,-79.3849163
34_0_34A,8908,34,true,1585440530,74,22,279.47,14484,277.59,281.15,False,0,43.7099998,-79.3821418
34_0_34A,8908,34,true,1585440531,74,22,279.47,14484,277.59,281.15,False,0,43.7099998,-79.3821418
34_0_34A,8908,34,true,1585440561,74,0,279.4,14484,277.59,281.15,False,0,43.7104454,-79.3797225
34_0_34A,8908,34,true,1585440560,74,0,279.4,14484,277.59,281.15,False,0,43.7104454,-79.3797225
34_0_34A,8908,34,true,1585440591,75,0,279.4,14484,277.59,281.15,False,0,43.7108192,-79.3780975
34_0_34A,8908,34,true,1585440590,75,0,279.4,14484,277.59,281.15,False,0,43.7108192,-79.3780975
34_0_34A,8908,34,true,1585440621,75,0,279.4,14484,277.59,281.15,False,0,43.7108192,-79.3780975
34_0_34A,8908,34,true,1585440620,75,0,279.4,14484,277.59,281.15,False,0,43.7108192,-79.3780975
34_0_34A,8908,34,true,1585440651,75,19,279.4,14484,277.59,281.15,False,0,43.7111869,-79.3760676
34_0_34A,8908,34,true,1585440650,75,19,279.4,14484,277.59,281.15,False,0,43.7111869,-79.3760676
34_0_34A,8908,34,true,1585440681,73,30,279.4,14484,277.59,281.15,False,0,43.7113716,-79.3753273
34_0_34A,8908,34,true,1585440680,73,30,279.4,14484,277.59,281.15,False,0,43.7113716,-79.3753273
34_0_34A,8908,34,true,1585440711,74,37,279.38,14484,277.59,281.15,False,0,43.7121226,-79.3714225
34_0_34A,8908,34,true,1585440710,74,37,279.38,14484,277.59,281.15,False,0,43.7121226,-79.3714225
34_0_34A,8908,34,true,1585440740,73,40,279.38,14484,277.59,281.15,False,0,43.7130555,-79.3671016
34_0_34A,8908,34,true,1585440741,73,40,279.38,14484,277.59,281.15,False,0,43.7130555,-79.3671016
34_0_34A,8908,34,true,1585440770,74,0,279.38,14484,277.59,281.15,False,0,43.7133161,-79.3657044
34_0_34A,8908,34,true,1585440771,74,0,279.38,14484,277.59,281.15,False,0,43.7133161,-79.3657044
34_0_34A,8908,34,true,1585440801,74,34,279.4,14484,277.59,281.15,False,0,43.7137882,-79.3633272
34_0_34A,8908,34,true,1585440800,74,34,279.4,14484,277.59,281.15,False,0,43.7137882,-79.3633272
34_0_34A,8908,34,true,1585440830,74,13,279.4,14484,277.59,281.15,False,0,43.7145436,-79.3597593
34_0_34A,8908,34,true,1585440831,74,13,279.4,14484,277.59,281.15,False,0,43.7145436,-79.3597593
34_0_34A,8908,34,true,1585440861,67,0,279.4,14484,277.59,281.15,False,0,43.714568,-79.3597188
34_0_34A,8908,34,true,1585440860,67,0,279.4,14484,277.59,281.15,False,0,43.714568,-79.3597188
34_0_34A,8908,34,true,1585440890,67,0,279.4,14484,277.59,281.15,False,0,43.714568,-79.3597188
34_0_34A,8908,34,true,1585440891,67,0,279.4,14484,277.59,281.15,False,0,43.714568,-79.3597188
34_0_34A,8908,34,true,1585440921,76,32,279.37,14484,277.59,281.15,False,0,43.7152684,-79.3567703
34_0_34A,8908,34,true,1585440920,76,32,279.37,14484,277.59,281.15,False,0,43.7152684,-79.3567703
34_0_34A,8908,34,true,1585440951,63,38,279.39,14484,277.59,281.15,False,0,43.7161664,-79.3528095
34_0_34A,8908,34,true,1585440950,63,38,279.39,14484,277.59,281.15,False,0,43.7161664,-79.3528095
34_0_34A,8908,34,true,1585440981,65,7,279.39,14484,277.59,281.15,False,0,43.7169216,-79.3497499
34_0_34A,8908,34,true,1585440980,65,7,279.39,14484,277.59,281.15,False,0,43.7169216,-79.3497499
34_0_34A,8908,34,true,1585441010,59,0,279.39,14484,277.59,281.15,False,0,43.7169216,-79.3497499
34_0_34A,8908,34,true,1585441011,59,0,279.39,14484,277.59,281.15,False,0,43.7169216,-79.3497499
34_0_34A,8908,34,true,1585441041,67,40,279.39,14484,277.59,281.15,False,0,43.7179617,-79.3469522
34_0_34A,8908,34,true,1585441040,67,40,279.39,14484,277.59,281.15,False,0,43.7179617,-79.3469522
34_0_34A,8908,34,true,1585441071,64,31,279.41,14484,277.59,281.15,False,0,43.7187593,-79.3443971
34_0_34A,8908,34,true,1585441100,67,16,279.41,14484,277.59,281.15,False,0,43.7204528,-79.338985
34_0_34A,8908,34,true,1585441101,67,16,279.41,14484,277.59,281.15,False,0,43.7204528,-79.338985
34_0_34A,8908,34,true,1585441131,65,0,279.41,14484,277.59,281.15,False,0,43.7207492,-79.3373865
34_0_34A,8908,34,true,1585441130,65,0,279.41,14484,277.59,281.15,False,0,43.7207492,-79.3373865
34_0_34A,8908,34,true,1585441161,64,37,279.41,14484,277.59,281.15,False,0,43.7214733,-79.3356767
34_0_34A,8908,34,true,1585441191,65,36,279.38,14484,277.59,281.15,False,0,43.7228771,-79.3310304
34_0_34A,8908,34,true,1585441190,65,36,279.38,14484,277.59,281.15,False,0,43.7228771,-79.3310304
34_0_34A,8908,34,true,1585441220,70,34,279.38,14484,277.59,281.15,False,0,43.7237837,-79.3276191
34_0_34A,8908,34,true,1585441221,70,34,279.38,14484,277.59,281.15,False,0,43.7237837,-79.3276191
34_0_34A,8908,34,true,1585441251,69,38,279.33,14484,277.59,281.15,False,0,43.7248534,-79.323539
34_0_34A,8908,34,true,1585441280,71,37,279.42,14484,277.59,281.15,False,0,43.7259897,-79.3190535
34_0_34A,8908,34,true,1585441281,71,37,279.42,14484,277.59,281.15,False,0,43.7259897,-79.3190535
34_0_34A,8908,34,true,1585441311,88,32,279.42,14484,277.59,281.15,False,0,43.7262608,-79.3158657
34_0_34A,8908,34,true,1585441340,102,25,279.42,14484,277.59,281.15,False,0,43.7259282,-79.3136416
34_0_34A,8908,34,true,1585441341,102,25,279.42,14484,277.59,281.15,False,0,43.7259282,-79.3136416
34_0_34A,8908,34,true,1585441370,101,34,279.42,14484,277.59,281.15,False,0,43.7255027,-79.3100641
34_0_34A,8908,34,true,1585441371,101,34,279.42,14484,277.59,281.15,False,0,43.7255027,-79.3100641
34_0_34A,8908,34,true,1585441401,101,35,279.38,14484,277.59,281.15,False,0,43.7248075,-79.3054507
34_0_34A,8908,34,true,1585441400,101,35,279.38,14484,277.59,281.15,False,0,43.7248075,-79.3054507
34_0_34A,8908,34,true,1585441431,88,27,279.1,14484,277.59,280.37,False,0,43.7246803,-79.3026112
34_0_34A,8908,34,true,1585441461,136,0,279.1,14484,277.59,280.37,False,0,43.7245712,-79.3020935
34_0_34A,8908,34,true,1585441491,76,0,279.1,14484,277.59,280.37,False,0,43.7248231,-79.3012991
34_0_34A,8908,34,true,1585441521,81,12,279.1,14484,277.59,280.37,False,0,43.724925,-79.3007217
34_0_34A,8908,34,true,1585441520,81,12,279.1,14484,277.59,280.37,False,0,43.724925,-79.3007217
34_0_34A,8908,34,true,1585441551,76,0,279.35,14484,277.59,281.15,False,0,43.7250043,-79.3003073
34_0_34A,8908,34,true,1585441550,76,0,279.35,14484,277.59,281.15,False,0,43.7250043,-79.3003073
34_0_34A,8908,34,true,1585441581,76,0,279.35,14484,277.59,281.15,False,0,43.7250043,-79.3003073
34_0_34A,8908,34,true,1585441611,77,29,279.35,14484,277.59,281.15,False,0,43.725088,-79.299905
34_0_34A,8908,34,true,1585441641,76,0,279.35,14484,277.59,281.15,False,0,43.7256619,-79.2974179
34_0_34A,8908,34,true,1585441640,76,0,279.35,14484,277.59,281.15,False,0,43.7256619,-79.2974179
34_0_34A,8908,34,true,1585441671,76,0,279.35,14484,277.59,281.15,False,0,43.7256619,-79.2974179
34_0_34A,8908,34,true,1585441701,73,30,279.35,14484,277.59,281.15,False,0,43.7256842,-79.2966889
34_0_34A,8908,34,true,1585441731,75,41,279.39,14484,277.59,281.15,False,0,43.726628,-79.2925553
34_0_34A,8908,34,true,1585441764,73,0,279.05,14484,277.59,280.37,False,0,43.7269401,-79.2909545
34_0_34A,8908,34,true,1585441763,73,0,279.05,14484,277.59,280.37,False,0,43.7269401,-79.2909545
34_0_34A,8908,34,true,1585441791,73,0,279.05,14484,277.59,280.37,False,0,43.7272944,-79.290019
34_0_34A,8908,34,true,1585441821,73,20,279.05,14484,277.59,280.37,False,0,43.7274167,-79.2893401
34_0_34A,8908,34,true,1585441851,73,10,279.05,14484,277.59,280.37,False,0,43.7278882,-79.2873833
34_0_34A,8908,34,true,1585441881,72,32,279.05,14484,277.59,280.37,False,0,43.7282225,-79.2854292
34_0_34A,8908,34,true,1585441911,76,33,279.05,14484,277.59,280.37,False,0,43.7292122,-79.2814027
34_0_34A,8908,34,true,1585441941,73,29,279.05,14484,277.59,280.37,False,0,43.7298635,-79.2779864
34_0_34A,8908,34,true,1585441971,72,25,279.05,14484,277.59,280.37,False,0,43.7303851,-79.2758615
34_0_34A,8908,34,true,1585441972,72,25,279.05,14484,277.59,280.37,False,0,43.7303851,-79.2758615
34_0_34A,8908,34,true,1585442002,73,20,279.11,14484,277.59,280.37,False,0,43.7307665,-79.273813
34_0_34A,8908,34,true,1585442001,73,20,279.11,14484,277.59,280.37,False,0,43.7307665,-79.273813
34_0_34A,8908,34,true,1585442031,71,22,279,14484,277.59,279.82,False,0,43.7313575,-79.2711524
34_0_34A,8908,34,true,1585442061,72,0,279,14484,277.59,279.82,False,0,43.7315559,-79.2706425
34_0_34A,8908,34,true,1585442062,72,0,279,14484,277.59,279.82,False,0,43.7315559,-79.2706425
34_0_34A,8908,34,true,1585442091,72,0,279,14484,277.59,279.82,False,0,43.7315559,-79.2706425
34_0_34A,8908,34,true,1585442121,69,30,279,14484,277.59,279.82,False,0,43.7317066,-79.2700035
34_0_34A,8908,34,true,1585442122,69,30,279,14484,277.59,279.82,False,0,43.7317066,-79.2700035
34_0_34A,8908,34,true,1585442152,70,0,279,14484,277.59,279.82,False,0,43.732241,-79.2675323
34_0_34A,8908,34,true,1585442151,70,0,279,14484,277.59,279.82,False,0,43.732241,-79.2675323
34_0_34A,8908,34,true,1585442181,70,0,279,14484,277.59,279.82,False,0,43.732241,-79.2675323
34_0_34A,8908,34,true,1585442212,70,0,279,14484,277.59,279.82,False,0,43.732241,-79.2675323
34_0_34A,8908,34,true,1585442211,70,0,279,14484,277.59,279.82,False,0,43.732241,-79.2675323
34_0_34A,8908,34,true,1585442241,71,21,279,14484,277.59,279.82,False,0,43.7324307,-79.266894
34_0_34A,8908,34,true,1585442242,71,21,279,14484,277.59,279.82,False,0,43.7324307,-79.266894
34_0_34A,8908,34,true,1585442275,97,18,279,14484,277.59,279.82,False,0,43.732686,-79.2649097
34_0_34A,8908,34,true,1585442274,97,18,279,14484,277.59,279.82,False,0,43.732686,-79.2649097
34_0_34A,8908,34,true,1585442301,60,12,279,14484,277.59,279.82,False,0,43.7329879,-79.263554
34_0_34A,8908,34,true,1585442331,175,0,279,14484,277.59,279.82,False,0,43.732984,-79.2631787
34_0_34A,8908,34,true,1585442332,175,0,279,14484,277.59,279.82,False,0,43.732984,-79.2631787
34_0_34A,8908,34,true,1585442631,234,0,279.12,14484,278.15,280.37,False,0,43.73277,-79.263585
34_0_34A,8908,34,true,1585445663,1,14,278.91,14484,277.59,280.37,False,0,43.7058563,-79.4000854
34_0_34A,8908,34,true,1585445662,1,14,278.91,14484,277.59,280.37,False,0,43.7058563,-79.4000854
34_0_34A,8908,34,true,1585445693,75,20,278.91,14484,277.59,280.37,False,0,43.7065849,-79.3990707
34_0_34A,8908,34,true,1585445723,73,21,278.91,14484,277.59,280.37,False,0,43.7070236,-79.3969497
34_0_34A,8908,34,true,1585445753,71,22,278.91,14484,277.59,280.37,False,0,43.7075614,-79.3942794
34_0_34A,8908,34,true,1585445783,70,4,278.91,14484,277.59,280.37,False,0,43.707695,-79.3933868
34_0_34A,8908,34,true,1585445813,76,20,278.91,14484,277.59,280.37,False,0,43.708229,-79.3910064
34_0_34A,8908,34,true,1585445843,75,23,278.91,14484,277.59,280.37,False,0,43.7087974,-79.3881454
34_0_34A,8908,34,true,1585445874,72,28,278.91,14484,277.59,280.37,False,0,43.7092819,-79.3857116
34_0_34A,8908,34,true,1585445903,73,32,278.92,14484,277.59,280.37,False,0,43.7098693,-79.3827056
34_0_34A,8908,34,true,1585445933,77,21,278.92,14484,277.59,280.37,False,0,43.7106094,-79.3791503
34_0_34A,8908,34,true,1585445963,73,13,278.92,14484,277.59,280.37,False,0,43.7108726,-79.377861
34_0_34A,8908,34,true,1585445993,74,10,278.92,14484,277.59,280.37,False,0,43.7112274,-79.3759002
34_0_34A,8908,34,true,1585446023,73,22,278.92,14484,277.59,280.37,False,0,43.7113456,-79.3754348
34_0_34A,8908,34,true,1585446053,74,35,278.92,14484,277.59,280.37,False,0,43.7120742,-79.3721237
34_0_34A,8908,34,true,1585446083,73,11,278.92,14484,277.59,280.37,False,0,43.7124557,-79.3697586
34_0_34A,8908,34,true,1585446113,73,34,278.92,14484,277.59,280.37,False,0,43.71315,-79.3667297
34_0_34A,8908,34,true,1585446143,75,0,278.92,14484,277.59,280.37,False,0,43.7135162,-79.3649139
34_0_34A,8908,34,true,1585446173,75,0,278.92,14484,277.59,280.37,False,0,43.7135162,-79.3649139
34_0_34A,8908,34,true,1585446174,75,0,278.92,14484,277.59,280.37,False,0,43.7135162,-79.3649139
34_0_34A,8908,34,true,1585446203,74,31,278.92,14484,277.59,280.37,False,0,43.713787,-79.3633346
34_0_34A,8908,34,true,1585446233,76,27,278.92,14484,277.59,280.37,False,0,43.7143745,-79.3603973
34_0_34A,8908,34,true,1585446263,74,0,278.92,14484,277.59,280.37,False,0,43.7144584,-79.3599014
34_0_34A,8908,34,true,1585446293,65,27,278.92,14484,277.59,280.37,False,0,43.7147064,-79.3593368
34_0_34A,8908,34,true,1585446323,85,32,278.92,14484,277.59,280.37,False,0,43.7153854,-79.3561172
34_0_34A,8908,34,true,1585446324,85,32,278.92,14484,277.59,280.37,False,0,43.7153854,-79.3561172
34_0_34A,8908,34,true,1585446353,68,40,278.85,14484,277.59,279.82,False,0,43.7162933,-79.3523864
34_0_34A,8908,34,true,1585446383,138,0,278.85,14484,277.59,279.82,False,0,43.716957,-79.3499908
34_0_34A,8908,34,true,1585446413,138,0,278.85,14484,277.59,279.82,False,0,43.716957,-79.3499908
34_0_34A,8908,34,true,1585446443,67,40,278.85,14484,277.59,279.82,False,0,43.7177925,-79.3475036
34_0_34A,8908,34,true,1585446444,67,40,278.85,14484,277.59,279.82,False,0,43.7177925,-79.3475036
34_0_34A,8908,34,true,1585446473,66,38,278.86,14484,277.59,279.82,False,0,43.7189941,-79.3436584
34_0_34A,8908,34,true,1585446503,67,20,278.86,14484,277.59,279.82,False,0,43.7202415,-79.339714
34_0_34A,8908,34,true,1585446504,67,20,278.86,14484,277.59,279.82,False,0,43.7202415,-79.339714
34_0_34A,8908,34,true,1585446533,78,0,278.86,14484,277.59,279.82,False,0,43.7204322,-79.3390502
34_0_34A,8908,34,true,1585446564,78,0,278.86,14484,277.59,279.82,False,0,43.7204322,-79.3390502
34_0_34A,8908,34,true,1585446563,78,0,278.86,14484,277.59,279.82,False,0,43.7204322,-79.3390502
34_0_34A,8908,34,true,1585446594,63,32,278.86,14484,277.59,279.82,False,0,43.7213134,-79.3361968
34_0_34A,8908,34,true,1585446593,63,32,278.86,14484,277.59,279.82,False,0,43.7213134,-79.3361968
34_0_34A,8908,34,true,1585446623,68,21,278.86,14484,277.59,279.82,False,0,43.7221984,-79.3331985
34_0_34A,8908,34,true,1585446653,69,0,278.86,14484,277.59,279.82,False,0,43.7224769,-79.3321838
34_0_34A,8908,34,true,1585446654,69,0,278.86,14484,277.59,279.82,False,0,43.7224769,-79.3321838
34_0_34A,8908,34,true,1585446683,67,35,278.86,14484,277.59,279.82,False,0,43.7229995,-79.330635
34_0_34A,8908,34,true,1585446684,67,35,278.86,14484,277.59,279.82,False,0,43.7229995,-79.330635
34_0_34A,8908,34,true,1585446714,70,39,278.86,14484,277.59,279.82,False,0,43.7239151,-79.3271179
34_0_34A,8908,34,true,1585446713,70,39,278.86,14484,277.59,279.82,False,0,43.7239151,-79.3271179
34_0_34A,8908,34,true,1585446743,69,44,278.91,14484,278.15,279.82,False,0,43.7250175,-79.3229522
34_0_34A,8908,34,true,1585446744,69,44,278.91,14484,278.15,279.82,False,0,43.7250175,-79.3229522
34_0_34A,8908,34,true,1585446773,88,0,278.91,14484,278.15,279.82,False,0,43.7259521,-79.3185653
34_0_34A,8908,34,true,1585446803,86,36,278.91,14484,278.15,279.82,False,0,43.7262479,-79.316945
34_0_34A,8908,34,true,1585446804,86,36,278.91,14484,278.15,279.82,False,0,43.7262479,-79.316945
34_0_34A,8908,34,true,1585446833,112,13,278.92,14484,278.15,279.82,False,0,43.7261327,-79.3142811
34_0_34A,8908,34,true,1585446834,112,13,278.92,14484,278.15,279.82,False,0,43.7261327,-79.3142811
34_0_34A,8908,34,true,1585446864,96,0,278.92,14484,278.15,279.82,False,0,43.7261027,-79.3141775
34_0_34A,8908,34,true,1585446863,96,0,278.92,14484,278.15,279.82,False,0,43.7261027,-79.3141775
34_0_34A,8908,34,true,1585446894,99,27,278.92,14484,278.15,279.82,False,0,43.7259266,-79.3136527
34_0_34A,8908,34,true,1585446893,99,27,278.92,14484,278.15,279.82,False,0,43.7259266,-79.3136527
34_0_34A,8908,34,true,1585446923,102,38,278.92,14484,278.15,279.82,False,0,43.7253882,-79.3093007
34_0_34A,8908,34,true,1585446953,95,0,278.87,14484,277.59,279.82,False,0,43.7249285,-79.3069031
34_0_34A,8908,34,true,1585446954,95,0,278.87,14484,277.59,279.82,False,0,43.7249285,-79.3069031
34_0_34A,8908,34,true,1585446983,97,25,278.87,14484,277.59,279.82,False,0,43.7247375,-79.3046486
34_0_34A,8908,34,true,1585446984,97,25,278.87,14484,277.59,279.82,False,0,43.7247375,-79.3046486
34_0_34A,8908,34,true,1585447014,82,25,278.87,14484,277.59,279.82,False,0,43.7246818,-79.3026224
34_0_34A,8908,34,true,1585447013,82,25,278.87,14484,277.59,279.82,False,0,43.7246818,-79.3026224
34_0_34A,8908,34,true,1585447044,136,0,278.87,14484,277.59,279.82,False,0,43.7245712,-79.3020935
34_0_34A,8908,34,true,1585447043,136,0,278.87,14484,277.59,279.82,False,0,43.7245712,-79.3020935
34_0_34A,8908,34,true,1585447494,73,0,278.92,14484,278.15,279.82,False,0,43.7269401,-79.2909545
34_0_34A,8908,34,true,1585447493,73,0,278.92,14484,278.15,279.82,False,0,43.7269401,-79.2909545
34_0_34A,8908,34,true,1585447525,72,30,278.92,14484,278.15,279.82,False,0,43.7271741,-79.2903377
34_0_34A,8908,34,true,1585447526,72,30,278.92,14484,278.15,279.82,False,0,43.7271741,-79.2903377
34_0_34A,8908,34,true,1585447553,72,39,278.92,14484,278.15,279.82,False,0,43.7280904,-79.2864903
34_0_34A,8908,34,true,1585447554,72,39,278.92,14484,278.15,279.82,False,0,43.7280904,-79.2864903
34_0_34A,8908,34,true,1585447584,74,37,278.93,14484,278.15,279.82,False,0,43.7288272,-79.2826965
34_0_34A,8908,34,true,1585447583,74,37,278.93,14484,278.15,279.82,False,0,43.7288272,-79.2826965
34_0_34A,8908,34,true,1585447613,73,23,278.93,14484,278.15,279.82,False,0,43.729566,-79.279773
34_0_34A,8908,34,true,1585447614,73,23,278.93,14484,278.15,279.82,False,0,43.729566,-79.279773
34_0_34A,8908,34,true,1585447644,74,0,278.93,14484,278.15,279.82,False,0,43.7297187,-79.2787551
34_0_34A,8908,34,true,1585447643,74,0,278.93,14484,278.15,279.82,False,0,43.7297187,-79.2787551
34_0_34A,8908,34,true,1585447673,72,16,278.93,14484,278.15,279.82,False,0,43.7300387,-79.2774554
34_0_34A,8908,34,true,1585447674,72,16,278.93,14484,278.15,279.82,False,0,43.7300387,-79.2774554
34_0_34A,8908,34,true,1585447704,72,35,278.88,14484,277.59,279.82,False,0,43.7306716,-79.2745853
34_0_34A,8908,34,true,1585447703,72,35,278.88,14484,277.59,279.82,False,0,43.7306716,-79.2745853
34_0_34A,8908,34,true,1585447733,73,0,278.88,14484,277.59,279.82,False,0,43.7312618,-79.2717399
34_0_34A,8908,34,true,1585447734,73,0,278.88,14484,277.59,279.82,False,0,43.7312618,-79.2717399
34_0_34A,8908,34,true,1585447763,73,0,278.88,14484,277.59,279.82,False,0,43.7312618,-79.2717399
34_0_34A,8908,34,true,1585447764,73,0,278.88,14484,277.59,279.82,False,0,43.7312618,-79.2717399
34_0_34A,8908,34,true,1585447794,69,29,278.88,14484,277.59,279.82,False,0,43.7314156,-79.271064
34_0_34A,8908,34,true,1585447793,69,29,278.88,14484,277.59,279.82,False,0,43.7314156,-79.271064
34_0_34A,8908,34,true,1585447823,72,0,278.88,14484,277.59,279.82,False,0,43.7319673,-79.2684638
34_0_34A,8908,34,true,1585447824,72,0,278.88,14484,277.59,279.82,False,0,43.7319673,-79.2684638
34_0_34A,8908,34,true,1585447854,72,0,278.88,14484,277.59,279.82,False,0,43.7319673,-79.2684638
34_0_34A,8908,34,true,1585447884,72,0,278.88,14484,277.59,279.82,False,0,43.7319673,-79.2684638
34_0_34A,8908,34,true,1585447914,73,28,278.88,14484,277.59,279.82,False,0,43.7322158,-79.2677052
34_0_34A,8908,34,true,1585447944,59,20,278.88,14484,277.59,279.82,False,0,43.732653,-79.2650749
34_0_34A,8908,34,true,1585447943,59,20,278.88,14484,277.59,279.82,False,0,43.732653,-79.2650749
34_0_34A,8908,34,true,1585447974,72,0,278.84,14484,277.59,279.82,False,0,43.7328283,-79.2642621
34_0_34A,8908,34,true,1585447973,72,0,278.84,14484,277.59,279.82,False,0,43.7328283,-79.2642621
34_0_34A,8908,34,true,1585448004,72,0,278.84,14484,277.59,279.82,False,0,43.7329343,-79.2637926
34_0_34A,8908,34,true,1585448003,72,0,278.84,14484,277.59,279.82,False,0,43.7329343,-79.2637926
34_0_34A,8908,34,true,1585448033,72,0,278.84,14484,277.59,279.82,False,0,43.7329343,-79.2637926
34_0_34A,8908,34,true,1585448034,72,0,278.84,14484,277.59,279.82,False,0,43.7329343,-79.2637926
34_0_34A,8908,34,true,1585448064,72,0,278.84,14484,277.59,279.82,False,0,43.7329343,-79.2637926
34_0_34A,8908,34,true,1585448060,72,0,278.84,14484,277.59,279.82,False,0,43.7329343,-79.2637926
34_0_34A,8908,34,true,1585448061,72,0,278.84,14484,277.59,279.82,False,0,43.7329343,-79.2637926
34_0_34A,8908,34,true,1585448090,72,0,278.84,14484,277.59,279.82,False,0,43.7329343,-79.2637926
34_0_34A,8908,34,true,1585448091,72,0,278.84,14484,277.59,279.82,False,0,43.7329343,-79.2637926
34_0_34A,8908,34,true,1585448121,72,0,278.84,14484,277.59,279.82,False,0,43.7329343,-79.2637926
34_0_34A,8908,34,true,1585448151,72,0,278.84,14484,277.59,279.82,False,0,43.7329343,-79.2637926
34_0_34A,8908,34,true,1585448150,72,0,278.84,14484,277.59,279.82,False,0,43.7329343,-79.2637926
34_0_34A,8908,34,true,1585448180,72,0,278.84,14484,277.59,279.82,False,0,43.7329343,-79.2637926
34_0_34A,8908,34,true,1585448181,72,0,278.84,14484,277.59,279.82,False,0,43.7329343,-79.2637926
34_0_34A,8908,34,true,1585448211,72,0,278.84,14484,277.59,279.82,False,0,43.7329343,-79.2637926
34_0_34A,8908,34,true,1585448241,72,1,278.84,14484,277.59,279.82,False,0,43.7329383,-79.2637747
34_0_34A,8908,34,true,1585448240,72,1,278.84,14484,277.59,279.82,False,0,43.7329383,-79.2637747
34_0_34A,8908,34,true,1585450644,72,16,278.8,12874,277.59,280.37,False,0,43.7064895,-79.3995513
34_0_34A,8908,34,true,1585450643,72,16,278.8,12874,277.59,280.37,False,0,43.7064895,-79.3995513
34_0_34A,8908,34,true,1585450671,76,0,278.8,12874,277.59,280.37,False,0,43.7066802,-79.39859
34_0_34A,8908,34,true,1585450672,76,0,278.8,12874,277.59,280.37,False,0,43.7066802,-79.39859
34_0_34A,8908,34,true,1585450701,75,33,278.8,12874,277.59,280.37,False,0,43.706829,-79.3978729
34_0_34A,8908,34,true,1585450702,75,33,278.8,12874,277.59,280.37,False,0,43.706829,-79.3978729
34_0_34A,8908,34,true,1585450732,76,0,278.8,12874,277.59,280.37,False,0,43.7072067,-79.3956069
34_0_34A,8908,34,true,1585450731,76,0,278.8,12874,277.59,280.37,False,0,43.7072067,-79.3956069
34_0_34A,8908,34,true,1585450762,76,26,278.74,12874,277.04,280.37,False,0,43.7076733,-79.3935408
34_0_34A,8908,34,true,1585450761,76,26,278.74,12874,277.04,280.37,False,0,43.7076733,-79.3935408
34_0_34A,8908,34,true,1585450792,74,0,278.74,12874,277.04,280.37,False,0,43.707756,-79.3929367
34_0_34A,8908,34,true,1585450791,74,0,278.74,12874,277.04,280.37,False,0,43.707756,-79.3929367
34_0_34A,8908,34,true,1585450821,73,21,278.74,12874,277.04,280.37,False,0,43.7077999,-79.392826
34_0_34A,8908,34,true,1585450822,73,21,278.74,12874,277.04,280.37,False,0,43.7077999,-79.392826
34_0_34A,8908,34,true,1585450851,73,32,278.74,12874,277.04,280.37,False,0,43.7084433,-79.3899619
34_0_34A,8908,34,true,1585450852,73,32,278.74,12874,277.04,280.37,False,0,43.7084433,-79.3899619
34_0_34A,8908,34,true,1585450881,73,39,278.73,12874,277.04,280.37,False,0,43.7091759,-79.386128
34_0_34A,8908,34,true,1585450882,73,39,278.73,12874,277.04,280.37,False,0,43.7091759,-79.386128
34_0_34A,8908,34,true,1585450912,74,0,278.81,12874,277.59,280.37,False,0,43.7099151,-79.3823394
34_0_34A,8908,34,true,1585450911,74,0,278.81,12874,277.59,280.37,False,0,43.7099151,-79.3823394
34_0_34A,8908,34,true,1585450942,73,39,278.81,12874,277.59,280.37,False,0,43.7104788,-79.3796046
34_0_34A,8908,34,true,1585450972,75,0,278.81,12874,277.59,280.37,False,0,43.7108884,-79.3777857
34_0_34A,8908,34,true,1585450971,75,0,278.81,12874,277.59,280.37,False,0,43.7108884,-79.3777857
34_0_34A,8908,34,true,1585451002,75,0,278.81,12874,277.59,280.37,False,0,43.7108884,-79.3777857
34_0_34A,8908,34,true,1585451001,75,0,278.81,12874,277.59,280.37,False,0,43.7108884,-79.3777857
34_0_34A,8908,34,true,1585451032,74,32,278.81,12874,277.59,280.37,False,0,43.7110436,-79.3769774
34_0_34A,8908,34,true,1585451031,74,32,278.81,12874,277.59,280.37,False,0,43.7110436,-79.3769774
34_0_34A,8908,34,true,1585451061,74,49,278.74,12874,277.04,280.37,False,0,43.7120821,-79.3720883
34_0_34A,8908,34,true,1585451062,74,49,278.74,12874,277.04,280.37,False,0,43.7120821,-79.3720883
34_0_34A,8908,34,true,1585451091,73,26,278.74,12874,277.04,280.37,False,0,43.7128594,-79.3679319
34_0_34A,8908,34,true,1585451092,73,26,278.74,12874,277.04,280.37,False,0,43.7128594,-79.3679319
34_0_34A,8908,34,true,1585451122,74,23,278.74,12874,277.04,280.37,False,0,43.7130455,-79.3671257
34_0_34A,8908,34,true,1585451152,74,44,278.74,12874,277.04,280.37,False,0,43.7139814,-79.3623505
34_0_34A,8908,34,true,1585451151,74,44,278.74,12874,277.04,280.37,False,0,43.7139814,-79.3623505
34_0_34A,8908,34,true,1585451182,67,0,278.74,12874,277.04,280.37,False,0,43.7145436,-79.3597593
34_0_34A,8908,34,true,1585451181,67,0,278.74,12874,277.04,280.37,False,0,43.7145436,-79.3597593
34_0_34A,8908,34,true,1585451212,80,40,278.76,12874,277.04,280.37,False,0,43.7153053,-79.3565648
34_0_34A,8908,34,true,1585451211,80,40,278.76,12874,277.04,280.37,False,0,43.7153053,-79.3565648
34_0_34A,8908,34,true,1585451241,69,33,278.82,12874,277.59,280.37,False,0,43.7164491,-79.3518477
34_0_34A,8908,34,true,1585451242,69,33,278.82,12874,277.59,280.37,False,0,43.7164491,-79.3518477
34_0_34A,8908,34,true,1585451272,66,0,278.82,12874,277.59,280.37,False,0,43.7168908,-79.3505156
34_0_34A,8908,34,true,1585451271,66,0,278.82,12874,277.59,280.37,False,0,43.7168908,-79.3505156
34_0_34A,8908,34,true,1585451302,63,38,278.82,12874,277.59,280.37,False,0,43.7173972,-79.3488568
34_0_34A,8908,34,true,1585451331,63,42,278.79,12874,277.04,280.37,False,0,43.7187767,-79.344345
34_0_34A,8908,34,true,1585451332,63,42,278.79,12874,277.04,280.37,False,0,43.7187767,-79.344345
34_0_34A,8908,34,true,1585451362,67,39,278.79,12874,277.04,280.37,False,0,43.7202565,-79.339667
34_0_34A,8908,34,true,1585451361,67,39,278.79,12874,277.04,280.37,False,0,43.7202565,-79.339667
34_0_34A,8908,34,true,1585451392,65,10,278.79,12874,277.04,280.37,False,0,43.7205467,-79.3377304
34_0_34A,8908,34,true,1585451391,65,10,278.79,12874,277.04,280.37,False,0,43.7205467,-79.3377304
34_0_34A,8908,34,true,1585451422,66,47,278.83,12874,277.59,280.37,False,0,43.7219335,-79.3341577
34_0_34A,8908,34,true,1585451421,66,47,278.83,12874,277.59,280.37,False,0,43.7219335,-79.3341577
34_0_34A,8908,34,true,1585451452,71,36,278.83,12874,277.59,280.37,False,0,43.7232329,-79.3295426
34_0_34A,8908,34,true,1585451451,71,36,278.83,12874,277.59,280.37,False,0,43.7232329,-79.3295426
34_0_34A,8908,34,true,1585451481,69,28,278.83,12874,277.59,280.37,False,0,43.7235849,-79.3283712
34_0_34A,8908,34,true,1585451482,69,28,278.83,12874,277.59,280.37,False,0,43.7235849,-79.3283712
34_0_34A,8908,34,true,1585451512,69,18,278.85,12874,277.59,280.37,False,0,43.7246459,-79.3243241
34_0_34A,8908,34,true,1585451511,69,18,278.85,12874,277.59,280.37,False,0,43.7246459,-79.3243241
34_0_34A,8908,34,true,1585451542,70,46,278.83,12874,277.59,280.37,False,0,43.7258554,-79.3196833
34_0_34A,8908,34,true,1585451541,70,46,278.83,12874,277.59,280.37,False,0,43.7258554,-79.3196833
34_0_34A,8908,34,true,1585451571,78,20,278.83,12874,277.59,280.37,False,0,43.7260347,-79.3182793
34_0_34A,8908,34,true,1585451572,78,20,278.83,12874,277.59,280.37,False,0,43.7260347,-79.3182793
34_0_34A,8908,34,true,1585451602,102,25,278.88,12874,277.59,280.37,False,0,43.7261333,-79.3142852
34_0_34A,8908,34,true,1585451632,140,0,278.88,12874,277.59,280.37,False,0,43.7259063,-79.3137969
34_0_34A,8908,34,true,1585451631,140,0,278.88,12874,277.59,280.37,False,0,43.7259063,-79.3137969
34_0_34A,8908,34,true,1585451661,140,0,278.88,12874,277.59,280.37,False,0,43.7259063,-79.3137969
34_0_34A,8908,34,true,1585451662,140,0,278.88,12874,277.59,280.37,False,0,43.7259063,-79.3137969
34_0_34A,8908,34,true,1585451692,96,23,278.88,12874,277.59,280.37,False,0,43.7259245,-79.3136675
34_0_34A,8908,34,true,1585451691,96,23,278.88,12874,277.59,280.37,False,0,43.7259245,-79.3136675
34_0_34A,8908,34,true,1585451722,102,47,278.88,12874,277.59,280.37,False,0,43.7255576,-79.3104745
34_0_34A,8908,34,true,1585451721,102,47,278.88,12874,277.59,280.37,False,0,43.7255576,-79.3104745
34_0_34A,8908,34,true,1585451754,102,44,278.82,12874,277.59,280.37,False,0,43.7247691,-79.3050425
34_0_34A,8908,34,true,1585451753,102,44,278.82,12874,277.59,280.37,False,0,43.7247691,-79.3050425
34_0_34A,8908,34,true,1585451782,90,0,278.82,12874,277.59,280.37,False,0,43.7246925,-79.3028045
34_0_34A,8908,34,true,1585451781,90,0,278.82,12874,277.59,280.37,False,0,43.7246925,-79.3028045
34_0_34A,8908,34,true,1585451812,82,22,278.82,12874,277.59,280.37,False,0,43.7246444,-79.3019575
34_0_34A,8908,34,true,1585451811,82,22,278.82,12874,277.59,280.37,False,0,43.7246444,-79.3019575
34_0_34A,8908,34,true,1585451842,81,23,278.82,12874,277.59,280.37,False,0,43.72483,-79.3012436
34_0_34A,8908,34,true,1585451871,72,40,278.82,12874,277.59,280.37,False,0,43.7250895,-79.2998978
34_0_34A,8908,34,true,1585451872,72,40,278.82,12874,277.59,280.37,False,0,43.7250895,-79.2998978
34_0_34A,8908,34,true,1585451902,71,46,278.82,12874,277.59,280.37,False,0,43.7261113,-79.2951589
34_0_34A,8908,34,true,1585451932,73,0,278.88,12874,277.59,280.37,False,0,43.726894,-79.2916277
34_0_34A,8908,34,true,1585451931,73,0,278.88,12874,277.59,280.37,False,0,43.726894,-79.2916277
34_0_34A,8908,34,true,1585451962,73,0,278.88,12874,277.59,280.37,False,0,43.7270456,-79.2906763
34_0_34A,8908,34,true,1585451961,73,0,278.88,12874,277.59,280.37,False,0,43.7270456,-79.2906763
34_0_34A,8908,34,true,1585451992,73,39,278.88,12874,277.59,280.37,False,0,43.7277434,-79.2877262
34_0_34A,8908,34,true,1585452022,72,42,278.83,12874,277.59,280.37,False,0,43.7288323,-79.2826879
34_0_34A,8908,34,true,1585452052,74,34,278.83,12874,277.59,280.37,False,0,43.7297187,-79.2787551
34_0_34A,8908,34,true,1585452082,73,0,278.83,12874,277.59,280.37,False,0,43.7303859,-79.2758579
34_0_34A,8908,34,true,1585452111,73,33,278.87,12874,277.59,280.37,False,0,43.7307717,-79.2738057
34_0_34A,8908,34,true,1585452112,73,33,278.87,12874,277.59,280.37,False,0,43.7307717,-79.2738057
34_0_34A,8908,34,true,1585452142,71,37,278.86,12874,277.59,280.37,False,0,43.7311264,-79.2725861
34_0_34A,8908,34,true,1585452171,72,0,278.86,12874,277.59,280.37,False,0,43.7313219,-79.2712059
34_0_34A,8908,34,true,1585452172,72,0,278.86,12874,277.59,280.37,False,0,43.7313219,-79.2712059
34_0_34A,8908,34,true,1585452202,72,0,278.86,12874,277.59,280.37,False,0,43.7313219,-79.2712059
34_0_34A,8908,34,true,1585452233,72,6,278.86,12874,277.59,280.37,False,0,43.7312736,-79.2712783
34_0_34A,8908,34,true,1585452234,72,6,278.86,12874,277.59,280.37,False,0,43.7312736,-79.2712783
34_0_34A,8908,34,true,1585452262,71,2,278.86,12874,277.59,280.37,False,0,43.7320098,-79.2682037
34_0_34A,8908,34,true,1585452261,71,2,278.86,12874,277.59,280.37,False,0,43.7320098,-79.2682037
34_0_34A,8908,34,true,1585452292,72,0,278.86,12874,277.59,280.37,False,0,43.7320098,-79.2682037
34_0_34A,8908,34,true,1585452291,72,0,278.86,12874,277.59,280.37,False,0,43.7320098,-79.2682037
34_0_34A,8908,34,true,1585452322,72,0,278.86,12874,277.59,280.37,False,0,43.7320098,-79.2682037
34_0_34A,8908,34,true,1585452352,71,12,278.86,12874,277.59,280.37,False,0,43.7320943,-79.2680729
34_0_34A,8908,34,true,1585452382,114,25,278.86,12874,277.59,280.37,False,0,43.7323095,-79.2658129
34_0_34A,8908,34,true,1585452412,72,0,278.91,14484,277.59,280.37,False,0,43.7328752,-79.2640542
34_0_34A,8908,34,true,1585452442,72,0,278.91,14484,277.59,280.37,False,0,43.7328752,-79.2640542
34_0_34A,8908,34,true,1585452472,72,0,278.91,14484,277.59,280.37,False,0,43.733036,-79.2633391
34_0_34A,8908,34,true,1585452502,72,0,278.91,14484,277.59,280.37,False,0,43.733036,-79.2633391
34_0_34A,8908,34,true,1585452532,72,0,278.91,14484,277.59,280.37,False,0,43.733036,-79.2633391
34_0_34A,8908,34,true,1585452562,72,0,278.91,14484,277.59,280.37,False,0,43.733036,-79.2633391
34_0_34A,8908,34,true,1585452592,72,0,278.91,14484,277.59,280.37,False,0,43.733036,-79.2633391
34_0_34A,8908,34,true,1585452622,72,0,278.91,14484,277.59,280.37,False,0,43.733036,-79.2633391
34_0_34A,8908,34,true,1585452652,72,0,278.91,14484,277.59,280.37,False,0,43.733036,-79.2633391
34_0_34A,8908,34,true,1585452682,72,0,278.91,14484,277.59,280.37,False,0,43.733036,-79.2633391
34_0_34A,8908,34,true,1585452712,72,0,278.91,14484,277.59,280.37,False,0,43.733036,-79.2633391
34_0_34A,8908,34,true,1585452742,72,0,278.91,14484,277.59,280.37,False,0,43.733036,-79.2633391
34_0_34A,8908,34,true,1585452772,72,0,278.91,14484,277.59,280.37,False,0,43.733036,-79.2633391
34_0_34A,8908,34,true,1585455024,76,0,278.69,14484,277.04,280.37,False,0,43.7066802,-79.39859
34_0_34A,8908,34,true,1585455054,76,0,278.69,14484,277.04,280.37,False,0,43.7066802,-79.39859
34_0_34A,8908,34,true,1585455084,74,32,278.69,14484,277.04,280.37,False,0,43.7071456,-79.39608
34_0_34A,8908,34,true,1585455083,74,32,278.69,14484,277.04,280.37,False,0,43.7071456,-79.39608
34_0_34A,8908,34,true,1585455114,71,31,278.69,14484,277.04,280.37,False,0,43.7073582,-79.3952685
34_0_34A,8908,34,true,1585455113,71,31,278.69,14484,277.04,280.37,False,0,43.7073582,-79.3952685
34_0_34A,8908,34,true,1585455144,77,22,278.65,14484,277.04,280.37,False,0,43.7080696,-79.3917743
34_0_34A,8908,34,true,1585455143,77,22,278.65,14484,277.04,280.37,False,0,43.7080696,-79.3917743
34_0_34A,8908,34,true,1585455173,72,29,278.65,14484,277.04,280.37,False,0,43.708619,-79.3890164
34_0_34A,8908,34,true,1585455174,72,29,278.69,14484,277.04,280.37,False,0,43.708619,-79.3890164
34_0_34A,8908,34,true,1585455204,75,49,278.7,14484,277.04,280.37,False,0,43.7095495,-79.3844366
34_0_34A,8908,34,true,1585455203,75,49,278.7,14484,277.04,280.37,False,0,43.7095495,-79.3844366
34_0_34A,8908,34,true,1585455234,73,39,278.7,14484,277.04,280.37,False,0,43.7104807,-79.3795977
34_0_34A,8908,34,true,1585455264,75,0,278.7,14484,277.04,280.37,False,0,43.7109559,-79.3774705
34_0_34A,8908,34,true,1585455263,75,0,278.7,14484,277.04,280.37,False,0,43.7109559,-79.3774705
34_0_34A,8908,34,true,1585455294,75,0,278.7,14484,277.04,280.37,False,0,43.7109559,-79.3774705
34_0_34A,8908,34,true,1585455324,73,23,278.7,14484,277.04,280.37,False,0,43.7110418,-79.3769884
34_0_34A,8908,34,true,1585455354,74,52,278.71,14484,277.04,280.37,False,0,43.7121211,-79.3714299
34_0_34A,8908,34,true,1585455353,74,52,278.71,14484,277.04,280.37,False,0,43.7121211,-79.3714299
34_0_34A,8908,34,true,1585455384,73,48,278.71,14484,277.04,280.37,False,0,43.7132729,-79.3659748
34_0_34A,8908,34,true,1585455414,71,43,278.7,14484,277.04,280.37,False,0,43.7143566,-79.360512
34_0_34A,8908,34,true,1585455444,76,42,278.71,14484,277.04,280.37,False,0,43.7152709,-79.356756
34_0_34A,8908,34,true,1585455443,76,42,278.71,14484,277.04,280.37,False,0,43.7152709,-79.356756
34_0_34A,8908,34,true,1585455474,68,46,278.73,14484,277.04,280.37,False,0,43.7164084,-79.3519901
34_0_34A,8908,34,true,1585455504,63,46,278.73,14484,277.04,280.37,False,0,43.7175306,-79.3484282
34_0_34A,8908,34,true,1585455534,64,45,278.75,14484,277.04,280.37,False,0,43.7190281,-79.3435564
34_0_34A,8908,34,true,1585455564,66,35,278.75,14484,277.04,280.37,False,0,43.7206563,-79.3383289
34_0_34A,8908,34,true,1585455596,66,47,278.76,14484,277.04,280.37,False,0,43.7220299,-79.3338408
34_0_34A,8908,34,true,1585455597,66,47,278.76,14484,277.04,280.37,False,0,43.7220299,-79.3338408
34_0_34A,8908,34,true,1585455624,69,0,278.76,14484,277.04,280.37,False,0,43.7226461,-79.3318002
34_0_34A,8908,34,true,1585455654,71,33,278.76,14484,277.04,280.37,False,0,43.7233876,-79.3288102
34_0_34A,8908,34,true,1585455684,70,20,278.76,14484,277.04,280.37,False,0,43.723658,-79.3281048
34_0_34A,8908,34,true,1585455714,69,24,278.76,14484,277.04,280.37,False,0,43.7247489,-79.3239188
34_0_34A,8908,34,true,1585455744,76,27,278.78,14484,277.59,280.37,False,0,43.7260324,-79.3182826
34_0_34A,8908,34,true,1585455774,82,0,278.78,14484,277.59,280.37,False,0,43.7261875,-79.3179601
34_0_34A,8908,34,true,1585455804,112,18,278.78,14484,277.59,280.37,False,0,43.725923,-79.3136786
34_0_34A,8908,34,true,1585455805,112,18,278.78,14484,277.59,280.37,False,0,43.725923,-79.3136786
34_0_34A,8908,34,true,1585455834,103,0,278.78,14484,277.59,280.37,False,0,43.7259418,-79.3135454
34_0_34A,8908,34,true,1585455864,103,0,278.78,14484,277.59,280.37,False,0,43.7259418,-79.3135454
34_0_34A,8908,34,true,1585455894,103,0,278.78,14484,277.59,280.37,False,0,43.7259418,-79.3135454
34_0_34A,8908,34,true,1585455924,95,4,278.77,14484,277.59,280.37,False,0,43.7259649,-79.3133974
34_0_34A,8908,34,true,1585455925,95,4,278.77,14484,277.59,280.37,False,0,43.7259649,-79.3133974
34_0_34A,8908,34,true,1585455954,102,25,278.77,14484,277.59,280.37,False,0,43.7259448,-79.3130127
34_0_34A,8908,34,true,1585455955,102,25,278.77,14484,277.59,280.37,False,0,43.7259448,-79.3130127
34_0_34A,8908,34,true,1585455984,100,52,278.77,14484,277.59,280.37,False,0,43.7249384,-79.306812
34_0_34A,8908,34,true,1585455985,100,52,278.77,14484,277.59,280.37,False,0,43.7249384,-79.306812
34_0_34A,8908,34,true,1585456014,83,34,278.81,14484,277.59,280.37,False,0,43.7246404,-79.3019649
34_0_34A,8908,34,true,1585456015,83,34,278.81,14484,277.59,280.37,False,0,43.7246404,-79.3019649
34_0_34A,8908,34,true,1585456044,76,0,278.81,14484,277.59,280.37,False,0,43.7249468,-79.3006027
34_0_34A,8908,34,true,1585456045,76,0,278.81,14484,277.59,280.37,False,0,43.7249468,-79.3006027
34_0_34A,8908,34,true,1585456074,76,0,278.82,14484,277.59,280.37,False,0,43.7256561,-79.2974433
34_0_34A,8908,34,true,1585456075,76,0,278.82,14484,277.59,280.37,False,0,43.7256561,-79.2974433
34_0_34A,8908,34,true,1585456104,76,0,278.82,14484,277.59,280.37,False,0,43.7256164,-79.2969284
34_0_34A,8908,34,true,1585456135,76,0,278.82,14484,277.59,280.37,False,0,43.7256164,-79.2969284
34_0_34A,8908,34,true,1585456134,76,0,278.82,14484,277.59,280.37,False,0,43.7256164,-79.2969284
34_0_34A,8908,34,true,1585456164,72,45,278.82,14484,277.59,280.37,False,0,43.7264841,-79.2934764
34_0_34A,8908,34,true,1585456165,72,45,278.82,14484,277.59,280.37,False,0,43.7264841,-79.2934764
34_0_34A,8908,34,true,1585456194,72,42,278.82,14484,277.59,280.37,False,0,43.727542,-79.2884893
34_0_34A,8908,34,true,1585456195,72,42,278.82,14484,277.59,280.37,False,0,43.727542,-79.2884893
34_0_34A,8908,34,true,1585456224,73,0,278.82,14484,277.59,280.37,False,0,43.7278155,-79.2875735
34_0_34A,8908,34,true,1585456225,73,0,278.82,14484,277.59,280.37,False,0,43.7278155,-79.2875735
34_0_34A,8908,34,true,1585456254,73,0,278.82,14484,277.59,280.37,False,0,43.7279546,-79.2870984
34_0_34A,8908,34,true,1585456255,73,0,278.82,14484,277.59,280.37,False,0,43.7279546,-79.2870984
34_0_34A,8908,34,true,1585456284,73,0,278.82,14484,277.59,280.37,False,0,43.7279546,-79.2870984
34_0_34A,8908,34,true,1585456285,73,0,278.82,14484,277.59,280.37,False,0,43.7279546,-79.2870984
34_0_34A,8908,34,true,1585456314,73,43,278.82,14484,277.59,280.37,False,0,43.7282213,-79.2854459
34_0_34A,8908,34,true,1585456315,73,43,278.82,14484,277.59,280.37,False,0,43.7282213,-79.2854459
34_0_34A,8908,34,true,1585456345,74,47,278.78,14484,277.59,280.37,False,0,43.7292829,-79.2806693
34_0_34A,8908,34,true,1585456344,74,47,278.78,14484,277.59,280.37,False,0,43.7292829,-79.2806693
34_0_34A,8908,34,true,1585456374,72,44,278.78,14484,277.59,280.37,False,0,43.7302537,-79.2764573
34_0_34A,8908,34,true,1585456404,72,35,278.79,14484,277.59,280.37,False,0,43.7312593,-79.2719001
34_0_34A,8908,34,true,1585456405,72,35,278.79,14484,277.59,280.37,False,0,43.7312593,-79.2719001
34_0_34A,8908,34,true,1585456435,71,42,278.79,14484,277.59,280.37,False,0,43.7319117,-79.2688043
34_0_34A,8908,34,true,1585456434,71,42,278.79,14484,277.59,280.37,False,0,43.7319117,-79.2688043
34_0_34A,8908,34,true,1585456465,70,0,278.79,14484,277.59,280.37,False,0,43.7322466,-79.2674865
34_0_34A,8908,34,true,1585456464,70,0,278.79,14484,277.59,280.37,False,0,43.7322466,-79.2674865
34_0_34A,8908,34,true,1585456494,70,0,278.79,14484,277.59,280.37,False,0,43.7322466,-79.2674865
34_0_34A,8908,34,true,1585456495,70,0,278.79,14484,277.59,280.37,False,0,43.7322466,-79.2674865
34_0_34A,8908,34,true,1585456524,70,0,278.79,14484,277.59,280.37,False,0,43.7322466,-79.2674865
34_0_34A,8908,34,true,1585456556,95,24,278.82,14484,277.59,280.37,False,0,43.7322459,-79.2659375
34_0_34A,8908,34,true,1585456584,61,9,278.79,14484,277.59,280.37,False,0,43.7329488,-79.2637281
34_0_34A,8908,34,true,1585456585,61,9,278.79,14484,277.59,280.37,False,0,43.7329488,-79.2637281
34_0_34A,8908,34,true,1585456614,72,0,278.79,14484,277.59,280.37,False,0,43.7328085,-79.2632335
34_0_34A,8908,34,true,1585456615,72,0,278.79,14484,277.59,280.37,False,0,43.7328085,-79.2632335
34_0_34A,8908,34,true,1585456644,72,0,278.79,14484,277.59,280.37,False,0,43.73278,-79.2636183
34_0_34A,8908,34,true,1585456645,72,0,278.79,14484,277.59,280.37,False,0,43.73278,-79.2636183
34_0_34A,8908,34,true,1585456677,72,0,278.79,14484,277.59,280.37,False,0,43.73278,-79.2636183
34_0_34A,8908,34,true,1585456705,72,0,278.79,14484,277.59,280.37,False,0,43.73278,-79.2636183
34_0_34A,8908,34,true,1585456704,72,0,278.79,14484,277.59,280.37,False,0,43.73278,-79.2636183
34_0_34A,8908,34,true,1585456735,72,0,278.79,14484,277.59,280.37,False,0,43.73278,-79.2636183
34_0_34A,8908,34,true,1585456734,72,0,278.79,14484,277.59,280.37,False,0,43.73278,-79.2636183
34_0_34A,8908,34,true,1585456764,72,0,278.79,14484,277.59,280.37,False,0,43.73278,-79.2636183
34_0_34A,8908,34,true,1585456765,72,0,278.79,14484,277.59,280.37,False,0,43.73278,-79.2636183
34_0_34A,8908,34,true,1585456794,72,0,278.82,14484,277.59,280.37,False,0,43.73278,-79.2636183
34_0_34A,8908,34,true,1585456795,72,0,278.82,14484,277.59,280.37,False,0,43.73278,-79.2636183
34_0_34A,8908,34,true,1585456824,72,0,278.82,14484,277.59,280.37,False,0,43.73278,-79.2636183
34_0_34A,8908,34,true,1585456854,72,0,278.82,14484,277.59,280.37,False,0,43.73278,-79.2636183
34_0_34A,8908,34,true,1585456888,72,0,278.82,14484,277.59,280.37,False,0,43.73278,-79.2636183
34_0_34A,8908,34,true,1585456914,72,0,278.82,14484,277.59,280.37,False,0,43.73278,-79.2636183
34_0_34A,8908,34,true,1585456915,72,0,278.82,14484,277.59,280.37,False,0,43.73278,-79.2636183
34_0_34A,8908,34,true,1585456945,72,0,278.82,14484,277.59,280.37,False,0,43.73278,-79.2636183
34_0_34A,8908,34,true,1585456944,72,0,278.82,14484,277.59,280.37,False,0,43.73278,-79.2636183
34_0_34A,8908,34,true,1585456974,72,0,278.82,14484,277.59,280.37,False,0,43.73278,-79.2636183
34_0_34A,8908,34,true,1585456975,72,0,278.82,14484,277.59,280.37,False,0,43.73278,-79.2636183
34_0_34A,8908,34,true,1585457004,72,0,278.82,14484,277.59,280.37,False,0,43.73278,-79.2636183
34_0_34A,8908,34,true,1585457034,72,0,278.82,14484,277.59,280.37,False,0,43.73278,-79.2636183
34_0_34A,8908,34,true,1585457035,72,0,278.82,14484,277.59,280.37,False,0,43.73278,-79.2636183
34_0_34A,8908,34,true,1585459817,0,19,278.67,14484,277.04,280.37,False,0,43.7050933,-79.3985671
34_0_34A,8908,34,true,1585459847,31,15,278.67,14484,277.04,280.37,False,0,43.7063522,-79.3999252
34_0_34A,8908,34,true,1585459877,76,0,278.67,14484,277.04,280.37,False,0,43.7066948,-79.3985148
34_0_34A,8908,34,true,1585459878,76,0,278.67,14484,277.04,280.37,False,0,43.7066948,-79.3985148
34_0_34A,8908,34,true,1585459907,76,0,278.67,14484,277.04,280.37,False,0,43.7066948,-79.3985148
34_0_34A,8908,34,true,1585459908,76,0,278.67,14484,277.04,280.37,False,0,43.7066948,-79.3985148
34_0_34A,8908,34,true,1585459937,73,35,278.67,14484,277.04,280.37,False,0,43.7072797,-79.3954433
34_0_34A,8908,34,true,1585459938,73,35,278.67,14484,277.04,280.37,False,0,43.7072797,-79.3954433
34_0_34A,8908,34,true,1585459967,74,35,278.68,14484,277.04,280.37,False,0,43.7078304,-79.3927491
34_0_34A,8908,34,true,1585459997,74,28,278.68,14484,277.04,280.37,False,0,43.7087636,-79.3883119
34_0_34A,8908,34,true,1585460027,74,48,278.69,14484,277.04,280.37,False,0,43.7095139,-79.3845943
34_0_34A,8908,34,true,1585460057,73,39,278.69,14484,277.04,280.37,False,0,43.7104837,-79.3795873
34_0_34A,8908,34,true,1585460058,73,39,278.69,14484,277.04,280.37,False,0,43.7104837,-79.3795873
34_0_34A,8908,34,true,1585460088,74,27,278.69,14484,277.04,280.37,False,0,43.7111433,-79.3762478
34_0_34A,8908,34,true,1585460087,74,27,278.69,14484,277.04,280.37,False,0,43.7111433,-79.3762478
34_0_34A,8908,34,true,1585460117,74,53,278.69,14484,277.04,280.37,False,0,43.7123389,-79.3703362
34_0_34A,8908,34,true,1585460118,74,53,278.69,14484,277.04,280.37,False,0,43.7123389,-79.3703362
34_0_34A,8908,34,true,1585460147,74,0,278.69,14484,277.04,280.37,False,0,43.7131303,-79.3668555
34_0_34A,8908,34,true,1585460177,73,27,278.69,14484,277.04,280.37,False,0,43.7131983,-79.3664264
34_0_34A,8908,34,true,1585460207,73,48,278.7,14484,277.04,280.37,False,0,43.7139717,-79.3623723
34_0_34A,8908,34,true,1585460237,67,0,278.7,14484,277.04,280.37,False,0,43.7146886,-79.3594156
34_0_34A,8908,34,true,1585460267,67,42,278.71,14484,277.04,280.37,False,0,43.7152328,-79.3569641
34_0_34A,8908,34,true,1585460268,67,42,278.71,14484,277.04,280.37,False,0,43.7152328,-79.3569641
34_0_34A,8908,34,true,1585460297,66,39,278.73,14484,277.04,280.37,False,0,43.7163159,-79.3523067
34_0_34A,8908,34,true,1585460327,66,34,278.73,14484,277.04,280.37,False,0,43.7174082,-79.348836
34_0_34A,8908,34,true,1585460357,65,49,278.73,14484,277.04,280.37,False,0,43.7181184,-79.3464424
34_0_34A,8908,34,true,1585460387,69,49,278.73,14484,277.04,280.37,False,0,43.7200184,-79.3403757
34_0_34A,8908,34,true,1585460418,78,0,278.73,14484,277.04,280.37,False,0,43.7206923,-79.3381417
34_0_34A,8908,34,true,1585460417,78,0,278.73,14484,277.04,280.37,False,0,43.7206923,-79.3381417
34_0_34A,8908,34,true,1585460447,65,0,278.76,14484,277.04,280.37,False,0,43.720924,-79.3370812
34_0_34A,8908,34,true,1585460448,65,0,278.76,14484,277.04,280.37,False,0,43.720924,-79.3370812
34_0_34A,8908,34,true,1585460477,64,47,278.78,14484,277.04,280.37,False,0,43.7217126,-79.334889
34_0_34A,8908,34,true,1585460508,70,50,278.78,14484,277.04,280.37,False,0,43.723386,-79.3288132
34_0_34A,8908,34,true,1585460538,68,43,278.79,14484,277.04,280.37,False,0,43.7248495,-79.3235529
34_0_34A,8908,34,true,1585460568,73,44,278.8,14484,277.59,280.37,False,0,43.7260347,-79.3182793
34_0_34A,8908,34,true,1585460598,101,44,278.81,14484,277.59,280.37,False,0,43.7259276,-79.3136453
34_0_34A,8908,34,true,1585460597,101,44,278.81,14484,277.59,280.37,False,0,43.7259276,-79.3136453
34_0_34A,8908,34,true,1585460628,101,51,278.81,14484,277.59,280.37,False,0,43.7251193,-79.3074975
34_0_34A,8908,34,true,1585460627,101,51,278.81,14484,277.59,280.37,False,0,43.7251193,-79.3074975
34_0_34A,8908,34,true,1585460658,91,37,278.81,14484,277.59,280.37,False,0,43.7246828,-79.3026299
34_0_34A,8908,34,true,1585460657,91,37,278.81,14484,277.59,280.37,False,0,43.7246828,-79.3026299
34_0_34A,8908,34,true,1585460687,76,0,278.81,14484,277.59,280.37,False,0,43.7250692,-79.2999946
34_0_34A,8908,34,true,1585460688,76,0,278.81,14484,277.59,280.37,False,0,43.7250692,-79.2999946
34_0_34A,8908,34,true,1585460718,76,0,278.81,14484,277.59,280.37,False,0,43.7250692,-79.2999946
34_0_34A,8908,34,true,1585460717,76,0,278.81,14484,277.59,280.37,False,0,43.7250692,-79.2999946
34_0_34A,8908,34,true,1585460747,76,0,278.81,14484,277.59,280.37,False,0,43.7250692,-79.2999946
34_0_34A,8908,34,true,1585460748,76,0,278.81,14484,277.59,280.37,False,0,43.7250692,-79.2999946
34_0_34A,8908,34,true,1585460778,78,22,278.81,14484,277.59,280.37,False,0,43.7251382,-79.2996715
34_0_34A,8908,34,true,1585460777,78,22,278.81,14484,277.59,280.37,False,0,43.7251382,-79.2996715
34_0_34A,8908,34,true,1585460808,73,47,278.81,14484,277.59,280.37,False,0,43.7261123,-79.2951554
34_0_34A,8908,34,true,1585460837,72,14,278.82,14484,277.59,280.37,False,0,43.7269821,-79.2908439
34_0_34A,8908,34,true,1585460838,72,14,278.82,14484,277.59,280.37,False,0,43.7269821,-79.2908439
34_0_34A,8908,34,true,1585460870,73,0,278.82,14484,277.59,280.37,False,0,43.7270266,-79.2907266
34_0_34A,8908,34,true,1585460871,73,0,278.82,14484,277.59,280.37,False,0,43.7270266,-79.2907266
34_0_34A,8908,34,true,1585460898,73,1,278.82,14484,277.59,280.37,False,0,43.7270329,-79.2907098
34_0_34A,8908,34,true,1585460897,73,1,278.82,14484,277.59,280.37,False,0,43.7270329,-79.2907098
34_0_34A,8908,34,true,1585460928,72,37,278.82,14484,277.59,280.37,False,0,43.7277379,-79.2877328
34_0_34A,8908,34,true,1585460927,72,37,278.82,14484,277.59,280.37,False,0,43.7277379,-79.2877328
34_0_34A,8908,34,true,1585460958,73,43,278.88,14484,277.59,280.37,False,0,43.7288339,-79.282685
34_0_34A,8908,34,true,1585460957,73,43,278.88,14484,277.59,280.37,False,0,43.7288339,-79.282685
34_0_34A,8908,34,true,1585460988,73,43,278.88,14484,277.59,280.37,False,0,43.7298611,-79.27799
34_0_34A,8908,34,true,1585460987,73,43,278.88,14484,277.59,280.37,False,0,43.7298611,-79.27799
34_0_34A,8908,34,true,1585461018,74,38,278.9,14484,277.59,280.37,False,0,43.7307744,-79.2738021
34_0_34A,8908,34,true,1585461017,74,38,278.9,14484,277.59,280.37,False,0,43.7307744,-79.2738021
34_0_34A,8908,34,true,1585461047,73,0,278.9,14484,277.59,280.37,False,0,43.7310317,-79.2730178
34_0_34A,8908,34,true,1585461048,73,0,278.9,14484,277.59,280.37,False,0,43.7310317,-79.2730178
34_0_34A,8908,34,true,1585461077,72,39,278.9,14484,277.59,280.37,False,0,43.7313728,-79.2711296
34_0_34A,8908,34,true,1585461078,72,39,278.9,14484,277.59,280.37,False,0,43.7313728,-79.2711296
34_0_34A,8908,34,true,1585461108,72,0,278.9,14484,277.59,280.37,False,0,43.7316151,-79.2703917
34_0_34A,8908,34,true,1585461107,72,0,278.9,14484,277.59,280.37,False,0,43.7316151,-79.2703917
34_0_34A,8908,34,true,1585461138,72,0,278.9,14484,277.59,280.37,False,0,43.7316151,-79.2703917
34_0_34A,8908,34,true,1585461137,72,0,278.9,14484,277.59,280.37,False,0,43.7316151,-79.2703917
34_0_34A,8908,34,true,1585461168,72,31,278.9,14484,277.59,280.37,False,0,43.732211,-79.267723
34_0_34A,8908,34,true,1585461167,72,31,278.9,14484,277.59,280.37,False,0,43.732211,-79.267723
34_0_34A,8908,34,true,1585461198,49,0,278.9,14484,277.59,280.37,False,0,43.7322921,-79.2671203
34_0_34A,8908,34,true,1585461197,49,0,278.9,14484,277.59,280.37,False,0,43.7322921,-79.2671203
34_0_34A,8908,34,true,1585461227,49,0,278.9,14484,277.59,280.37,False,0,43.7322921,-79.2671203
34_0_34A,8908,34,true,1585461228,49,0,278.9,14484,277.59,280.37,False,0,43.7322921,-79.2671203
34_0_34A,8908,34,true,1585461257,79,28,278.9,14484,277.59,280.37,False,0,43.7322408,-79.2660189
34_0_34A,8908,34,true,1585461258,79,28,278.9,14484,277.59,280.37,False,0,43.7322408,-79.2660189
34_0_34A,8908,34,true,1585461288,59,27,278.88,14484,277.59,280.37,False,0,43.7328501,-79.2641653
34_0_34A,8908,34,true,1585461317,72,0,278.88,14484,277.59,280.37,False,0,43.73271,-79.2635616
34_0_34A,8908,34,true,1585461318,72,0,278.88,14484,277.59,280.37,False,0,43.73271,-79.2635616
34_0_34A,8908,34,true,1585461349,72,0,278.88,14484,277.59,280.37,False,0,43.73271,-79.2635616
34_0_34A,8908,34,true,1585461378,60,13,278.88,14484,277.59,280.37,False,0,43.7327983,-79.2633733
34_0_34A,8908,34,true,1585461377,60,13,278.88,14484,277.59,280.37,False,0,43.7327983,-79.2633733
34_0_34A,8908,34,true,1585461408,72,0,278.88,14484,277.59,280.37,False,0,43.7322366,-79.2637966
34_0_34A,8908,34,true,1585461438,72,0,278.88,14484,277.59,280.37,False,0,43.7322366,-79.2637966
34_0_34A,8908,34,true,1585461468,72,0,278.88,14484,277.59,280.37,False,0,43.7322366,-79.2637966
34_0_34A,8908,34,true,1585461467,72,0,278.88,14484,277.59,280.37,False,0,43.7322366,-79.2637966
34_0_34A,8908,34,true,1585461498,72,0,278.88,14484,277.59,280.37,False,0,43.7322366,-79.2637966
34_0_34A,8908,34,true,1585461528,72,0,278.88,14484,277.59,280.37,False,0,43.7322366,-79.2637966
34_0_34A,8908,34,true,1585461557,72,0,278.88,14484,277.59,280.37,False,0,43.7322366,-79.2637966
34_0_34A,8908,34,true,1585461558,72,0,278.88,14484,277.59,280.37,False,0,43.7322366,-79.2637966
34_0_34A,8908,34,true,1585461590,72,0,278.88,14484,277.59,280.37,False,0,43.7322366,-79.2637966
34_0_34A,8908,34,true,1585461591,72,0,278.88,14484,277.59,280.37,False,0,43.7322366,-79.2637966
34_0_34A,8908,34,true,1585461618,72,0,278.88,14484,277.59,280.37,False,0,43.7322366,-79.2637966
34_0_34A,8908,34,true,1585461648,72,0,278.88,14484,277.59,280.37,False,0,43.7322366,-79.2637966
34_0_34A,8908,34,true,1585461678,72,0,278.88,14484,277.59,280.37,False,0,43.7322366,-79.2637966
34_0_34A,8908,34,true,1585461708,72,0,278.88,14484,277.59,280.37,False,0,43.7322366,-79.2637966
34_0_34A,8908,34,true,1585461738,72,0,278.88,14484,277.59,280.37,False,0,43.7322366,-79.2637966
34_0_34A,8908,34,true,1585461768,72,0,278.88,14484,277.59,280.37,False,0,43.7322366,-79.2637966
34_0_34A,8908,34,true,1585461767,72,0,278.88,14484,277.59,280.37,False,0,43.7322366,-79.2637966
34_0_34A,8908,34,true,1585461798,72,0,278.88,14484,277.59,280.37,False,0,43.7322366,-79.2637966
34_0_34A,8908,34,true,1585461828,72,0,278.88,14484,277.59,280.37,False,0,43.7322366,-79.2637966
34_0_34A,8908,34,true,1585461858,72,0,278.88,14484,277.59,280.37,False,0,43.7322366,-79.2637966
34_0_34A,8908,34,true,1585461888,72,0,278.88,14484,277.59,280.37,False,0,43.7322366,-79.2637966
34_0_34A,8908,34,true,1585461918,246,2,278.88,14484,277.59,280.37,False,0,43.7325668,-79.2639389
34_0_34A,8908,34,true,1585461948,72,0,278.88,14484,277.59,280.37,False,0,43.7323036,-79.2636871
34_0_34A,8908,34,true,1585461978,72,0,278.88,14484,277.59,280.37,False,0,43.7323036,-79.2636871
34_0_34A,8908,34,true,1585462008,26,16,278.88,14484,277.59,280.37,False,0,43.7329711,-79.2631759
