dir,id,route,predable,time,hdg,spd,temp,vis,t_min,t_max,snow,rain,lat,lon
320_1_320,8648,34,true,1585460508,8,1,278.67,14484,277.04,280.37,False,0,43.7043151,-79.3985137
320_1_320,8648,34,true,1585460538,8,0,278.67,14484,277.04,280.37,False,0,43.7043151,-79.3985137
320_1_320,8648,34,true,1585460568,8,0,278.67,14484,277.04,280.37,False,0,43.7043151,-79.3985137
320_1_320,8648,34,true,1585460598,8,0,278.67,14484,277.04,280.37,False,0,43.7043151,-79.3985137
320_1_320,8648,320,true,1585460628,171,35,278.67,14484,277.04,280.37,False,0,43.7020566,-79.3974099
