dir,id,route,predable,time,hdg,spd,temp,vis,t_min,t_max,snow,rain,lat,lon
34_0_34A,8804,34,true,1585435070,131,9,280.02,14484,277.59,282.04,False,0,43.7050933,-79.3985671
34_0_34A,8804,34,true,1585435100,216,0,280.02,14484,277.59,282.04,False,0,43.7050933,-79.3985671
34_0_34A,8804,34,true,1585435130,216,0,280.02,14484,277.59,282.04,False,0,43.7050933,-79.3985671
34_0_34A,8804,34,true,1585435160,281,21,280.02,14484,277.59,282.04,False,0,43.7050933,-79.3985671
34_0_34A,8804,34,true,1585435190,13,12,280.02,14484,277.59,282.04,False,0,43.7062301,-79.4001083
34_0_34A,8804,34,true,1585435220,76,0,280.02,14484,277.59,282.04,False,0,43.7066802,-79.39859
34_0_34A,8804,34,true,1585435250,75,27,280.02,14484,277.59,282.04,False,0,43.7071456,-79.39608
34_0_34A,8804,34,true,1585435280,76,0,280.02,14484,277.59,282.04,False,0,43.7072067,-79.3956069
34_0_34A,8804,34,true,1585435310,76,26,279.93,14484,277.04,282.04,False,0,43.7076707,-79.3935596
34_0_34A,8804,34,true,1585435340,74,0,279.93,14484,277.04,282.04,False,0,43.7077228,-79.3931644
34_0_34A,8804,34,true,1585435370,74,26,279.93,14484,277.04,282.04,False,0,43.7082681,-79.3908201
34_0_34A,8804,34,true,1585435400,74,30,279.93,14484,277.04,282.04,False,0,43.7089146,-79.3874338
34_0_34A,8804,34,true,1585435430,74,33,279.92,14484,277.04,282.04,False,0,43.7094436,-79.3849268
34_0_34A,8804,34,true,1585435460,74,0,279.92,14484,277.04,282.04,False,0,43.7099151,-79.3823394
34_0_34A,8804,34,true,1585435490,74,34,279.92,14484,277.04,282.04,False,0,43.7104817,-79.3795942
34_0_34A,8804,34,true,1585435520,75,0,279.92,14484,277.04,282.04,False,0,43.7108532,-79.377947
34_0_34A,8804,34,true,1585435550,75,0,279.92,14484,277.04,282.04,False,0,43.7108532,-79.377947
34_0_34A,8804,34,true,1585435580,74,0,279.92,14484,277.04,282.04,False,0,43.7112124,-79.3759621
34_0_34A,8804,34,true,1585435610,74,42,279.93,14484,277.04,282.04,False,0,43.7117746,-79.3736594
34_0_34A,8804,34,true,1585435611,74,42,279.93,14484,277.04,282.04,False,0,43.7117746,-79.3736594
34_0_34A,8804,34,true,1585435640,74,38,279.93,14484,277.04,282.04,False,0,43.7125385,-79.3695653
34_0_34A,8804,34,true,1585435670,74,0,279.93,14484,277.04,282.04,False,0,43.7129631,-79.3673248
34_0_34A,8804,34,true,1585435700,74,34,279.93,14484,277.04,282.04,False,0,43.7134228,-79.3652087
34_0_34A,8804,34,true,1585435730,74,33,279.94,14484,277.04,282.04,False,0,43.7142672,-79.3610518
34_0_34A,8804,34,true,1585435731,74,33,279.94,14484,277.04,282.04,False,0,43.7142672,-79.3610518
34_0_34A,8804,34,true,1585435760,74,0,279.94,14484,277.04,282.04,False,0,43.7144633,-79.3598933
34_0_34A,8804,34,true,1585435761,74,0,279.94,14484,277.04,282.04,False,0,43.7144633,-79.3598933
34_0_34A,8804,34,true,1585435790,69,33,279.88,14484,277.04,282.04,False,0,43.7148487,-79.3587159
34_0_34A,8804,34,true,1585435791,69,33,279.88,14484,277.04,282.04,False,0,43.7148487,-79.3587159
34_0_34A,8804,34,true,1585435820,82,36,279.96,14484,277.04,282.04,False,0,43.715638,-79.3548517
34_0_34A,8804,34,true,1585435821,82,36,279.96,14484,277.04,282.04,False,0,43.715638,-79.3548517
34_0_34A,8804,34,true,1585435850,72,35,279.96,14484,277.04,282.04,False,0,43.7167295,-79.3509715
34_0_34A,8804,34,true,1585435851,72,35,279.96,14484,277.04,282.04,False,0,43.7167295,-79.3509715
34_0_34A,8804,34,true,1585435880,65,23,279.96,14484,277.04,282.04,False,0,43.7169733,-79.3496537
34_0_34A,8804,34,true,1585435910,67,40,279.96,14484,277.04,282.04,False,0,43.717908,-79.3471268
34_0_34A,8804,34,true,1585435940,64,36,279.99,14484,277.04,282.04,False,0,43.7187639,-79.3443832
34_0_34A,8804,34,true,1585435941,64,36,279.99,14484,277.04,282.04,False,0,43.7187639,-79.3443832
34_0_34A,8804,34,true,1585435970,66,30,279.99,14484,277.04,282.04,False,0,43.7202967,-79.3395295
34_0_34A,8804,34,true,1585435971,66,30,279.99,14484,277.04,282.04,False,0,43.7202967,-79.3395295
34_0_34A,8804,34,true,1585436000,78,0,279.99,14484,277.04,282.04,False,0,43.7205345,-79.3387277
34_0_34A,8804,34,true,1585436001,78,0,279.99,14484,277.04,282.04,False,0,43.7205345,-79.3387277
34_0_34A,8804,34,true,1585436030,78,0,279.99,14484,277.04,282.04,False,0,43.7205345,-79.3387277
34_0_34A,8804,34,true,1585436031,78,0,279.99,14484,277.04,282.04,False,0,43.7205345,-79.3387277
34_0_34A,8804,34,true,1585436060,78,0,279.93,14484,277.04,282.04,False,0,43.7205345,-79.3387277
34_0_34A,8804,34,true,1585436090,65,0,279.93,14484,277.04,282.04,False,0,43.7206369,-79.3375748
34_0_34A,8804,34,true,1585436091,65,0,279.93,14484,277.04,282.04,False,0,43.7206369,-79.3375748
34_0_34A,8804,34,true,1585436120,66,40,279.97,14484,277.59,282.04,False,0,43.7218399,-79.3344726
34_0_34A,8804,34,true,1585436121,66,40,279.97,14484,277.59,282.04,False,0,43.7218399,-79.3344726
34_0_34A,8804,34,true,1585436150,69,0,279.97,14484,277.59,282.04,False,0,43.7224915,-79.3321599
34_0_34A,8804,34,true,1585436151,69,0,279.97,14484,277.59,282.04,False,0,43.7224915,-79.3321599
34_0_34A,8804,34,true,1585436181,69,0,279.97,14484,277.59,282.04,False,0,43.7225952,-79.3319702
34_0_34A,8804,34,true,1585436180,69,0,279.97,14484,277.59,282.04,False,0,43.7225952,-79.3319702
34_0_34A,8804,34,true,1585436210,70,35,279.97,14484,277.59,282.04,False,0,43.7233907,-79.3288042
34_0_34A,8804,34,true,1585436211,70,35,279.97,14484,277.59,282.04,False,0,43.7233907,-79.3288042
34_0_34A,8804,34,true,1585436240,70,0,279.97,14484,277.59,282.04,False,0,43.7243042,-79.3256256
34_0_34A,8804,34,true,1585436241,70,0,279.97,14484,277.59,282.04,False,0,43.7243042,-79.3256256
34_0_34A,8804,34,true,1585436271,69,19,279.97,14484,277.59,282.04,False,0,43.7247146,-79.3240514
34_0_34A,8804,34,true,1585436270,69,19,279.97,14484,277.59,282.04,False,0,43.7247146,-79.3240514
34_0_34A,8804,34,true,1585436300,70,39,279.96,14484,277.59,282.04,False,0,43.7257015,-79.3202731
34_0_34A,8804,34,true,1585436301,70,39,279.96,14484,277.59,282.04,False,0,43.7257015,-79.3202731
34_0_34A,8804,34,true,1585436330,45,0,279.96,14484,277.59,282.04,False,0,43.7259848,-79.3183488
34_0_34A,8804,34,true,1585436331,45,0,279.96,14484,277.59,282.04,False,0,43.7259848,-79.3183488
34_0_34A,8804,34,true,1585436360,81,29,279.96,14484,277.59,282.04,False,0,43.7262233,-79.3175916
34_0_34A,8804,34,true,1585436361,81,29,279.96,14484,277.59,282.04,False,0,43.7262233,-79.3175916
34_0_34A,8804,34,true,1585436390,101,21,279.97,14484,277.59,282.04,False,0,43.7261321,-79.3142769
34_0_34A,8804,34,true,1585436391,101,21,279.97,14484,277.59,282.04,False,0,43.7261321,-79.3142769
34_0_34A,8804,34,true,1585436421,140,1,279.97,14484,277.59,282.04,False,0,43.7259063,-79.3137969
34_0_34A,8804,34,true,1585436420,140,1,279.97,14484,277.59,282.04,False,0,43.7259063,-79.3137969
34_0_34A,8804,34,true,1585436450,140,0,279.97,14484,277.59,282.04,False,0,43.7259063,-79.3137969
34_0_34A,8804,34,true,1585436451,140,0,279.97,14484,277.59,282.04,False,0,43.7259063,-79.3137969
34_0_34A,8804,34,true,1585436481,140,0,279.97,14484,277.59,282.04,False,0,43.7259063,-79.3137969
34_0_34A,8804,34,true,1585436480,140,0,279.97,14484,277.59,282.04,False,0,43.7259063,-79.3137969
34_0_34A,8804,34,true,1585436511,140,0,279.93,14484,277.59,282.04,False,0,43.7259063,-79.3137969
34_0_34A,8804,34,true,1585436510,140,0,279.93,14484,277.59,282.04,False,0,43.7259063,-79.3137969
34_0_34A,8804,34,true,1585436541,101,35,279.93,14484,277.59,282.04,False,0,43.7256504,-79.3111619
34_0_34A,8804,34,true,1585436540,101,35,279.93,14484,277.59,282.04,False,0,43.7256504,-79.3111619
34_0_34A,8804,34,true,1585436570,99,38,279.93,14484,277.59,282.04,False,0,43.7251199,-79.3075014
34_0_34A,8804,34,true,1585436571,99,38,279.93,14484,277.59,282.04,False,0,43.7251199,-79.3075014
34_0_34A,8804,34,true,1585436600,85,31,279.89,14484,277.59,282.04,False,0,43.7246818,-79.3026224
34_0_34A,8804,34,true,1585436601,85,31,279.89,14484,277.59,282.04,False,0,43.7246818,-79.3026224
34_0_34A,8804,34,true,1585436632,65,0,279.89,14484,277.59,282.04,False,0,43.7247312,-79.3017934
34_0_34A,8804,34,true,1585436633,65,0,279.89,14484,277.59,282.04,False,0,43.7247312,-79.3017934
34_0_34A,8804,34,true,1585436660,71,28,279.9,14484,277.59,282.04,False,0,43.7253687,-79.2986728
34_0_34A,8804,34,true,1585436661,71,28,279.9,14484,277.59,282.04,False,0,43.7253687,-79.2986728
34_0_34A,8804,34,true,1585436690,76,0,279.9,14484,277.59,282.04,False,0,43.7255458,-79.2979062
34_0_34A,8804,34,true,1585436691,76,0,279.9,14484,277.59,282.04,False,0,43.7255458,-79.2979062
34_0_34A,8804,34,true,1585436721,72,22,279.9,14484,277.59,282.04,False,0,43.7256506,-79.2974675
34_0_34A,8804,34,true,1585436720,72,22,279.9,14484,277.59,282.04,False,0,43.7256506,-79.2974675
34_0_34A,8804,34,true,1585436750,73,36,279.97,14484,277.59,282.04,False,0,43.7263532,-79.294283
34_0_34A,8804,34,true,1585436751,73,36,279.97,14484,277.59,282.04,False,0,43.7263532,-79.294283
34_0_34A,8804,34,true,1585436781,72,11,279.97,14484,277.59,282.04,False,0,43.7267797,-79.2918365
34_0_34A,8804,34,true,1585436780,72,11,279.97,14484,277.59,282.04,False,0,43.7267797,-79.2918365
34_0_34A,8804,34,true,1585436811,73,0,279.97,14484,277.59,282.04,False,0,43.726788,-79.2918215
34_0_34A,8804,34,true,1585436810,73,0,279.97,14484,277.59,282.04,False,0,43.726788,-79.2918215
34_0_34A,8804,34,true,1585436840,73,0,279.97,14484,277.59,282.04,False,0,43.7269872,-79.2908305
34_0_34A,8804,34,true,1585436841,73,0,279.97,14484,277.59,282.04,False,0,43.7269872,-79.2908305
34_0_34A,8804,34,true,1585436870,68,26,279.97,14484,277.59,282.04,False,0,43.7275449,-79.2884708
34_0_34A,8804,34,true,1585436871,68,26,279.97,14484,277.59,282.04,False,0,43.7275449,-79.2884708
34_0_34A,8804,34,true,1585436900,72,32,279.97,14484,277.59,282.04,False,0,43.7282014,-79.2856979
34_0_34A,8804,34,true,1585436901,72,32,279.97,14484,277.59,282.04,False,0,43.7282014,-79.2856979
34_0_34A,8804,34,true,1585436931,72,33,279.91,14484,277.59,282.04,False,0,43.7288272,-79.2826965
34_0_34A,8804,34,true,1585436930,72,33,279.91,14484,277.59,282.04,False,0,43.7288272,-79.2826965
34_0_34A,8804,34,true,1585436961,74,0,279.91,14484,277.59,282.04,False,0,43.7292253,-79.2807556
34_0_34A,8804,34,true,1585436960,74,0,279.91,14484,277.59,282.04,False,0,43.7292253,-79.2807556
34_0_34A,8804,34,true,1585436991,74,35,279.91,14484,277.59,282.04,False,0,43.7297192,-79.2787475
34_0_34A,8804,34,true,1585436990,74,35,279.91,14484,277.59,282.04,False,0,43.7297192,-79.2787475
34_0_34A,8804,34,true,1585437021,73,0,279.91,14484,277.59,282.04,False,0,43.7303884,-79.2758472
34_0_34A,8804,34,true,1585437051,73,31,279.91,14484,277.59,282.04,False,0,43.73067,-79.2745925
34_0_34A,8804,34,true,1585437050,73,31,279.91,14484,277.59,282.04,False,0,43.73067,-79.2745925
34_0_34A,8804,34,true,1585437080,73,0,279.91,14484,277.59,282.04,False,0,43.7312736,-79.2712783
34_0_34A,8804,34,true,1585437081,73,0,279.91,14484,277.59,282.04,False,0,43.7312736,-79.2712783
34_0_34A,8804,34,true,1585437110,73,0,279.91,14484,277.59,282.04,False,0,43.7312736,-79.2712783
34_0_34A,8804,34,true,1585437111,73,0,279.91,14484,277.59,282.04,False,0,43.7312736,-79.2712783
34_0_34A,8804,34,true,1585437141,71,30,279.91,14484,277.59,282.04,False,0,43.7316575,-79.2702066
34_0_34A,8804,34,true,1585437140,71,30,279.91,14484,277.59,282.04,False,0,43.7316575,-79.2702066
34_0_34A,8804,34,true,1585437170,72,0,279.91,14484,277.59,282.04,False,0,43.7320098,-79.2682037
34_0_34A,8804,34,true,1585437171,72,0,279.91,14484,277.59,282.04,False,0,43.7320098,-79.2682037
34_0_34A,8804,34,true,1585437200,72,0,279.91,14484,277.59,282.04,False,0,43.7320098,-79.2682037
34_0_34A,8804,34,true,1585437201,72,0,279.91,14484,277.59,282.04,False,0,43.7320098,-79.2682037
34_0_34A,8804,34,true,1585437231,72,0,279.91,14484,277.59,282.04,False,0,43.7320098,-79.2682037
34_0_34A,8804,34,true,1585437230,72,0,279.91,14484,277.59,282.04,False,0,43.7320098,-79.2682037
34_0_34A,8804,34,true,1585437260,124,28,279.91,14484,277.59,282.04,False,0,43.7322346,-79.2661836
34_0_34A,8804,34,true,1585437261,124,28,279.91,14484,277.59,282.04,False,0,43.7322346,-79.2661836
34_0_34A,8804,34,true,1585437291,61,3,279.92,14484,277.59,282.04,False,0,43.7327829,-79.2644627
34_0_34A,8804,34,true,1585437290,61,3,279.92,14484,277.59,282.04,False,0,43.7327829,-79.2644627
34_0_34A,8804,34,true,1585437321,72,0,279.92,14484,277.59,282.04,False,0,43.7330288,-79.263367
34_0_34A,8804,34,true,1585437320,72,0,279.92,14484,277.59,282.04,False,0,43.7330288,-79.263367
