dir,id,route,predable,time,hdg,spd,temp,vis,t_min,t_max,snow,rain,lat,lon
34_0_34C,8789,34,true,1585482985,278,25,278.47,8047,276.48,279.82,False,2,43.7050933,-79.3985671
34_0_34C,8789,34,true,1585482984,278,25,278.47,8047,276.48,279.82,False,2,43.7050933,-79.3985671
34_0_34C,8789,34,true,1585483015,18,10,278.47,8047,276.48,279.82,False,2,43.7062301,-79.4001083
34_0_34C,8789,34,true,1585483014,18,10,278.47,8047,276.48,279.82,False,2,43.7062301,-79.4001083
34_0_34C,8789,34,true,1585483045,76,32,278.47,8047,276.48,279.82,False,2,43.706726,-79.3983535
34_0_34C,8789,34,true,1585483044,76,32,278.47,8047,276.48,279.82,False,2,43.706726,-79.3983535
34_0_34C,8789,34,true,1585483075,70,33,278.48,8047,276.48,279.82,False,2,43.7074165,-79.3949966
34_0_34C,8789,34,true,1585483074,70,33,278.48,8047,276.48,279.82,False,2,43.7074165,-79.3949966
34_0_34C,8789,34,true,1585483105,74,0,278.48,8047,276.48,279.82,False,2,43.707756,-79.3929367
34_0_34C,8789,34,true,1585483134,74,27,278.48,8047,276.48,279.82,False,2,43.7083207,-79.3905692
34_0_34C,8789,34,true,1585483135,74,27,278.48,8047,276.48,279.82,False,2,43.7083207,-79.3905692
34_0_34C,8789,34,true,1585483165,73,21,278.48,8047,276.48,279.82,False,2,43.7087651,-79.3883045
34_0_34C,8789,34,true,1585483198,74,0,278.48,8047,276.48,279.82,False,2,43.7088394,-79.3876647
34_0_34C,8789,34,true,1585483225,77,41,278.49,8047,276.48,279.82,False,2,43.7094848,-79.3847279
34_0_34C,8789,34,true,1585483255,74,0,278.49,8047,276.48,279.82,False,2,43.7099151,-79.3823394
34_0_34C,8789,34,true,1585483254,74,0,278.49,8047,276.48,279.82,False,2,43.7099151,-79.3823394
34_0_34C,8789,34,true,1585483285,74,33,278.49,8047,276.48,279.82,False,2,43.7103813,-79.3803421
34_0_34C,8789,34,true,1585483317,74,14,278.49,8047,276.48,279.82,False,2,43.7109362,-79.3775606
34_0_34C,8789,34,true,1585483318,74,14,278.49,8047,276.48,279.82,False,2,43.7109362,-79.3775606
34_0_34C,8789,34,true,1585483345,75,0,278.49,8047,276.48,279.82,False,2,43.7109633,-79.3774367
34_0_34C,8789,34,true,1585483375,73,44,278.5,8047,276.48,279.82,False,2,43.7116208,-79.3743132
34_0_34C,8789,34,true,1585483405,74,36,278.5,8047,276.48,279.82,False,2,43.7125451,-79.36955
34_0_34C,8789,34,true,1585483435,74,30,278.5,8047,276.48,279.82,False,2,43.7132735,-79.3659711
34_0_34C,8789,34,true,1585483464,75,0,278.51,8047,276.48,279.82,False,2,43.7135077,-79.3649408
34_0_34C,8789,34,true,1585483465,75,0,278.51,8047,276.48,279.82,False,2,43.7135077,-79.3649408
34_0_34C,8789,34,true,1585483495,76,42,278.51,8047,276.48,279.82,False,2,43.713983,-79.3623469
34_0_34C,8789,34,true,1585483525,75,26,278.51,8047,276.48,279.82,False,2,43.7145412,-79.3597634
34_0_34C,8789,34,true,1585483555,87,39,278.52,8047,276.48,279.82,False,2,43.7154701,-79.355689
34_0_34C,8789,34,true,1585483585,69,43,278.53,8047,276.48,279.82,False,2,43.7169494,-79.3503505
34_0_34C,8789,34,true,1585483615,67,47,278.53,8047,276.48,279.82,False,2,43.7180145,-79.3467782
34_0_34C,8789,34,true,1585483616,67,47,278.53,8047,276.48,279.82,False,2,43.7180145,-79.3467782
34_0_34C,8789,34,true,1585483645,71,42,278.54,8047,276.48,279.82,False,2,43.7193509,-79.3425223
34_0_34C,8789,34,true,1585483646,71,42,278.54,8047,276.48,279.82,False,2,43.7193509,-79.3425223
34_0_34C,8789,34,true,1585483675,66,22,278.54,8047,276.48,279.82,False,2,43.7209054,-79.3389952
34_0_34C,8789,34,true,1585483705,349,0,278.54,8047,276.48,279.82,False,2,43.7218195,-79.3391633
34_0_34C,8789,34,true,1585483735,148,13,278.54,8047,276.48,279.82,False,2,43.7210983,-79.3356716
34_0_34C,8789,34,true,1585483736,148,13,278.54,8047,276.48,279.82,False,2,43.7210983,-79.3356716
34_0_34C,8789,34,true,1585483825,66,0,278.54,8047,276.48,279.82,False,2,43.7204322,-79.3390502
34_0_34C,8789,34,true,1585483855,69,0,278.54,8047,276.48,279.82,False,2,43.7204322,-79.3390502
34_0_34C,8789,34,true,1585483856,69,0,278.54,8047,276.48,279.82,False,2,43.7204322,-79.3390502
34_0_34C,8789,34,true,1585483885,349,29,278.54,8047,276.48,279.82,False,2,43.721878,-79.3391952
34_0_34C,8789,34,true,1585483886,349,29,278.54,8047,276.48,279.82,False,2,43.721878,-79.3391952
34_0_34C,8789,34,true,1585483915,82,41,278.54,8047,276.48,279.82,False,2,43.7232704,-79.3376312
34_0_34C,8789,34,true,1585483945,31,41,278.6,8047,277.04,279.82,False,2,43.7248382,-79.3340682
34_0_34C,8789,34,true,1585483975,74,41,278.6,8047,277.04,279.82,False,2,43.7266616,-79.3308792
34_0_34C,8789,34,true,1585483976,74,41,278.6,8047,277.04,279.82,False,2,43.7266616,-79.3308792
34_0_34C,8789,34,true,1585484005,66,0,278.6,8047,277.04,279.82,False,2,43.7272796,-79.3280029
34_0_34C,8789,34,true,1585484006,66,0,278.6,8047,277.04,279.82,False,2,43.7272796,-79.3280029
34_0_34C,8789,34,true,1585484037,349,19,278.6,8047,277.04,279.82,False,2,43.7274513,-79.3278427
34_0_34C,8789,34,true,1585484038,349,19,278.6,8047,277.04,279.82,False,2,43.7274513,-79.3278427
34_0_34C,8789,34,true,1585484066,357,5,278.6,8047,277.04,279.82,False,2,43.7292022,-79.3283767
34_0_34C,8789,34,true,1585484065,357,5,278.6,8047,277.04,279.82,False,2,43.7292022,-79.3283767
34_0_34C,8789,34,true,1585484095,175,27,278.6,8047,277.04,279.82,False,2,43.7298507,-79.3284606
34_0_34C,8789,34,true,1585484125,153,11,278.6,8047,277.04,279.82,False,2,43.7276496,-79.3279418
34_0_34C,8789,34,true,1585484126,153,11,278.6,8047,277.04,279.82,False,2,43.7276496,-79.3279418
34_0_34C,8789,34,true,1585484155,154,20,278.6,8047,277.04,279.82,False,2,43.7274818,-79.3278579
34_0_34C,8789,34,true,1585484156,154,20,278.6,8047,277.04,279.82,False,2,43.7274818,-79.3278579
34_0_34C,8789,34,true,1585484185,144,33,278.6,8047,277.04,279.82,False,2,43.7250442,-79.3258819
34_0_34C,8789,34,true,1585484186,144,33,278.6,8047,277.04,279.82,False,2,43.7250442,-79.3258819
34_0_34C,8789,34,true,1585484215,251,37,278.6,8047,277.04,279.82,False,2,43.7228279,-79.3254699
34_0_34C,8789,34,true,1585484245,186,37,278.6,8047,277.04,279.82,False,2,43.7206573,-79.328125
34_0_34C,8789,34,true,1585484275,227,20,278.6,8047,277.04,279.82,False,2,43.7192192,-79.3279571
34_0_34C,8789,34,true,1585484276,227,20,278.6,8047,277.04,279.82,False,2,43.7192192,-79.3279571
34_0_34C,8789,34,true,1585484305,159,24,278.6,8047,277.04,279.82,False,2,43.7180137,-79.3312301
34_0_34C,8789,34,true,1585484306,159,24,278.6,8047,277.04,279.82,False,2,43.7180137,-79.3312301
34_0_34C,8789,34,true,1585484335,153,32,278.6,8047,277.04,279.82,False,2,43.7174272,-79.3309051
34_0_34C,8789,34,true,1585484336,153,32,278.6,8047,277.04,279.82,False,2,43.7174272,-79.3309051
34_0_34C,8789,34,true,1585484365,156,36,278.6,8047,277.04,279.82,False,2,43.7160367,-79.3301206
34_0_34C,8789,34,true,1585484396,132,19,278.6,8047,277.04,279.82,False,2,43.7154054,-79.3281054
34_0_34C,8789,34,true,1585484395,132,19,278.6,8047,277.04,279.82,False,2,43.7154054,-79.3281054
34_0_34C,8789,34,true,1585487036,284,9,278.47,8047,276.48,280.37,False,2,43.7050933,-79.3985671
34_0_34C,8789,34,true,1585487066,357,0,278.47,8047,276.48,280.37,False,2,43.7062149,-79.4001083
34_0_34C,8789,34,true,1585487096,74,12,278.47,8047,276.48,280.37,False,2,43.7066307,-79.3988265
34_0_34C,8789,34,true,1585487126,75,26,278.47,8047,276.48,280.37,False,2,43.706974,-79.3971862
34_0_34C,8789,34,true,1585487156,74,30,278.49,8047,276.48,280.37,False,2,43.7076263,-79.3938751
34_0_34C,8789,34,true,1585487186,74,0,278.49,8047,276.48,280.37,False,2,43.707756,-79.3929367
34_0_34C,8789,34,true,1585487187,74,0,278.49,8047,276.48,280.37,False,2,43.707756,-79.3929367
34_0_34C,8789,34,true,1585487216,74,22,278.49,8047,276.48,280.37,False,2,43.7082275,-79.3910138
34_0_34C,8789,34,true,1585487217,74,22,278.49,8047,276.48,280.37,False,2,43.7082275,-79.3910138
34_0_34C,8789,34,true,1585487246,74,23,278.49,8047,276.48,280.37,False,2,43.7087651,-79.3883045
34_0_34C,8789,34,true,1585487277,75,27,278.49,8047,276.48,280.37,False,2,43.709011,-79.3869491
34_0_34C,8789,34,true,1585487276,75,27,278.49,8047,276.48,280.37,False,2,43.709011,-79.3869491
34_0_34C,8789,34,true,1585487306,74,37,278.55,8047,276.48,280.37,False,2,43.7098388,-79.3829498
34_0_34C,8789,34,true,1585487307,74,37,278.55,8047,276.48,280.37,False,2,43.7098388,-79.3829498
34_0_34C,8789,34,true,1585487336,74,0,278.55,8047,276.48,280.37,False,2,43.7104454,-79.3797225
34_0_34C,8789,34,true,1585487366,75,21,278.55,8047,276.48,280.37,False,2,43.7107568,-79.378377
34_0_34C,8789,34,true,1585487367,75,21,278.55,8047,276.48,280.37,False,2,43.7107568,-79.378377
34_0_34C,8789,34,true,1585487397,73,18,278.55,8047,276.48,280.37,False,2,43.7110384,-79.3770106
34_0_34C,8789,34,true,1585487396,73,18,278.55,8047,276.48,280.37,False,2,43.7110384,-79.3770106
34_0_34C,8789,34,true,1585487426,74,37,278.56,8047,276.48,280.37,False,2,43.7118894,-79.3730739
34_0_34C,8789,34,true,1585487427,74,37,278.56,8047,276.48,280.37,False,2,43.7118894,-79.3730739
34_0_34C,8789,34,true,1585487457,74,3,278.56,8047,276.48,280.37,False,2,43.7124557,-79.3697586
34_0_34C,8789,34,true,1585487456,74,3,278.56,8047,276.48,280.37,False,2,43.7124557,-79.3697586
34_0_34C,8789,34,true,1585487486,73,37,278.56,8047,276.48,280.37,False,2,43.712778,-79.3684054
34_0_34C,8789,34,true,1585487516,74,0,278.56,8047,276.48,280.37,False,2,43.7133193,-79.3656856
34_0_34C,8789,34,true,1585487546,75,0,278.57,8047,276.48,280.37,False,2,43.7135077,-79.3649408
34_0_34C,8789,34,true,1585487576,75,1,278.57,8047,276.48,280.37,False,2,43.7135077,-79.3649408
34_0_34C,8789,34,true,1585487606,77,41,278.57,8047,276.48,280.37,False,2,43.7139798,-79.3623542
34_0_34C,8789,34,true,1585487637,67,0,278.57,8047,276.48,280.37,False,2,43.7145582,-79.359735
34_0_34C,8789,34,true,1585487636,67,0,278.57,8047,276.48,280.37,False,2,43.7145582,-79.359735
34_0_34C,8789,34,true,1585487666,67,0,278.57,8047,276.48,280.37,False,2,43.7145582,-79.359735
34_0_34C,8789,34,true,1585487696,75,41,278.58,8047,276.48,280.37,False,2,43.7152536,-79.3568531
34_0_34C,8789,34,true,1585487726,68,43,278.61,8047,276.48,280.37,False,2,43.716308,-79.3523344
34_0_34C,8789,34,true,1585487756,64,38,278.61,8047,276.48,280.37,False,2,43.7175179,-79.3484732
34_0_34C,8789,34,true,1585487757,64,38,278.61,8047,276.48,280.37,False,2,43.7175179,-79.3484732
34_0_34C,8789,34,true,1585487786,62,41,278.6,8047,277.04,280.37,False,2,43.7189597,-79.3437671
34_0_34C,8789,34,true,1585487787,62,41,278.6,8047,277.04,280.37,False,2,43.7189597,-79.3437671
34_0_34C,8789,34,true,1585487817,67,31,278.6,8047,277.04,280.37,False,2,43.7204082,-79.3391403
34_0_34C,8789,34,true,1585487816,67,31,278.6,8047,277.04,280.37,False,2,43.7204082,-79.3391403
34_0_34C,8789,34,true,1585487846,5,0,278.6,8047,277.04,280.37,False,2,43.7208336,-79.3389707
34_0_34C,8789,34,true,1585487847,5,0,278.6,8047,277.04,280.37,False,2,43.7208336,-79.3389707
34_0_34C,8789,34,true,1585487877,67,30,278.6,8047,277.04,280.37,False,2,43.7214787,-79.3389803
34_0_34C,8789,34,true,1585487876,67,30,278.6,8047,277.04,280.37,False,2,43.7214787,-79.3389803
34_0_34C,8789,34,true,1585487906,106,6,278.6,8047,277.04,280.37,False,2,43.7211783,-79.3357583
34_0_34C,8789,34,true,1585487907,106,6,278.6,8047,277.04,280.37,False,2,43.7211783,-79.3357583
34_0_34C,8789,34,true,1585488000,0,29,278.6,8047,277.04,280.37,False,2,43.7204322,-79.3390502
34_0_34C,8789,34,true,1585488026,69,0,278.6,8047,277.04,280.37,False,2,43.7204322,-79.3390502
34_0_34C,8789,34,true,1585488027,69,0,278.6,8047,277.04,280.37,False,2,43.7204322,-79.3390502
34_0_34C,8789,34,true,1585488056,69,0,278.6,8047,277.04,280.37,False,2,43.7204322,-79.3390502
34_0_34C,8789,34,true,1585488057,69,0,278.6,8047,277.04,280.37,False,2,43.7204322,-79.3390502
34_0_34C,8789,34,true,1585488086,349,0,278.6,8047,277.04,280.37,False,2,43.7217102,-79.3391036
34_0_34C,8789,34,true,1585488087,349,0,278.6,8047,277.04,280.37,False,2,43.7217102,-79.3391036
34_0_34C,8789,34,true,1585488116,348,10,278.6,8047,277.04,280.37,False,2,43.7225646,-79.3394699
34_0_34C,8789,34,true,1585488147,82,46,278.6,8047,277.04,280.37,False,2,43.7232704,-79.3376312
34_0_34C,8789,34,true,1585488146,82,46,278.6,8047,277.04,280.37,False,2,43.7232704,-79.3376312
34_0_34C,8789,34,true,1585488176,31,47,278.65,8047,277.04,280.37,False,2,43.7247161,-79.3341598
34_0_34C,8789,34,true,1585488206,73,39,278.67,8047,277.59,280.37,False,2,43.7269325,-79.3296737
34_0_34C,8789,34,true,1585488236,66,0,278.67,8047,277.59,280.37,False,2,43.7272796,-79.3280029
34_0_34C,8789,34,true,1585488266,338,0,278.67,8047,277.59,280.37,False,2,43.7281417,-79.3281631
34_0_34C,8789,34,true,1585488267,338,0,278.67,8047,277.59,280.37,False,2,43.7281417,-79.3281631
34_0_34C,8789,34,true,1585488296,357,1,278.67,8047,277.59,280.37,False,2,43.7290678,-79.3283653
34_0_34C,8789,34,true,1585488326,170,30,278.67,8047,277.59,280.37,False,2,43.7299222,-79.3284861
34_0_34C,8789,34,true,1585488327,170,30,278.67,8047,277.59,280.37,False,2,43.7299222,-79.3284861
34_0_34C,8789,34,true,1585488356,125,0,278.67,8047,277.59,280.37,False,2,43.7276973,-79.3279759
34_0_34C,8789,34,true,1585488357,125,0,278.67,8047,277.59,280.37,False,2,43.7276973,-79.3279759
34_0_34C,8789,34,true,1585488386,125,0,278.67,8047,277.59,280.37,False,2,43.7276973,-79.3279759
34_0_34C,8789,34,true,1585488387,125,0,278.67,8047,277.59,280.37,False,2,43.7276973,-79.3279759
34_0_34C,8789,34,true,1585488416,125,0,278.67,8047,277.59,280.37,False,2,43.7276973,-79.3279759
34_0_34C,8789,34,true,1585488417,125,0,278.67,8047,277.59,280.37,False,2,43.7276973,-79.3279759
34_0_34C,8789,34,true,1585488447,148,38,278.67,8047,277.59,280.37,False,2,43.7261363,-79.3273684
34_0_34C,8789,34,true,1585488446,148,38,278.67,8047,277.59,280.37,False,2,43.7261363,-79.3273684
34_0_34C,8789,34,true,1585488476,150,34,278.66,14484,277.04,280.37,False,2,43.7236747,-79.3247299
34_0_34C,8789,34,true,1585488477,150,34,278.66,14484,277.04,280.37,False,2,43.7236747,-79.3247299
34_0_34C,8789,34,true,1585488507,195,50,278.65,8047,277.04,280.37,False,2,43.7216124,-79.3278156
34_0_34C,8789,34,true,1585488506,195,50,278.65,8047,277.04,280.37,False,2,43.7216124,-79.3278156
34_0_34C,8789,34,true,1585488537,248,0,278.65,8047,277.04,280.37,False,2,43.7196197,-79.3279876
34_0_34C,8789,34,true,1585488536,248,0,278.65,8047,277.04,280.37,False,2,43.7196197,-79.3279876
34_0_34C,8789,34,true,1585488567,253,39,278.65,8047,277.04,280.37,False,2,43.7189722,-79.3288043
34_0_34C,8789,34,true,1585488566,253,39,278.65,8047,277.04,280.37,False,2,43.7189722,-79.3288043
34_0_34C,8789,34,true,1585488596,156,26,278.65,8047,277.04,280.37,False,2,43.7181412,-79.3312924
34_0_34C,8789,34,true,1585488626,157,39,278.65,8047,277.04,280.37,False,2,43.7160318,-79.3301174
34_0_34C,8789,34,true,1585488627,157,39,278.65,8047,277.04,280.37,False,2,43.7160318,-79.3301174
34_0_34C,8789,34,true,1585488656,150,23,278.65,8047,277.04,280.37,False,2,43.7154054,-79.3281054
34_0_34C,8789,34,true,1585488657,150,23,278.65,8047,277.04,280.37,False,2,43.7154054,-79.3281054
34_0_34C,8789,34,true,1585491268,70,21,278.73,9656,277.04,280.37,False,2,43.7064895,-79.3995513
34_0_34C,8789,34,true,1585491267,70,21,278.73,9656,277.04,280.37,False,2,43.7064895,-79.3995513
34_0_34C,8789,34,true,1585491297,74,27,278.73,9656,277.04,280.37,False,2,43.7071456,-79.39608
34_0_34C,8789,34,true,1585491298,74,27,278.73,9656,277.04,280.37,False,2,43.7071456,-79.39608
34_0_34C,8789,34,true,1585491327,78,26,278.79,9656,277.04,280.37,False,2,43.707695,-79.3933868
34_0_34C,8789,34,true,1585491357,74,0,278.79,9656,277.04,280.37,False,2,43.707756,-79.3929367
34_0_34C,8789,34,true,1585491358,74,0,278.79,9656,277.04,280.37,False,2,43.707756,-79.3929367
34_0_34C,8789,34,true,1585491387,73,23,278.79,9656,277.04,280.37,False,2,43.7082207,-79.3910471
34_0_34C,8789,34,true,1585491388,73,23,278.79,9656,277.04,280.37,False,2,43.7082207,-79.3910471
34_0_34C,8789,34,true,1585491417,72,15,278.79,9656,277.04,280.37,False,2,43.7086337,-79.3889371
34_0_34C,8789,34,true,1585491418,72,15,278.79,9656,277.04,280.37,False,2,43.7086337,-79.3889371
34_0_34C,8789,34,true,1585491447,73,31,278.79,9656,277.04,280.37,False,2,43.7091834,-79.3861059
34_0_34C,8789,34,true,1585491448,73,31,278.79,9656,277.04,280.37,False,2,43.7091834,-79.3861059
34_0_34C,8789,34,true,1585491478,74,35,278.77,9656,277.04,280.37,False,2,43.7100131,-79.3821101
34_0_34C,8789,34,true,1585491477,74,35,278.77,9656,277.04,280.37,False,2,43.7100131,-79.3821101
34_0_34C,8789,34,true,1585491507,74,0,278.77,9656,277.04,280.37,False,2,43.7104454,-79.3797225
34_0_34C,8789,34,true,1585491508,74,0,278.77,9656,277.04,280.37,False,2,43.7104454,-79.3797225
34_0_34C,8789,34,true,1585491537,74,9,278.77,9656,277.04,280.37,False,2,43.7108786,-79.3778323
34_0_34C,8789,34,true,1585491538,74,9,278.77,9656,277.04,280.37,False,2,43.7108786,-79.3778323
34_0_34C,8789,34,true,1585491567,72,43,278.8,9656,277.04,280.37,False,2,43.7116243,-79.3742989
34_0_34C,8789,34,true,1585491568,72,43,278.8,9656,277.04,280.37,False,2,43.7116243,-79.3742989
34_0_34C,8789,34,true,1585491598,74,43,278.8,9656,277.04,280.37,False,2,43.7125385,-79.3695653
34_0_34C,8789,34,true,1585491597,74,43,278.8,9656,277.04,280.37,False,2,43.7125385,-79.3695653
34_0_34C,8789,34,true,1585491628,71,29,278.8,9656,277.04,280.37,False,2,43.7134086,-79.3652537
34_0_34C,8789,34,true,1585491627,71,29,278.8,9656,277.04,280.37,False,2,43.7134086,-79.3652537
34_0_34C,8789,34,true,1585491657,75,0,278.81,9656,277.04,280.37,False,2,43.7135376,-79.3648205
34_0_34C,8789,34,true,1585491658,75,0,278.81,9656,277.04,280.37,False,2,43.7135376,-79.3648205
34_0_34C,8789,34,true,1585491688,74,44,278.81,9656,277.04,280.37,False,2,43.7138107,-79.3631829
34_0_34C,8789,34,true,1585491687,74,44,278.81,9656,277.04,280.37,False,2,43.7138107,-79.3631829
34_0_34C,8789,34,true,1585491717,74,40,278.81,9656,277.04,280.37,False,2,43.7145509,-79.3597472
34_0_34C,8789,34,true,1585491718,74,40,278.81,9656,277.04,280.37,False,2,43.7145509,-79.3597472
34_0_34C,8789,34,true,1585491747,82,41,278.85,9656,277.04,280.37,False,2,43.715682,-79.3546668
34_0_34C,8789,34,true,1585491748,82,41,278.85,9656,277.04,280.37,False,2,43.715682,-79.3546668
34_0_34C,8789,34,true,1585491778,70,33,278.85,9656,277.04,280.37,False,2,43.716938,-79.3503832
34_0_34C,8789,34,true,1585491777,70,33,278.85,9656,277.04,280.37,False,2,43.716938,-79.3503832
34_0_34C,8789,34,true,1585491808,67,45,278.85,9656,277.04,280.37,False,2,43.7179586,-79.3469626
34_0_34C,8789,34,true,1585491807,67,45,278.85,9656,277.04,280.37,False,2,43.7179586,-79.3469626
34_0_34C,8789,34,true,1585491837,70,42,278.86,9656,277.04,280.37,False,2,43.7192989,-79.3426957
34_0_34C,8789,34,true,1585491838,70,42,278.86,9656,277.04,280.37,False,2,43.7192989,-79.3426957
34_0_34C,8789,34,true,1585491867,67,19,278.86,9656,277.04,280.37,False,2,43.7205505,-79.3389892
34_0_34C,8789,34,true,1585491868,67,19,278.86,9656,277.04,280.37,False,2,43.7205505,-79.3389892
34_0_34C,8789,34,true,1585491897,5,0,278.86,9656,277.04,280.37,False,2,43.7208176,-79.3389659
34_0_34C,8789,34,true,1585491898,5,0,278.86,9656,277.04,280.37,False,2,43.7208176,-79.3389659
34_0_34C,8789,34,true,1585491928,5,0,278.86,9656,277.04,280.37,False,2,43.7208176,-79.3389659
34_0_34C,8789,34,true,1585491927,5,0,278.86,9656,277.04,280.37,False,2,43.7208176,-79.3389659
34_0_34C,8789,34,true,1585491958,66,37,278.86,9656,277.04,280.37,False,2,43.72104,-79.3364749
34_0_34C,8789,34,true,1585491957,66,37,278.86,9656,277.04,280.37,False,2,43.72104,-79.3364749
34_0_34C,8789,34,true,1585492048,359,30,278.86,9656,277.04,280.37,False,2,43.7204322,-79.3390502
34_0_34C,8789,34,true,1585492047,359,30,278.86,9656,277.04,280.37,False,2,43.7204322,-79.3390502
34_0_34C,8789,34,true,1585492077,69,0,278.86,9656,277.04,280.37,False,2,43.7204322,-79.3390502
34_0_34C,8789,34,true,1585492078,69,0,278.86,9656,277.04,280.37,False,2,43.7204322,-79.3390502
34_0_34C,8789,34,true,1585492107,69,0,278.86,9656,277.04,280.37,False,2,43.7204322,-79.3390502
34_0_34C,8789,34,true,1585492108,69,0,278.86,9656,277.04,280.37,False,2,43.7204322,-79.3390502
34_0_34C,8789,34,true,1585492137,344,32,278.86,9656,277.04,280.37,False,2,43.7210197,-79.339035
34_0_34C,8789,34,true,1585492138,344,32,278.86,9656,277.04,280.37,False,2,43.7210197,-79.339035
34_0_34C,8789,34,true,1585492168,77,28,278.86,9656,277.04,280.37,False,2,43.7231178,-79.3388671
34_0_34C,8789,34,true,1585492167,77,28,278.86,9656,277.04,280.37,False,2,43.7231178,-79.3388671
34_0_34C,8789,34,true,1585492198,77,0,278.86,9656,277.04,280.37,False,2,43.7233886,-79.3367614
34_0_34C,8789,34,true,1585492197,77,0,278.86,9656,277.04,280.37,False,2,43.7233886,-79.3367614
34_0_34C,8789,34,true,1585492228,77,1,278.94,14484,277.04,280.93,False,2,43.7233886,-79.3367614
34_0_34C,8789,34,true,1585492227,77,1,278.94,14484,277.04,280.93,False,2,43.7233886,-79.3367614
34_0_34C,8789,34,true,1585492258,32,42,278.98,14484,277.59,280.93,False,2,43.7254486,-79.3335647
34_0_34C,8789,34,true,1585492257,32,42,278.98,14484,277.59,280.93,False,2,43.7254486,-79.3335647
34_0_34C,8789,34,true,1585492287,75,23,278.98,14484,277.59,280.93,False,2,43.7266616,-79.3308792
34_0_34C,8789,34,true,1585492288,75,23,278.98,14484,277.59,280.93,False,2,43.7266616,-79.3308792
34_0_34C,8789,34,true,1585492318,73,4,278.98,14484,277.59,280.93,False,2,43.7272796,-79.3280029
34_0_34C,8789,34,true,1585492317,73,4,278.98,14484,277.59,280.93,False,2,43.7272796,-79.3280029
34_0_34C,8789,34,true,1585492348,330,31,278.98,14484,277.59,280.93,False,2,43.7278442,-79.3280868
34_0_34C,8789,34,true,1585492347,330,31,278.98,14484,277.59,280.93,False,2,43.7278442,-79.3280868
34_0_34C,8789,34,true,1585492378,257,12,278.98,14484,277.59,280.93,False,2,43.7302818,-79.3284606
34_0_34C,8789,34,true,1585492377,257,12,278.98,14484,277.59,280.93,False,2,43.7302818,-79.3284606
34_0_34C,8789,34,true,1585492408,171,36,278.98,14484,277.59,280.93,False,2,43.7283554,-79.3283081
34_0_34C,8789,34,true,1585492407,171,36,278.98,14484,277.59,280.93,False,2,43.7283554,-79.3283081
34_0_34C,8789,34,true,1585492438,125,0,278.98,14484,277.59,280.93,False,2,43.7274818,-79.3278579
34_0_34C,8789,34,true,1585492437,125,0,278.98,14484,277.59,280.93,False,2,43.7274818,-79.3278579
34_0_34C,8789,34,true,1585492468,142,40,278.98,14484,277.59,280.93,False,2,43.7250442,-79.3258819
34_0_34C,8789,34,true,1585492467,142,40,278.98,14484,277.59,280.93,False,2,43.7250442,-79.3258819
34_0_34C,8789,34,true,1585492498,250,39,278.88,9656,277.04,280.37,False,2,43.7228279,-79.3254699
34_0_34C,8789,34,true,1585492497,250,39,278.88,9656,277.04,280.37,False,2,43.7228279,-79.3254699
34_0_34C,8789,34,true,1585492528,173,40,278.88,9656,277.04,280.37,False,2,43.7204017,-79.3281326
34_0_34C,8789,34,true,1585492527,173,40,278.88,9656,277.04,280.37,False,2,43.7204017,-79.3281326
34_0_34C,8789,34,true,1585492558,255,38,278.88,9656,277.04,280.37,False,2,43.7189369,-79.3289871
34_0_34C,8789,34,true,1585492588,161,24,279.04,14484,277.59,280.93,False,2,43.7180137,-79.3312301
34_0_34C,8789,34,true,1585492587,161,24,279.04,14484,277.59,280.93,False,2,43.7180137,-79.3312301
34_0_34C,8789,34,true,1585492618,156,33,279.04,14484,277.59,280.93,False,2,43.7157974,-79.3299636
34_0_34C,8789,34,true,1585492617,156,33,279.04,14484,277.59,280.93,False,2,43.7157974,-79.3299636
34_0_34C,8789,34,true,1585492648,79,0,279.04,14484,277.59,280.93,False,2,43.715496,-79.3282318
34_0_34C,8789,34,true,1585492647,79,0,279.04,14484,277.59,280.93,False,2,43.715496,-79.3282318
34_0_34C,8789,34,true,1585495468,275,21,279.32,12874,278.15,280.93,False,2,43.7050933,-79.3985671
34_0_34C,8789,34,true,1585495469,275,21,279.32,12874,278.15,280.93,False,2,43.7050933,-79.3985671
34_0_34C,8789,34,true,1585495499,357,0,279.32,12874,278.15,280.93,False,2,43.7058563,-79.4000854
34_0_34C,8789,34,true,1585495498,357,0,279.32,12874,278.15,280.93,False,2,43.7058563,-79.4000854
34_0_34C,8789,34,true,1585495529,70,21,279.32,12874,278.15,280.93,False,2,43.7064895,-79.3995513
34_0_34C,8789,34,true,1585495528,70,21,279.32,12874,278.15,280.93,False,2,43.7064895,-79.3995513
34_0_34C,8789,34,true,1585495559,75,20,279.32,12874,278.15,280.93,False,2,43.7070236,-79.3969497
34_0_34C,8789,34,true,1585495558,75,20,279.32,12874,278.15,280.93,False,2,43.7070236,-79.3969497
34_0_34C,8789,34,true,1585495589,74,23,279.32,12874,278.15,280.93,False,2,43.7075958,-79.3941192
34_0_34C,8789,34,true,1585495588,74,23,279.32,12874,278.15,280.93,False,2,43.7075958,-79.3941192
34_0_34C,8789,34,true,1585495619,74,0,279.32,12874,278.15,280.93,False,2,43.707695,-79.3933868
34_0_34C,8789,34,true,1585495618,74,0,279.32,12874,278.15,280.93,False,2,43.707695,-79.3933868
34_0_34C,8789,34,true,1585495648,72,18,279.32,12874,278.15,280.93,False,2,43.7079544,-79.3923263
34_0_34C,8789,34,true,1585495649,72,18,279.32,12874,278.15,280.93,False,2,43.7079544,-79.3923263
34_0_34C,8789,34,true,1585495679,76,2,279.32,12874,278.15,280.93,False,2,43.708229,-79.3910064
34_0_34C,8789,34,true,1585495678,76,2,279.32,12874,278.15,280.93,False,2,43.708229,-79.3910064
34_0_34C,8789,34,true,1585495709,76,6,279.69,9656,278.15,284.26,False,2,43.708229,-79.3910064
34_0_34C,8789,34,true,1585495739,71,20,279.69,9656,278.15,284.26,False,2,43.7086257,-79.388977
34_0_34C,8789,34,true,1585495769,74,0,279.69,9656,278.15,284.26,False,2,43.7088394,-79.3876647
34_0_34C,8789,34,true,1585495768,74,0,279.69,9656,278.15,284.26,False,2,43.7088394,-79.3876647
34_0_34C,8789,34,true,1585495798,75,42,279.65,12874,278.15,284.26,False,2,43.7094848,-79.3847279
34_0_34C,8789,34,true,1585495799,75,42,279.65,12874,278.15,284.26,False,2,43.7094848,-79.3847279
34_0_34C,8789,34,true,1585495829,74,0,279.65,12874,278.15,284.26,False,2,43.7099151,-79.3823394
34_0_34C,8789,34,true,1585495859,74,35,279.65,12874,278.15,284.26,False,2,43.7103851,-79.3803233
34_0_34C,8789,34,true,1585495889,75,0,279.65,12874,278.15,284.26,False,2,43.7104729,-79.3796254
34_0_34C,8789,34,true,1585495888,75,0,279.65,12874,278.15,284.26,False,2,43.7104729,-79.3796254
34_0_34C,8789,34,true,1585495918,74,19,279.65,12874,278.15,284.26,False,2,43.7108936,-79.3777606
34_0_34C,8789,34,true,1585495919,74,19,279.65,12874,278.15,284.26,False,2,43.7108936,-79.3777606
34_0_34C,8789,34,true,1585495949,75,0,279.65,12874,278.15,284.26,False,2,43.7109485,-79.3775043
34_0_34C,8789,34,true,1585495948,75,0,279.65,12874,278.15,284.26,False,2,43.7109485,-79.3775043
34_0_34C,8789,34,true,1585495979,74,40,279.65,12874,278.15,284.26,False,2,43.7112334,-79.3758759
34_0_34C,8789,34,true,1585496009,74,41,279.64,9656,278.15,283.15,False,2,43.7123336,-79.3703613
34_0_34C,8789,34,true,1585496039,72,28,279.64,9656,278.15,283.15,False,2,43.7132729,-79.3659748
34_0_34C,8789,34,true,1585496069,75,0,279.64,9656,278.15,283.15,False,2,43.7133767,-79.3653543
34_0_34C,8789,34,true,1585496099,74,27,279.71,9656,278.15,284.26,False,2,43.7136177,-79.3644108
34_0_34C,8789,34,true,1585496098,74,27,279.71,9656,278.15,284.26,False,2,43.7136177,-79.3644108
34_0_34C,8789,34,true,1585496129,77,20,279.71,9656,278.15,284.26,False,2,43.7143543,-79.3605268
34_0_34C,8789,34,true,1585496128,77,20,279.71,9656,278.15,284.26,False,2,43.7143543,-79.3605268
34_0_34C,8789,34,true,1585496158,74,0,279.71,9656,278.15,284.26,False,2,43.7144584,-79.3599014
34_0_34C,8789,34,true,1585496159,74,0,279.71,9656,278.15,284.26,False,2,43.7144584,-79.3599014
34_0_34C,8789,34,true,1585496189,68,32,279.71,9656,278.15,284.26,False,2,43.7148503,-79.3587085
34_0_34C,8789,34,true,1585496188,68,32,279.71,9656,278.15,284.26,False,2,43.7148503,-79.3587085
34_0_34C,8789,34,true,1585496218,90,36,279.71,9656,278.15,284.26,False,2,43.7156108,-79.3549684
34_0_34C,8789,34,true,1585496219,90,36,279.71,9656,278.15,284.26,False,2,43.7156108,-79.3549684
34_0_34C,8789,34,true,1585496249,68,32,279.57,9656,278.15,280.93,False,2,43.7166822,-79.3511023
34_0_34C,8789,34,true,1585496279,66,35,279.57,9656,278.15,280.93,False,2,43.7178689,-79.3472501
34_0_34C,8789,34,true,1585496278,66,35,279.57,9656,278.15,280.93,False,2,43.7178689,-79.3472501
34_0_34C,8789,34,true,1585496309,63,35,279.74,9656,278.15,283.15,False,2,43.7189051,-79.3439393
34_0_34C,8789,34,true,1585496339,67,29,279.74,9656,278.15,283.15,False,2,43.7200334,-79.3403306
34_0_34C,8789,34,true,1585496338,67,29,279.74,9656,278.15,283.15,False,2,43.7200334,-79.3403306
34_0_34C,8789,34,true,1585496369,66,5,279.74,9656,278.15,283.15,False,2,43.7205738,-79.3389757
34_0_34C,8789,34,true,1585496399,5,0,279.74,9656,278.15,283.15,False,2,43.7206204,-79.3389486
34_0_34C,8789,34,true,1585496429,65,31,279.64,9656,278.15,281.48,False,2,43.7217788,-79.3391411
34_0_34C,8789,34,true,1585496459,189,30,279.64,9656,278.15,281.48,False,2,43.7206866,-79.3357416
34_0_34C,8789,34,true,1585496550,353,8,279.64,9656,278.15,281.48,False,2,43.7204322,-79.3390502
34_0_34C,8789,34,true,1585496551,353,8,279.64,9656,278.15,281.48,False,2,43.7204322,-79.3390502
34_0_34C,8789,34,true,1585496579,69,0,279.64,9656,278.15,281.48,False,2,43.7204322,-79.3390502
34_0_34C,8789,34,true,1585496609,343,23,279.64,9656,278.15,281.48,False,2,43.7204322,-79.3390502
34_0_34C,8789,34,true,1585496639,348,27,279.64,9656,278.15,281.48,False,2,43.7227401,-79.3395233
34_0_34C,8789,34,true,1585496669,78,37,279.64,9656,278.15,281.48,False,2,43.7233924,-79.3370132
34_0_34C,8789,34,true,1585496699,30,39,279.67,9656,278.15,281.48,False,2,43.7247161,-79.3341598
34_0_34C,8789,34,true,1585496729,74,20,279.64,9656,278.15,281.48,False,2,43.7266616,-79.3308792
34_0_34C,8789,34,true,1585496759,74,4,279.64,9656,278.15,281.48,False,2,43.7272796,-79.3280029
34_0_34C,8789,34,true,1585496790,66,0,279.64,9656,278.15,281.48,False,2,43.7272796,-79.3280029
34_0_34C,8789,34,true,1585496789,66,0,279.64,9656,278.15,281.48,False,2,43.7272796,-79.3280029
34_0_34C,8789,34,true,1585496819,328,28,279.64,9656,278.15,281.48,False,2,43.7277565,-79.3280181
34_0_34C,8789,34,true,1585499323,173,0,280.58,14484,278.71,286.15,False,2,43.7050933,-79.3985671
34_0_34C,8789,34,true,1585499863,4,16,280.7,14484,278.71,282.04,False,0,43.7058563,-79.4000854
34_0_34C,8789,34,true,1585499862,4,16,280.7,14484,278.71,282.04,False,0,43.7058563,-79.4000854
34_0_34C,8789,34,true,1585499893,349,2,280.7,14484,278.71,282.04,False,0,43.7062327,-79.4001045
34_0_34C,8789,34,true,1585499892,349,2,280.7,14484,278.71,282.04,False,0,43.7062327,-79.4001045
34_0_34C,8789,34,true,1585499923,76,6,280.7,14484,278.71,282.04,False,0,43.7066622,-79.398676
34_0_34C,8789,34,true,1585499922,76,6,280.7,14484,278.71,282.04,False,0,43.7066622,-79.398676
34_0_34C,8789,34,true,1585499952,78,26,280.7,14484,278.71,282.04,False,0,43.7067912,-79.3980403
34_0_34C,8789,34,true,1585499953,78,26,280.7,14484,278.71,282.04,False,0,43.7067912,-79.3980403
34_0_34C,8789,34,true,1585499983,72,31,280.7,14484,278.71,282.04,False,0,43.7072777,-79.3954479
34_0_34C,8789,34,true,1585499982,72,31,280.7,14484,278.71,282.04,False,0,43.7072777,-79.3954479
34_0_34C,8789,34,true,1585500013,75,29,280.91,14484,280.15,281.48,False,0,43.7081169,-79.3915463
34_0_34C,8789,34,true,1585500012,75,29,280.91,14484,280.15,281.48,False,0,43.7081169,-79.3915463
34_0_34C,8789,34,true,1585500042,73,17,280.91,14484,280.15,281.48,False,0,43.7084471,-79.3899422
34_0_34C,8789,34,true,1585500043,73,17,280.91,14484,280.15,281.48,False,0,43.7084471,-79.3899422
34_0_34C,8789,34,true,1585500073,74,35,280.91,14484,280.15,281.48,False,0,43.7090128,-79.3869378
34_0_34C,8789,34,true,1585500072,74,35,280.91,14484,280.15,281.48,False,0,43.7090128,-79.3869378
34_0_34C,8789,34,true,1585500103,74,39,280.88,14484,280.15,281.48,False,0,43.7098407,-79.382935
34_0_34C,8789,34,true,1585500132,75,0,281,14484,280.15,282.04,False,0,43.7105213,-79.3794555
34_0_34C,8789,34,true,1585500133,75,0,281,14484,280.15,282.04,False,0,43.7105213,-79.3794555
34_0_34C,8789,34,true,1585500162,75,28,281,14484,280.15,282.04,False,0,43.7108846,-79.3778036
34_0_34C,8789,34,true,1585500163,75,28,281,14484,280.15,282.04,False,0,43.7108846,-79.3778036
34_0_34C,8789,34,true,1585500192,75,0,281,14484,280.15,282.04,False,0,43.7110332,-79.3770439
34_0_34C,8789,34,true,1585500193,75,0,281,14484,280.15,282.04,False,0,43.7110332,-79.3770439
34_0_34C,8789,34,true,1585500223,75,0,281,14484,280.15,282.04,False,0,43.7110332,-79.3770439
34_0_34C,8789,34,true,1585500222,75,0,281,14484,280.15,282.04,False,0,43.7110332,-79.3770439
34_0_34C,8789,34,true,1585500252,72,4,281,14484,280.15,282.04,False,0,43.7110395,-79.3770032
34_0_34C,8789,34,true,1585500253,72,4,281,14484,280.15,282.04,False,0,43.7110395,-79.3770032
34_0_34C,8789,34,true,1585500283,74,41,281.01,14484,280.15,282.04,False,0,43.7120816,-79.3720904
34_0_34C,8789,34,true,1585500282,74,41,281.01,14484,280.15,282.04,False,0,43.7120816,-79.3720904
34_0_34C,8789,34,true,1585500312,73,39,281.01,14484,280.15,282.04,False,0,43.7128613,-79.3679208
34_0_34C,8789,34,true,1585500313,73,39,281.01,14484,280.15,282.04,False,0,43.7128613,-79.3679208
34_0_34C,8789,34,true,1585500342,75,1,281.01,14484,280.15,282.04,False,0,43.7135784,-79.3646337
34_0_34C,8789,34,true,1585500343,75,1,281.01,14484,280.15,282.04,False,0,43.7135784,-79.3646337
34_0_34C,8789,34,true,1585500373,75,0,281.01,14484,280.15,282.04,False,0,43.7135784,-79.3646337
34_0_34C,8789,34,true,1585500372,75,0,281.01,14484,280.15,282.04,False,0,43.7135784,-79.3646337
34_0_34C,8789,34,true,1585500403,74,42,281.01,14484,280.15,282.04,False,0,43.7139798,-79.3623542
34_0_34C,8789,34,true,1585500402,74,42,281.01,14484,280.15,282.04,False,0,43.7139798,-79.3623542
34_0_34C,8789,34,true,1585500433,69,44,281.01,14484,280.15,282.04,False,0,43.7149696,-79.3582305
34_0_34C,8789,34,true,1585500432,69,44,281.01,14484,280.15,282.04,False,0,43.7149696,-79.3582305
34_0_34C,8789,34,true,1585500463,72,41,280.99,14484,280.15,282.04,False,0,43.7158772,-79.3538693
34_0_34C,8789,34,true,1585500462,72,41,280.99,14484,280.15,282.04,False,0,43.7158772,-79.3538693
34_0_34C,8789,34,true,1585500492,63,46,281.3,14484,280.15,282.59,False,0,43.7176208,-79.3481369
34_0_34C,8789,34,true,1585500493,63,46,281.3,14484,280.15,282.59,False,0,43.7176208,-79.3481369
34_0_34C,8789,34,true,1585500522,63,45,281.01,14484,280.15,282.04,False,0,43.719189,-79.3430697
34_0_34C,8789,34,true,1585500523,63,45,281.01,14484,280.15,282.04,False,0,43.719189,-79.3430697
34_0_34C,8789,34,true,1585500552,67,32,281.01,14484,280.15,282.04,False,0,43.720606,-79.338957
34_0_34C,8789,34,true,1585500553,67,32,281.01,14484,280.15,282.04,False,0,43.720606,-79.338957
34_0_34C,8789,34,true,1585500583,5,0,281.01,14484,280.15,282.04,False,0,43.7210516,-79.3390253
34_0_34C,8789,34,true,1585500613,66,8,281.01,14484,280.15,282.04,False,0,43.7211074,-79.3390083
34_0_34C,8789,34,true,1585500612,66,8,281.01,14484,280.15,282.04,False,0,43.7211074,-79.3390083
34_0_34C,8789,34,true,1585500643,100,13,281.01,14484,280.15,282.04,False,0,43.7211816,-79.335825
34_0_34C,8789,34,true,1585500642,100,13,281.01,14484,280.15,282.04,False,0,43.7211816,-79.335825
34_0_34C,8789,34,true,1585500763,66,0,281.4,14484,280.15,282.59,False,0,43.7204322,-79.3390502
34_0_34C,8789,34,true,1585500762,66,0,281.4,14484,280.15,282.59,False,0,43.7204322,-79.3390502
34_0_34C,8789,34,true,1585500792,69,0,281.4,14484,280.15,282.59,False,0,43.7204322,-79.3390502
34_0_34C,8789,34,true,1585500793,69,0,281.4,14484,280.15,282.59,False,0,43.7204322,-79.3390502
34_0_34C,8789,34,true,1585500822,344,35,281.4,14484,280.15,282.59,False,0,43.7210197,-79.339035
34_0_34C,8789,34,true,1585500823,344,35,281.4,14484,280.15,282.59,False,0,43.7210197,-79.339035
34_0_34C,8789,34,true,1585500853,349,3,281.4,14484,280.15,282.59,False,0,43.7229576,-79.3394241
34_0_34C,8789,34,true,1585500852,349,3,281.4,14484,280.15,282.59,False,0,43.7229576,-79.3394241
34_0_34C,8789,34,true,1585500883,79,0,281.4,14484,280.15,282.59,False,0,43.7230834,-79.3391113
34_0_34C,8789,34,true,1585500882,79,0,281.4,14484,280.15,282.59,False,0,43.7230834,-79.3391113
34_0_34C,8789,34,true,1585500913,79,0,281.4,14484,280.15,282.59,False,0,43.7230834,-79.3391113
34_0_34C,8789,34,true,1585500912,79,0,281.4,14484,280.15,282.59,False,0,43.7230834,-79.3391113
34_0_34C,8789,34,true,1585500943,79,0,281.4,14484,280.15,282.59,False,0,43.7230834,-79.3391113
34_0_34C,8789,34,true,1585500942,79,0,281.4,14484,280.15,282.59,False,0,43.7230834,-79.3391113
34_0_34C,8789,34,true,1585500972,79,0,281.4,14484,280.15,282.59,False,0,43.7230834,-79.3391113
34_0_34C,8789,34,true,1585500973,79,0,281.4,14484,280.15,282.59,False,0,43.7230834,-79.3391113
34_0_34C,8789,34,true,1585501003,79,0,281.4,14484,280.15,282.59,False,0,43.7230834,-79.3391113
34_0_34C,8789,34,true,1585501002,79,0,281.4,14484,280.15,282.59,False,0,43.7230834,-79.3391113
34_0_34C,8789,34,true,1585501033,82,32,281.4,14484,280.15,282.59,False,0,43.7232704,-79.3376312
34_0_34C,8789,34,true,1585501032,82,32,281.4,14484,280.15,282.59,False,0,43.7232704,-79.3376312
34_0_34C,8789,34,true,1585501063,50,37,281.4,14484,280.15,282.59,False,0,43.7239418,-79.3349609
34_0_34C,8789,34,true,1585501062,50,37,281.4,14484,280.15,282.59,False,0,43.7239418,-79.3349609
34_0_34C,8789,34,true,1585501093,71,38,281.47,14484,280.15,282.59,False,0,43.7264404,-79.331871
34_0_34C,8789,34,true,1585501092,71,38,281.47,14484,280.15,282.59,False,0,43.7264404,-79.331871
34_0_34C,8789,34,true,1585501123,73,41,281.47,14484,280.15,282.59,False,0,43.7269477,-79.3296127
34_0_34C,8789,34,true,1585501153,0,32,281.47,14484,280.15,282.59,False,0,43.7284851,-79.3283157
34_0_34C,8789,34,true,1585501182,1,14,281.47,14484,280.15,282.59,False,0,43.7301902,-79.3283843
34_0_34C,8789,34,true,1585501183,1,14,281.47,14484,280.15,282.59,False,0,43.7301902,-79.3283843
34_0_34C,8789,34,true,1585501213,179,15,281.47,14484,280.15,282.59,False,0,43.7295417,-79.3283996
34_0_34C,8789,34,true,1585501243,141,38,281.47,14484,280.15,282.59,False,0,43.7259254,-79.3271179
34_0_34C,8789,34,true,1585501273,134,17,281.47,14484,280.15,282.59,False,0,43.7253608,-79.3262252
34_0_34C,8789,34,true,1585501303,171,30,281.47,14484,280.15,282.59,False,0,43.7234344,-79.3245544
34_0_34C,8789,34,true,1585501333,206,40,281.4,14484,280.15,282.59,False,0,43.7218475,-79.3276977
34_0_34C,8789,34,true,1585501332,206,40,281.4,14484,280.15,282.59,False,0,43.7218475,-79.3276977
34_0_34C,8789,34,true,1585501363,225,20,281.4,14484,280.15,282.59,False,0,43.7192192,-79.3279571
34_0_34C,8789,34,true,1585501393,249,22,281.4,14484,280.15,282.59,False,0,43.7185287,-79.3308563
34_0_34C,8789,34,true,1585501392,249,22,281.4,14484,280.15,282.59,False,0,43.7185287,-79.3308563
34_0_34C,8789,34,true,1585501423,156,9,281.4,14484,280.15,282.59,False,0,43.7167282,-79.3304672
34_0_34C,8789,34,true,1585501453,89,24,281.4,14484,280.15,282.59,False,0,43.7153244,-79.3292846
34_0_34C,8789,34,true,1585501483,158,34,281.83,14484,280.37,282.59,False,2,43.7143745,-79.3273849
34_0_34C,8789,34,true,1585503433,173,0,282.02,14484,280.15,283.71,False,0,43.7047616,-79.4007416
34_0_34C,8789,34,true,1585504154,358,14,283,14484,281.48,283.71,False,0,43.7058563,-79.4000854
34_0_34C,8789,34,true,1585504153,358,14,283,14484,281.48,283.71,False,0,43.7058563,-79.4000854
34_0_34C,8789,34,true,1585504186,71,22,283,14484,281.48,283.71,False,0,43.7064895,-79.3995513
34_0_34C,8789,34,true,1585504214,74,18,283,14484,281.48,283.71,False,0,43.706726,-79.3983535
34_0_34C,8789,34,true,1585504243,74,23,283,14484,281.48,283.71,False,0,43.7071456,-79.39608
34_0_34C,8789,34,true,1585504244,74,23,283,14484,281.48,283.71,False,0,43.7071456,-79.39608
34_0_34C,8789,34,true,1585504274,77,19,283.06,14484,280.93,283.71,False,0,43.707695,-79.3933868
34_0_34C,8789,34,true,1585504273,77,19,283.06,14484,280.93,283.71,False,0,43.707695,-79.3933868
34_0_34C,8789,34,true,1585504304,74,0,283.06,14484,280.93,283.71,False,0,43.7077255,-79.3931427
34_0_34C,8789,34,true,1585504333,74,12,283.06,14484,280.93,283.71,False,0,43.7080535,-79.3918533
34_0_34C,8789,34,true,1585504334,74,12,283.06,14484,280.93,283.71,False,0,43.7080535,-79.3918533
34_0_34C,8789,34,true,1585504364,74,0,283.06,14484,280.93,283.71,False,0,43.7081298,-79.3914871
34_0_34C,8789,34,true,1585504394,73,14,283.06,14484,280.93,283.71,False,0,43.708538,-79.3894577
34_0_34C,8789,34,true,1585504393,73,14,283.06,14484,280.93,283.71,False,0,43.708538,-79.3894577
34_0_34C,8789,34,true,1585504424,74,13,283.06,14484,280.93,283.71,False,0,43.7087974,-79.3881454
34_0_34C,8789,34,true,1585504457,73,30,283.06,14484,280.93,283.71,False,0,43.7089576,-79.3872833
34_0_34C,8789,34,true,1585504456,73,30,283.06,14484,280.93,283.71,False,0,43.7089576,-79.3872833
34_0_34C,8789,34,true,1585504484,74,39,283,14484,281.48,283.71,False,0,43.7097312,-79.3835793
34_0_34C,8789,34,true,1585504483,74,39,283,14484,281.48,283.71,False,0,43.7097312,-79.3835793
34_0_34C,8789,34,true,1585504514,75,31,283,14484,281.48,283.71,False,0,43.7103828,-79.3803345
34_0_34C,8789,34,true,1585504544,74,6,283,14484,281.48,283.71,False,0,43.7107804,-79.3782695
34_0_34C,8789,34,true,1585504543,74,6,283,14484,281.48,283.71,False,0,43.7107804,-79.3782695
34_0_34C,8789,34,true,1585504574,74,32,283,14484,281.48,283.71,False,0,43.7112456,-79.3758274
34_0_34C,8789,34,true,1585504604,74,41,283.01,14484,281.48,283.71,False,0,43.7121249,-79.3714114
34_0_34C,8789,34,true,1585504603,74,41,283.01,14484,281.48,283.71,False,0,43.7121249,-79.3714114
34_0_34C,8789,34,true,1585504634,74,40,283.01,14484,281.48,283.71,False,0,43.7130455,-79.3671257
34_0_34C,8789,34,true,1585504664,74,0,282.99,14484,280.93,283.71,False,0,43.7133734,-79.3653647
34_0_34C,8789,34,true,1585504663,74,0,282.99,14484,280.93,283.71,False,0,43.7133734,-79.3653647
34_0_34C,8789,34,true,1585504694,75,25,283.06,14484,280.93,283.71,False,0,43.7136079,-79.3644737
34_0_34C,8789,34,true,1585504693,75,25,283.06,14484,280.93,283.71,False,0,43.7136079,-79.3644737
34_0_34C,8789,34,true,1585504724,74,30,283.06,14484,280.93,283.71,False,0,43.714258,-79.361111
34_0_34C,8789,34,true,1585504754,74,0,283.06,14484,280.93,283.71,False,0,43.7144584,-79.3599014
34_0_34C,8789,34,true,1585504784,74,0,283.06,14484,280.93,283.71,False,0,43.7144584,-79.3599014
34_0_34C,8789,34,true,1585504814,63,32,283.06,14484,280.93,283.71,False,0,43.7150413,-79.357942
34_0_34C,8789,34,true,1585504844,74,36,283.08,14484,280.93,284.26,False,2,43.7157824,-79.3542391
34_0_34C,8789,34,true,1585504874,70,30,283.08,14484,280.93,284.26,False,2,43.716698,-79.3510587
34_0_34C,8789,34,true,1585504904,63,35,283.08,14484,280.93,284.26,False,2,43.7174854,-79.3485877
34_0_34C,8789,34,true,1585504934,66,31,282.99,14484,280.93,283.71,False,0,43.7187119,-79.3445392
34_0_34C,8789,34,true,1585504964,67,43,282.99,14484,280.93,283.71,False,0,43.7199185,-79.3406706
34_0_34C,8789,34,true,1585504994,66,38,282.99,14484,280.93,283.71,False,0,43.7217381,-79.3391189
34_0_34C,8789,34,true,1585504993,66,38,282.99,14484,280.93,283.71,False,0,43.7217381,-79.3391189
34_0_34C,8789,34,true,1585505024,180,30,282.99,14484,280.93,283.71,False,0,43.7206166,-79.335725
34_0_34C,8789,34,true,1585505114,66,0,282.99,14484,280.93,283.71,False,0,43.7204322,-79.3390502
34_0_34C,8789,34,true,1585505144,69,0,282.99,14484,280.93,283.71,False,0,43.7204322,-79.3390502
34_0_34C,8789,34,true,1585505174,349,27,282.99,14484,280.93,283.71,False,0,43.7227401,-79.3395233
34_0_34C,8789,34,true,1585505204,78,35,282.99,14484,280.93,283.71,False,0,43.7233581,-79.3372573
34_0_34C,8789,34,true,1585505235,31,41,283.18,14484,280.93,284.26,False,2,43.7254486,-79.3335647
34_0_34C,8789,34,true,1585505234,31,41,283.18,14484,280.93,284.26,False,2,43.7254486,-79.3335647
34_0_34C,8789,34,true,1585505264,73,38,283.18,14484,280.93,284.26,False,2,43.7269325,-79.3296737
34_0_34C,8789,34,true,1585505265,73,38,283.18,14484,280.93,284.26,False,2,43.7269325,-79.3296737
34_0_34C,8789,34,true,1585505294,328,30,283.18,14484,280.93,284.26,False,2,43.7278442,-79.3280868
34_0_34C,8789,34,true,1585505295,328,30,283.18,14484,280.93,284.26,False,2,43.7278442,-79.3280868
34_0_34C,8789,34,true,1585505324,358,26,283.18,14484,280.93,284.26,False,2,43.7297058,-79.3284149
34_0_34C,8789,34,true,1585505354,179,15,283.18,14484,280.93,284.26,False,2,43.7295417,-79.3283996
34_0_34C,8789,34,true,1585505385,357,0,283.18,14484,280.93,284.26,False,2,43.7274818,-79.3278579
34_0_34C,8789,34,true,1585505384,357,0,283.18,14484,280.93,284.26,False,2,43.7274818,-79.3278579
34_0_34C,8789,34,true,1585505416,357,0,283.18,14484,280.93,284.26,False,2,43.7274818,-79.3278579
34_0_34C,8789,34,true,1585505415,357,0,283.18,14484,280.93,284.26,False,2,43.7274818,-79.3278579
34_0_34C,8789,34,true,1585505444,357,0,283.18,14484,280.93,284.26,False,2,43.7274818,-79.3278579
34_0_34C,8789,34,true,1585505475,138,38,283.18,14484,280.93,284.26,False,2,43.725872,-79.3270416
34_0_34C,8789,34,true,1585505474,138,38,283.18,14484,280.93,284.26,False,2,43.725872,-79.3270416
34_0_34C,8789,34,true,1585505504,148,39,283.19,14484,280.93,284.26,False,2,43.7240676,-79.3250808
34_0_34C,8789,34,true,1585505505,148,39,283.19,14484,280.93,284.26,False,2,43.7240676,-79.3250808
34_0_34C,8789,34,true,1585505534,207,41,283.29,14484,280.93,284.26,False,2,43.7220115,-79.3275909
34_0_34C,8789,34,true,1585505564,248,0,283.29,14484,280.93,284.26,False,2,43.7196197,-79.3279876
34_0_34C,8789,34,true,1585505594,252,38,283.29,14484,280.93,284.26,False,2,43.7189598,-79.3288688
34_0_34C,8789,34,true,1585505624,153,27,283.29,14484,280.93,284.26,False,2,43.718149,-79.3312962
34_0_34C,8789,34,true,1585505625,153,27,283.29,14484,280.93,284.26,False,2,43.718149,-79.3312962
34_0_34C,8789,34,true,1585505654,158,0,283.29,14484,280.93,284.26,False,2,43.7161216,-79.3301773
34_0_34C,8789,34,true,1585505655,158,0,283.29,14484,280.93,284.26,False,2,43.7161216,-79.3301773
34_0_34C,8789,34,true,1585505684,114,22,283.29,14484,280.93,284.26,False,2,43.7152944,-79.3295844
34_0_34C,8789,34,true,1585505714,157,38,283.31,14484,281.15,284.26,False,2,43.7145824,-79.3275024
34_0_34C,8789,34,true,1585505715,157,38,283.31,14484,281.15,284.26,False,2,43.7145824,-79.3275024
34_0_34C,8789,34,true,1585508565,216,0,285.06,14484,281.15,289.82,False,0,43.7050933,-79.3985671
34_0_34C,8789,34,true,1585508595,216,0,285.06,14484,281.15,289.82,False,0,43.7050933,-79.3985671
34_0_34C,8789,34,true,1585508625,216,0,285.06,14484,281.15,289.82,False,0,43.7050933,-79.3985671
34_0_34C,8789,34,true,1585508655,75,2,285.06,14484,281.15,289.82,False,0,43.7050933,-79.3985671
34_0_34C,8789,34,true,1585508656,75,2,285.06,14484,281.15,289.82,False,0,43.7050933,-79.3985671
34_0_34C,8789,34,true,1585508685,338,13,285.06,14484,281.15,289.82,False,0,43.7052133,-79.3985749
34_0_34C,8789,34,true,1585508686,338,13,285.06,14484,281.15,289.82,False,0,43.7052133,-79.3985749
34_0_34C,8789,34,true,1585508715,279,17,285.06,14484,281.15,289.82,False,0,43.7050933,-79.3985671
34_0_34C,8789,34,true,1585508745,358,6,285.06,14484,281.15,289.82,False,0,43.7062149,-79.4001083
34_0_34C,8789,34,true,1585508775,75,19,285.06,14484,281.15,289.82,False,0,43.7066307,-79.3988265
34_0_34C,8789,34,true,1585508805,76,26,285.06,14484,281.15,289.82,False,0,43.706974,-79.3971862
34_0_34C,8789,34,true,1585508835,216,0,285.06,14484,281.15,289.82,False,0,43.7072067,-79.3956069
34_0_34C,8789,34,true,1585508836,216,0,285.06,14484,281.15,289.82,False,0,43.7072067,-79.3956069
34_0_34C,8789,34,true,1585508865,216,0,285.06,14484,281.15,289.82,False,0,43.7072067,-79.3956069
34_0_34C,8789,34,true,1585508898,78,34,285.75,14484,281.15,292.59,False,0,43.7076717,-79.3935521
34_0_34C,8789,34,true,1585508897,78,34,285.75,14484,281.15,292.59,False,0,43.7076717,-79.3935521
34_0_34C,8789,34,true,1585508926,74,0,285.75,14484,281.15,292.59,False,0,43.707756,-79.3929367
34_0_34C,8789,34,true,1585508925,74,0,285.75,14484,281.15,292.59,False,0,43.707756,-79.3929367
34_0_34C,8789,34,true,1585508955,77,22,285.75,14484,281.15,292.59,False,0,43.7082418,-79.3909455
34_0_34C,8789,34,true,1585508985,74,0,285.75,14484,281.15,292.59,False,0,43.7082733,-79.390795
34_0_34C,8789,34,true,1585508986,74,0,285.75,14484,281.15,292.59,False,0,43.7082733,-79.390795
34_0_34C,8789,34,true,1585509016,74,0,285.75,14484,281.15,292.59,False,0,43.7082733,-79.390795
34_0_34C,8789,34,true,1585509045,74,15,285.75,14484,281.15,292.59,False,0,43.7085505,-79.3893931
34_0_34C,8789,34,true,1585509075,74,0,285.75,14484,281.15,292.59,False,0,43.7088394,-79.3876647
34_0_34C,8789,34,true,1585509076,74,0,285.75,14484,281.15,292.59,False,0,43.7088394,-79.3876647
34_0_34C,8789,34,true,1585509105,74,0,285.75,14484,281.15,292.59,False,0,43.7091064,-79.3863296
34_0_34C,8789,34,true,1585509135,69,23,285.64,14484,281.15,292.59,False,0,43.7091522,-79.3861968
34_0_34C,8789,34,true,1585509165,74,39,285.66,14484,281.15,292.59,False,0,43.7103858,-79.3803195
34_0_34C,8789,34,true,1585509196,77,37,285.66,14484,281.15,292.59,False,0,43.7106011,-79.3791795
34_0_34C,8789,34,true,1585509195,77,37,285.66,14484,281.15,292.59,False,0,43.7106011,-79.3791795
34_0_34C,8789,34,true,1585509225,74,14,285.66,14484,281.15,292.59,False,0,43.7109345,-79.3775681
34_0_34C,8789,34,true,1585509226,74,14,285.66,14484,281.15,292.59,False,0,43.7109345,-79.3775681
34_0_34C,8789,34,true,1585509255,74,39,285.64,14484,281.15,292.59,False,0,43.7114939,-79.374822
34_0_34C,8789,34,true,1585509256,74,39,285.64,14484,281.15,292.59,False,0,43.7114939,-79.374822
34_0_34C,8789,34,true,1585509285,74,45,285.64,14484,281.15,292.59,False,0,43.7125519,-79.3695345
34_0_34C,8789,34,true,1585509286,74,45,285.64,14484,281.15,292.59,False,0,43.7125519,-79.3695345
34_0_34C,8789,34,true,1585509316,72,34,285.64,14484,281.15,292.59,False,0,43.7134086,-79.3652537
34_0_34C,8789,34,true,1585509315,72,34,285.64,14484,281.15,292.59,False,0,43.7134086,-79.3652537
34_0_34C,8789,34,true,1585509345,75,0,285.62,14484,281.15,292.59,False,0,43.7135148,-79.3649184
34_0_34C,8789,34,true,1585509346,75,0,285.62,14484,281.15,292.59,False,0,43.7135148,-79.3649184
34_0_34C,8789,34,true,1585509376,75,0,285.62,14484,281.15,292.59,False,0,43.7135148,-79.3649184
34_0_34C,8789,34,true,1585509375,75,0,285.62,14484,281.15,292.59,False,0,43.7135148,-79.3649184
34_0_34C,8789,34,true,1585509406,76,43,285.62,14484,281.15,292.59,False,0,43.7143273,-79.3606924
34_0_34C,8789,34,true,1585509405,76,43,285.62,14484,281.15,292.59,False,0,43.7143273,-79.3606924
34_0_34C,8789,34,true,1585509435,67,0,285.62,14484,281.15,292.59,False,0,43.7145095,-79.3598162
34_0_34C,8789,34,true,1585509436,67,0,285.62,14484,281.15,292.59,False,0,43.7145095,-79.3598162
34_0_34C,8789,34,true,1585509465,67,0,285.62,14484,281.15,292.59,False,0,43.7145095,-79.3598162
34_0_34C,8789,34,true,1585509466,67,0,285.62,14484,281.15,292.59,False,0,43.7145095,-79.3598162
34_0_34C,8789,34,true,1585509495,67,42,285.62,14484,281.15,292.59,False,0,43.714827,-79.3588169
34_0_34C,8789,34,true,1585509496,67,42,285.62,14484,281.15,292.59,False,0,43.714827,-79.3588169
34_0_34C,8789,34,true,1585509525,70,39,285.37,14484,281.15,288.15,False,0,43.7157639,-79.3543156
34_0_34C,8789,34,true,1585509526,70,39,285.37,14484,281.15,288.15,False,0,43.7157639,-79.3543156
34_0_34C,8789,34,true,1585509555,66,33,285.37,14484,281.15,288.15,False,0,43.7169405,-79.3503759
34_0_34C,8789,34,true,1585509556,66,33,285.37,14484,281.15,288.15,False,0,43.7169405,-79.3503759
34_0_34C,8789,34,true,1585509585,66,0,285.37,14484,281.15,288.15,False,0,43.7169855,-79.3501615
34_0_34C,8789,34,true,1585509586,66,0,285.37,14484,281.15,288.15,False,0,43.7169855,-79.3501615
34_0_34C,8789,34,true,1585509615,64,40,285.37,14484,281.15,288.15,False,0,43.7174148,-79.3488235
34_0_34C,8789,34,true,1585509616,64,40,285.37,14484,281.15,288.15,False,0,43.7174148,-79.3488235
34_0_34C,8789,34,true,1585509645,68,43,285.37,14484,281.15,288.15,False,0,43.7182857,-79.345898
34_0_34C,8789,34,true,1585509646,68,43,285.37,14484,281.15,288.15,False,0,43.7182857,-79.345898
34_0_34C,8789,34,true,1585509675,67,39,285.36,14484,281.15,288.15,False,0,43.7201441,-79.3400042
34_0_34C,8789,34,true,1585509676,67,39,285.36,14484,281.15,288.15,False,0,43.7201441,-79.3400042
34_0_34C,8789,34,true,1585509705,5,0,285.36,14484,281.15,288.15,False,0,43.7204851,-79.339023
34_0_34C,8789,34,true,1585509706,5,0,285.36,14484,281.15,288.15,False,0,43.7204851,-79.339023
34_0_34C,8789,34,true,1585509736,65,36,285.36,14484,281.15,288.15,False,0,43.7210466,-79.3365033
34_0_34C,8789,34,true,1585509735,65,36,285.36,14484,281.15,288.15,False,0,43.7210466,-79.3365033
34_0_34C,8789,34,true,1585509859,69,0,286.29,14484,281.15,292.59,False,0,43.7204322,-79.3390502
34_0_34C,8789,34,true,1585509858,69,0,286.29,14484,281.15,292.59,False,0,43.7204322,-79.3390502
34_0_34C,8789,34,true,1585509885,69,0,286.29,14484,281.15,292.59,False,0,43.7204322,-79.3390502
34_0_34C,8789,34,true,1585509886,69,0,286.29,14484,281.15,292.59,False,0,43.7204322,-79.3390502
34_0_34C,8789,34,true,1585509945,348,34,286.29,14484,281.15,292.59,False,0,43.7220458,-79.3392868
34_0_34C,8789,34,true,1585509946,348,34,286.29,14484,281.15,292.59,False,0,43.7220458,-79.3392868
34_0_34C,8789,34,true,1585509975,78,39,286.29,14484,281.15,292.59,False,0,43.7233924,-79.3370132
34_0_34C,8789,34,true,1585509976,78,39,286.29,14484,281.15,292.59,False,0,43.7233924,-79.3370132
34_0_34C,8789,34,true,1585510005,48,45,286.04,14484,283.71,288.15,False,2,43.7240142,-79.3348617
34_0_34C,8789,34,true,1585510006,48,45,286.04,14484,283.71,288.15,False,2,43.7240142,-79.3348617
34_0_34C,8789,34,true,1585510035,72,41,285.99,14484,283.71,288.15,False,2,43.7264404,-79.331871
34_0_34C,8789,34,true,1585510036,72,41,285.99,14484,283.71,288.15,False,2,43.7264404,-79.331871
34_0_34C,8789,34,true,1585510065,74,20,285.99,14484,283.71,288.15,False,2,43.7266616,-79.3308792
34_0_34C,8789,34,true,1585510066,74,20,285.99,14484,283.71,288.15,False,2,43.7266616,-79.3308792
34_0_34C,8789,34,true,1585510096,72,13,285.99,14484,283.71,288.15,False,2,43.7273101,-79.3279113
34_0_34C,8789,34,true,1585510095,72,13,285.99,14484,283.71,288.15,False,2,43.7273101,-79.3279113
34_0_34C,8789,34,true,1585510126,356,8,285.99,14484,283.71,288.15,False,2,43.7292022,-79.3283767
34_0_34C,8789,34,true,1585510125,356,8,285.99,14484,283.71,288.15,False,2,43.7292022,-79.3283767
34_0_34C,8789,34,true,1585510156,178,22,285.99,14484,283.71,288.15,False,2,43.729721,-79.3284149
34_0_34C,8789,34,true,1585510155,178,22,285.99,14484,283.71,288.15,False,2,43.729721,-79.3284149
34_0_34C,8789,34,true,1585510185,153,19,285.99,14484,283.71,288.15,False,2,43.7276496,-79.3279418
34_0_34C,8789,34,true,1585510186,153,19,285.99,14484,283.71,288.15,False,2,43.7276496,-79.3279418
34_0_34C,8789,34,true,1585510216,125,0,285.99,14484,283.71,288.15,False,2,43.7274818,-79.3278579
34_0_34C,8789,34,true,1585510215,125,0,285.99,14484,283.71,288.15,False,2,43.7274818,-79.3278579
34_0_34C,8789,34,true,1585510246,163,0,285.99,14484,283.71,288.15,False,2,43.726345,-79.327507
34_0_34C,8789,34,true,1585510245,163,0,285.99,14484,283.71,288.15,False,2,43.726345,-79.327507
34_0_34C,8789,34,true,1585510276,138,34,285.99,14484,283.71,288.15,False,2,43.7251688,-79.3259442
34_0_34C,8789,34,true,1585510275,138,34,285.99,14484,283.71,288.15,False,2,43.7251688,-79.3259442
34_0_34C,8789,34,true,1585510305,246,44,286.04,14484,283.71,288.15,False,2,43.7226391,-79.3268051
34_0_34C,8789,34,true,1585510306,246,44,286.04,14484,283.71,288.15,False,2,43.7226391,-79.3268051
34_0_34C,8789,34,true,1585510336,161,36,286.04,14484,283.71,288.15,False,2,43.7199923,-79.3280248
34_0_34C,8789,34,true,1585510335,161,36,286.04,14484,283.71,288.15,False,2,43.7199923,-79.3280248
34_0_34C,8789,34,true,1585510365,248,0,286.04,14484,283.71,288.15,False,2,43.7196197,-79.3279876
34_0_34C,8789,34,true,1585510366,248,0,286.04,14484,283.71,288.15,False,2,43.7196197,-79.3279876
34_0_34C,8789,34,true,1585510395,245,0,286.04,14484,283.71,288.15,False,2,43.7185045,-79.3309326
34_0_34C,8789,34,true,1585510396,245,0,286.04,14484,283.71,288.15,False,2,43.7185045,-79.3309326
34_0_34C,8789,34,true,1585510425,155,40,286.04,14484,283.71,288.15,False,2,43.7176204,-79.3310253
34_0_34C,8789,34,true,1585510426,155,40,286.04,14484,283.71,288.15,False,2,43.7176204,-79.3310253
34_0_34C,8789,34,true,1585510456,156,27,286.04,14484,283.71,288.15,False,2,43.7160172,-79.3301077
34_0_34C,8789,34,true,1585510455,156,27,286.04,14484,283.71,288.15,False,2,43.7160172,-79.3301077
34_0_34C,8789,34,true,1585510486,144,23,286.04,14484,283.71,288.15,False,2,43.7154029,-79.3281019
34_0_34C,8789,34,true,1585510485,144,23,286.04,14484,283.71,288.15,False,2,43.7154029,-79.3281019
34_0_34C,8789,34,true,1585512887,346,19,288.98,24140,286.15,293.71,False,0,43.7062149,-79.4001083
34_0_34C,8789,34,true,1585512886,346,19,288.98,24140,286.15,293.71,False,0,43.7062149,-79.4001083
34_0_34C,8789,34,true,1585512917,75,8,288.98,24140,286.15,293.71,False,0,43.7066802,-79.39859
34_0_34C,8789,34,true,1585512916,75,8,288.98,24140,286.15,293.71,False,0,43.7066802,-79.39859
34_0_34C,8789,34,true,1585512947,76,0,288.98,24140,286.15,293.71,False,0,43.7066802,-79.39859
34_0_34C,8789,34,true,1585512946,76,0,288.98,24140,286.15,293.71,False,0,43.7066802,-79.39859
34_0_34C,8789,34,true,1585512976,74,22,288.98,24140,286.15,293.71,False,0,43.7071456,-79.39608
34_0_34C,8789,34,true,1585512977,74,22,288.98,24140,286.15,293.71,False,0,43.7071456,-79.39608
34_0_34C,8789,34,true,1585513006,74,37,289.03,24140,286.15,293.15,False,0,43.707695,-79.3933868
34_0_34C,8789,34,true,1585513007,74,37,289.03,24140,286.15,293.15,False,0,43.707695,-79.3933868
34_0_34C,8789,34,true,1585513036,74,0,289.03,24140,286.15,293.15,False,0,43.7083778,-79.3902893
34_0_34C,8789,34,true,1585513037,74,0,289.03,24140,286.15,293.15,False,0,43.7083778,-79.3902893
34_0_34C,8789,34,true,1585513067,74,0,289.03,24140,286.15,293.15,False,0,43.7083778,-79.3902893
34_0_34C,8789,34,true,1585513066,74,0,289.03,24140,286.15,293.15,False,0,43.7083778,-79.3902893
34_0_34C,8789,34,true,1585513098,74,0,289.03,24140,286.15,293.15,False,0,43.7083778,-79.3902893
34_0_34C,8789,34,true,1585513097,74,0,289.03,24140,286.15,293.15,False,0,43.7083778,-79.3902893
34_0_34C,8789,34,true,1585513127,75,30,289.03,24140,286.15,293.15,False,0,43.7087974,-79.3881454
34_0_34C,8789,34,true,1585513126,75,30,289.03,24140,286.15,293.15,False,0,43.7087974,-79.3881454
34_0_34C,8789,34,true,1585513157,74,46,289.03,24140,286.15,293.15,False,0,43.7096023,-79.3841781
34_0_34C,8789,34,true,1585513156,74,46,289.03,24140,286.15,293.15,False,0,43.7096023,-79.3841781
34_0_34C,8789,34,true,1585513186,77,36,289.03,24140,286.15,293.15,False,0,43.7106094,-79.3791503
34_0_34C,8789,34,true,1585513187,77,36,289.03,24140,286.15,293.15,False,0,43.7106094,-79.3791503
34_0_34C,8789,34,true,1585513217,75,0,289.03,24140,286.15,293.15,False,0,43.7108726,-79.377861
34_0_34C,8789,34,true,1585513216,75,0,289.03,24140,286.15,293.15,False,0,43.7108726,-79.377861
34_0_34C,8789,34,true,1585513247,75,0,289.03,24140,286.15,293.15,False,0,43.7108726,-79.377861
34_0_34C,8789,34,true,1585513246,75,0,289.03,24140,286.15,293.15,False,0,43.7108726,-79.377861
34_0_34C,8789,34,true,1585513276,75,19,289.03,24140,286.15,293.15,False,0,43.7112274,-79.3759002
34_0_34C,8789,34,true,1585513277,75,19,289.03,24140,286.15,293.15,False,0,43.7112274,-79.3759002
34_0_34C,8789,34,true,1585513307,74,34,289.03,24140,286.15,293.15,False,0,43.7114028,-79.3751983
34_0_34C,8789,34,true,1585513306,74,34,289.03,24140,286.15,293.15,False,0,43.7114028,-79.3751983
34_0_34C,8789,34,true,1585513339,74,46,289.11,24140,286.15,293.15,False,0,43.7126502,-79.3691635
34_0_34C,8789,34,true,1585513340,74,46,289.11,24140,286.15,293.15,False,0,43.7126502,-79.3691635
34_0_34C,8789,34,true,1585513367,74,0,289.11,24140,286.15,293.15,False,0,43.7129631,-79.3673248
34_0_34C,8789,34,true,1585513366,74,0,289.11,24140,286.15,293.15,False,0,43.7129631,-79.3673248
34_0_34C,8789,34,true,1585513396,75,40,289.01,24140,286.15,293.71,False,0,43.7135581,-79.3647308
34_0_34C,8789,34,true,1585513397,75,40,289.01,24140,286.15,293.71,False,0,43.7135581,-79.3647308
34_0_34C,8789,34,true,1585513426,77,40,289.26,24140,286.15,293.15,False,0,43.7143745,-79.3603973
34_0_34C,8789,34,true,1585513427,77,40,289.26,24140,286.15,293.15,False,0,43.7143745,-79.3603973
34_0_34C,8789,34,true,1585513457,74,0,289.26,24140,286.15,293.15,False,0,43.7144584,-79.3599014
34_0_34C,8789,34,true,1585513486,64,35,289.01,14484,286.15,293.15,False,0,43.7150268,-79.357994
34_0_34C,8789,34,true,1585513487,64,35,289.01,14484,286.15,293.15,False,0,43.7150268,-79.357994
34_0_34C,8789,34,true,1585513517,88,41,289.01,14484,286.15,293.15,False,0,43.7155685,-79.355194
34_0_34C,8789,34,true,1585513516,88,41,289.01,14484,286.15,293.15,False,0,43.7155685,-79.355194
34_0_34C,8789,34,true,1585513546,65,49,289.14,14484,286.15,293.15,False,0,43.7172355,-79.3491592
34_0_34C,8789,34,true,1585513547,65,49,289.14,14484,286.15,293.15,False,0,43.7172355,-79.3491592
34_0_34C,8789,34,true,1585513577,69,51,289.14,14484,286.15,293.15,False,0,43.7184257,-79.3454437
34_0_34C,8789,34,true,1585513576,69,51,289.14,14484,286.15,293.15,False,0,43.7184257,-79.3454437
34_0_34C,8789,34,true,1585513606,67,47,289.17,14484,286.15,293.15,False,0,43.7200126,-79.340393
34_0_34C,8789,34,true,1585513607,67,47,289.17,14484,286.15,293.15,False,0,43.7200126,-79.340393
34_0_34C,8789,34,true,1585513637,67,3,289.17,14484,286.15,293.15,False,0,43.720333,-79.3394012
34_0_34C,8789,34,true,1585513636,67,3,289.17,14484,286.15,293.15,False,0,43.720333,-79.3394012
34_0_34C,8789,34,true,1585513666,151,17,289.17,14484,286.15,293.15,False,0,43.721125,-79.33565
34_0_34C,8789,34,true,1585513667,151,17,289.17,14484,286.15,293.15,False,0,43.721125,-79.33565
34_0_34C,8789,34,true,1585513756,66,0,289.17,14484,286.15,293.15,False,0,43.7204322,-79.3390502
34_0_34C,8789,34,true,1585513757,66,0,289.17,14484,286.15,293.15,False,0,43.7204322,-79.3390502
34_0_34C,8789,34,true,1585513787,69,0,289.17,14484,286.15,293.15,False,0,43.7204322,-79.3390502
34_0_34C,8789,34,true,1585513786,69,0,289.17,14484,286.15,293.15,False,0,43.7204322,-79.3390502
34_0_34C,8789,34,true,1585513819,69,0,289.17,14484,286.15,293.15,False,0,43.7204322,-79.3390502
34_0_34C,8789,34,true,1585513847,344,31,289.17,14484,286.15,293.15,False,0,43.7210197,-79.339035
34_0_34C,8789,34,true,1585513937,62,45,289.12,14484,286.15,293.15,False,0,43.726284,-79.332405
34_0_34C,8789,34,true,1585513936,62,45,289.12,14484,286.15,293.15,False,0,43.726284,-79.332405
34_0_34C,8789,34,true,1585513966,72,39,289.12,14484,286.15,293.15,False,0,43.7269477,-79.3296127
34_0_34C,8789,34,true,1585513967,72,39,289.12,14484,286.15,293.15,False,0,43.7269477,-79.3296127
34_0_34C,8789,34,true,1585513997,329,32,289.12,14484,286.15,293.15,False,0,43.7278442,-79.3280868
34_0_34C,8789,34,true,1585514027,358,31,289.12,14484,286.15,293.15,False,0,43.7297058,-79.3284149
34_0_34C,8789,34,true,1585514026,358,31,289.12,14484,286.15,293.15,False,0,43.7297058,-79.3284149
34_0_34C,8789,34,true,1585514057,178,18,289.12,14484,286.15,293.15,False,0,43.7295417,-79.3283996
34_0_34C,8789,34,true,1585514087,357,0,289.12,14484,286.15,293.15,False,0,43.7274818,-79.3278579
34_0_34C,8789,34,true,1585514117,357,0,289.12,14484,286.15,293.15,False,0,43.7274818,-79.3278579
34_0_34C,8789,34,true,1585514116,357,0,289.12,14484,286.15,293.15,False,0,43.7274818,-79.3278579
34_0_34C,8789,34,true,1585514146,357,0,289.12,14484,286.15,293.15,False,0,43.7274818,-79.3278579
34_0_34C,8789,34,true,1585514147,357,0,289.12,14484,286.15,293.15,False,0,43.7274818,-79.3278579
34_0_34C,8789,34,true,1585514177,141,44,289.12,14484,286.15,293.15,False,0,43.7259254,-79.3271179
34_0_34C,8789,34,true,1585514207,255,43,289.33,14484,286.15,293.15,False,0,43.7227935,-79.325653
34_0_34C,8789,34,true,1585514237,192,41,289.33,14484,286.15,293.15,False,0,43.7215614,-79.327835
34_0_34C,8789,34,true,1585514236,192,41,289.33,14484,286.15,293.15,False,0,43.7215614,-79.327835
34_0_34C,8789,34,true,1585514267,254,43,289.33,14484,286.15,293.15,False,0,43.7189369,-79.3289871
34_0_34C,8789,34,true,1585514266,254,43,289.33,14484,286.15,293.15,False,0,43.7189369,-79.3289871
34_0_34C,8789,34,true,1585514297,155,38,289.33,14484,286.15,293.15,False,0,43.7173843,-79.3308792
34_0_34C,8789,34,true,1585514296,155,38,289.33,14484,286.15,293.15,False,0,43.7173843,-79.3308792
34_0_34C,8789,34,true,1585514326,157,33,289.33,14484,286.15,293.15,False,0,43.7156372,-79.3298568
34_0_34C,8789,34,true,1585514327,157,33,289.33,14484,286.15,293.15,False,0,43.7156372,-79.3298568
34_0_34C,8789,34,true,1585514357,159,22,289.33,14484,286.15,293.15,False,0,43.7152786,-79.327919
34_0_34C,8789,34,true,1585517028,96,17,289.5,14484,286.48,291.15,False,0,43.7050933,-79.3985671
34_0_34C,8789,34,true,1585517027,96,17,289.5,14484,286.48,291.15,False,0,43.7050933,-79.3985671
34_0_34C,8789,34,true,1585517057,216,0,289.5,14484,286.48,291.15,False,0,43.7050933,-79.3985671
34_0_34C,8789,34,true,1585517058,216,0,289.5,14484,286.48,291.15,False,0,43.7050933,-79.3985671
34_0_34C,8789,34,true,1585517088,288,14,289.5,14484,286.48,291.15,False,0,43.7050933,-79.3985671
34_0_34C,8789,34,true,1585517117,74,27,289.5,14484,286.48,291.15,False,0,43.7066802,-79.39859
34_0_34C,8789,34,true,1585517118,74,27,289.5,14484,286.48,291.15,False,0,43.7066802,-79.39859
34_0_34C,8789,34,true,1585517148,73,32,289.5,14484,286.48,291.15,False,0,43.7071456,-79.39608
34_0_34C,8789,34,true,1585517147,73,32,289.5,14484,286.48,291.15,False,0,43.7071456,-79.39608
34_0_34C,8789,34,true,1585517178,74,0,289.59,14484,287.59,291.15,False,0,43.7077255,-79.3931427
34_0_34C,8789,34,true,1585517177,74,0,289.59,14484,287.59,291.15,False,0,43.7077255,-79.3931427
34_0_34C,8789,34,true,1585517208,74,29,289.59,14484,287.59,291.15,False,0,43.7079544,-79.3923263
34_0_34C,8789,34,true,1585517207,74,29,289.59,14484,287.59,291.15,False,0,43.7079544,-79.3923263
34_0_34C,8789,34,true,1585517238,72,30,289.59,14484,287.59,291.15,False,0,43.7086257,-79.388977
34_0_34C,8789,34,true,1585517268,74,43,289.51,14484,286.48,291.15,False,0,43.7096023,-79.3841781
34_0_34C,8789,34,true,1585517267,74,43,289.51,14484,286.48,291.15,False,0,43.7096023,-79.3841781
34_0_34C,8789,34,true,1585517297,74,41,289.51,14484,286.48,291.15,False,0,43.710411,-79.3801956
34_0_34C,8789,34,true,1585517298,74,41,289.51,14484,286.48,291.15,False,0,43.710411,-79.3801956
34_0_34C,8789,34,true,1585517328,75,0,289.4,14484,287.59,290.93,False,0,43.7109222,-79.3776245
34_0_34C,8789,34,true,1585517357,75,0,289.4,14484,287.59,290.93,False,0,43.7109222,-79.3776245
34_0_34C,8789,34,true,1585517358,75,0,289.4,14484,287.59,290.93,False,0,43.7109222,-79.3776245
34_0_34C,8789,34,true,1585517388,75,0,289.4,14484,287.59,290.93,False,0,43.7109222,-79.3776245
34_0_34C,8789,34,true,1585517387,75,0,289.4,14484,287.59,290.93,False,0,43.7109222,-79.3776245
34_0_34C,8789,34,true,1585517418,72,23,289.4,14484,287.59,290.93,False,0,43.7110557,-79.3768997
34_0_34C,8789,34,true,1585517417,72,23,289.4,14484,287.59,290.93,False,0,43.7110557,-79.3768997
34_0_34C,8789,34,true,1585517447,74,39,289.44,14484,287.59,290.93,False,0,43.7115173,-79.3747253
34_0_34C,8789,34,true,1585517448,74,39,289.44,14484,287.59,290.93,False,0,43.7115173,-79.3747253
34_0_34C,8789,34,true,1585517477,73,41,289.44,14484,287.59,290.93,False,0,43.7126502,-79.3691635
34_0_34C,8789,34,true,1585517478,73,41,289.44,14484,287.59,290.93,False,0,43.7126502,-79.3691635
34_0_34C,8789,34,true,1585517508,74,45,289.22,14484,286.48,290.93,False,0,43.7135581,-79.3647308
34_0_34C,8789,34,true,1585517507,74,45,289.22,14484,286.48,290.93,False,0,43.7135581,-79.3647308
34_0_34C,8789,34,true,1585517538,76,33,289.22,14484,286.48,290.93,False,0,43.7143745,-79.3603973
34_0_34C,8789,34,true,1585517568,74,0,289.22,14484,286.48,290.93,False,0,43.7144584,-79.3599014
34_0_34C,8789,34,true,1585517567,74,0,289.22,14484,286.48,290.93,False,0,43.7144584,-79.3599014
34_0_34C,8789,34,true,1585517598,74,0,289.22,14484,286.48,290.93,False,0,43.7144584,-79.3599014
34_0_34C,8789,34,true,1585517628,78,39,289.12,14484,286.48,290.37,False,0,43.7152976,-79.3566055
34_0_34C,8789,34,true,1585517627,78,39,289.12,14484,286.48,290.37,False,0,43.7152976,-79.3566055
34_0_34C,8789,34,true,1585517659,68,40,289.21,14484,286.48,290.93,False,0,43.7164268,-79.3519287
34_0_34C,8789,34,true,1585517688,66,0,289.21,14484,286.48,290.93,False,0,43.7169952,-79.3502197
34_0_34C,8789,34,true,1585517717,63,41,289.21,14484,286.48,290.93,False,0,43.7174148,-79.3488235
34_0_34C,8789,34,true,1585517718,63,41,289.21,14484,286.48,290.93,False,0,43.7174148,-79.3488235
34_0_34C,8789,34,true,1585517748,63,41,289.06,14484,286.48,290.37,False,0,43.7187767,-79.344345
34_0_34C,8789,34,true,1585517747,63,41,289.06,14484,286.48,290.37,False,0,43.7187767,-79.344345
34_0_34C,8789,34,true,1585517778,67,35,289.06,14484,286.48,290.37,False,0,43.7201652,-79.3399429
34_0_34C,8789,34,true,1585517777,67,35,289.06,14484,286.48,290.37,False,0,43.7201652,-79.3399429
34_0_34C,8789,34,true,1585517808,69,0,289.06,14484,286.48,290.37,False,0,43.720333,-79.3394012
34_0_34C,8789,34,true,1585517837,66,35,289.06,14484,286.48,290.37,False,0,43.7204322,-79.3390502
34_0_34C,8789,34,true,1585517838,66,35,289.06,14484,286.48,290.37,False,0,43.7204322,-79.3390502
34_0_34C,8789,34,true,1585517868,189,25,289.06,14484,286.48,290.37,False,0,43.7209583,-79.33563
34_0_34C,8789,34,true,1585517958,66,0,289.06,14484,286.48,290.37,False,0,43.7204322,-79.3390502
34_0_34C,8789,34,true,1585517988,69,0,289.06,14484,286.48,290.37,False,0,43.7204322,-79.3390502
34_0_34C,8789,34,true,1585518018,69,0,289.06,14484,286.48,290.37,False,0,43.7204322,-79.3390502
34_0_34C,8789,34,true,1585518017,69,0,289.06,14484,286.48,290.37,False,0,43.7204322,-79.3390502
34_0_34C,8789,34,true,1585518048,350,25,289.09,14484,286.48,290.37,False,0,43.7228622,-79.3394927
34_0_34C,8789,34,true,1585518047,350,25,289.09,14484,286.48,290.37,False,0,43.7228622,-79.3394927
34_0_34C,8789,34,true,1585518077,73,44,289.09,14484,286.48,290.37,False,0,43.7235794,-79.3359069
34_0_34C,8789,34,true,1585518078,73,44,289.09,14484,286.48,290.37,False,0,43.7235794,-79.3359069
34_0_34C,8789,34,true,1585518108,70,46,289.11,14484,286.48,290.37,False,0,43.726406,-79.3320159
34_0_34C,8789,34,true,1585518138,71,35,289.11,14484,286.48,290.37,False,0,43.7271385,-79.3284606
34_0_34C,8789,34,true,1585518167,358,7,289.11,14484,286.48,290.37,False,0,43.7292022,-79.3283767
34_0_34C,8789,34,true,1585518168,358,7,289.11,14484,286.48,290.37,False,0,43.7292022,-79.3283767
34_0_34C,8789,34,true,1585518198,181,18,289.11,14484,286.48,290.37,False,0,43.7295417,-79.3283996
34_0_34C,8789,34,true,1585518227,154,3,289.11,14484,286.48,290.37,False,0,43.7276496,-79.3279418
34_0_34C,8789,34,true,1585518228,154,3,289.11,14484,286.48,290.37,False,0,43.7276496,-79.3279418
34_0_34C,8789,34,true,1585518258,154,14,289.11,14484,286.48,290.37,False,0,43.7276496,-79.3279418
34_0_34C,8789,34,true,1585518257,154,14,289.11,14484,286.48,290.37,False,0,43.7276496,-79.3279418
34_0_34C,8789,34,true,1585518288,144,43,289.11,14484,286.48,290.37,False,0,43.7250442,-79.3258819
34_0_34C,8789,34,true,1585518318,263,44,289.1,14484,286.48,290.37,False,0,43.7227363,-79.3260192
34_0_34C,8789,34,true,1585518317,263,44,289.1,14484,286.48,290.37,False,0,43.7227363,-79.3260192
34_0_34C,8789,34,true,1585518348,162,37,289.1,14484,286.48,290.37,False,0,43.7199935,-79.3280258
34_0_34C,8789,34,true,1585518378,185,19,289.1,14484,286.48,290.37,False,0,43.7194963,-79.3278766
34_0_34C,8789,34,true,1585518408,247,34,289.1,14484,286.48,290.37,False,0,43.7186231,-79.330558
34_0_34C,8789,34,true,1585518438,157,30,289.1,14484,286.48,290.37,False,0,43.71656,-79.3303645
34_0_34C,8789,34,true,1585518468,70,26,289.1,14484,286.48,290.37,False,0,43.7154174,-79.3288301
34_0_34C,8789,34,true,1585518497,162,36,289.11,14484,286.48,290.37,False,0,43.7135537,-79.3269172
34_0_34C,8789,34,true,1585521350,74,12,287.24,14484,283.71,290.37,False,0,43.7050933,-79.3985671
34_0_34C,8789,34,true,1585521351,74,12,287.24,14484,283.71,290.37,False,0,43.7050933,-79.3985671
34_0_34C,8789,34,true,1585521381,216,0,287.24,14484,283.71,290.37,False,0,43.7050933,-79.3985671
34_0_34C,8789,34,true,1585521380,216,0,287.24,14484,283.71,290.37,False,0,43.7050933,-79.3985671
34_0_34C,8789,34,true,1585521411,285,18,287.24,14484,283.71,290.37,False,0,43.7050933,-79.3985671
34_0_34C,8789,34,true,1585521410,285,18,287.24,14484,283.71,290.37,False,0,43.7050933,-79.3985671
34_0_34C,8789,34,true,1585521441,76,0,287.24,14484,283.71,290.37,False,0,43.7065353,-79.3993072
34_0_34C,8789,34,true,1585521440,76,0,287.24,14484,283.71,290.37,False,0,43.7065353,-79.3993072
34_0_34C,8789,34,true,1585521471,76,14,287.24,14484,283.71,290.37,False,0,43.7065849,-79.3990707
34_0_34C,8789,34,true,1585521470,76,14,287.24,14484,283.71,290.37,False,0,43.7065849,-79.3990707
34_0_34C,8789,34,true,1585521500,74,22,287.24,14484,283.71,290.37,False,0,43.7071456,-79.39608
34_0_34C,8789,34,true,1585521501,74,22,287.24,14484,283.71,290.37,False,0,43.7071456,-79.39608
34_0_34C,8789,34,true,1585521530,74,5,287.24,14484,283.71,290.37,False,0,43.7071762,-79.3958358
34_0_34C,8789,34,true,1585521531,74,5,287.24,14484,283.71,290.37,False,0,43.7071762,-79.3958358
34_0_34C,8789,34,true,1585521561,75,29,287.03,14484,283.71,290.37,False,0,43.7079544,-79.3923263
34_0_34C,8789,34,true,1585521560,75,29,287.03,14484,283.71,290.37,False,0,43.7079544,-79.3923263
34_0_34C,8789,34,true,1585521591,74,0,287.03,14484,283.71,290.37,False,0,43.7082786,-79.3907699
34_0_34C,8789,34,true,1585521590,74,0,287.03,14484,283.71,290.37,False,0,43.7082786,-79.3907699
34_0_34C,8789,34,true,1585521620,74,0,287.03,14484,283.71,290.37,False,0,43.7082786,-79.3907699
34_0_34C,8789,34,true,1585521621,74,0,287.03,14484,283.71,290.37,False,0,43.7082786,-79.3907699
34_0_34C,8789,34,true,1585521650,70,8,287.03,14484,283.71,290.37,False,0,43.7086257,-79.388977
34_0_34C,8789,34,true,1585521651,70,8,287.03,14484,283.71,290.37,False,0,43.7086257,-79.388977
34_0_34C,8789,34,true,1585521680,74,13,287.03,14484,283.71,290.37,False,0,43.7087974,-79.3881454
34_0_34C,8789,34,true,1585521710,74,0,287.03,14484,283.71,290.37,False,0,43.7091064,-79.3863296
34_0_34C,8789,34,true,1585521711,74,0,287.03,14484,283.71,290.37,False,0,43.7091064,-79.3863296
34_0_34C,8789,34,true,1585521740,75,43,286.76,14484,283.71,288.15,False,0,43.7096023,-79.3841781
34_0_34C,8789,34,true,1585521741,75,43,286.76,14484,283.71,288.15,False,0,43.7096023,-79.3841781
34_0_34C,8789,34,true,1585521771,74,46,286.76,14484,283.71,288.15,False,0,43.710411,-79.3801956
34_0_34C,8789,34,true,1585521770,74,46,286.76,14484,283.71,288.15,False,0,43.710411,-79.3801956
34_0_34C,8789,34,true,1585521801,75,0,286.76,14484,283.71,288.15,False,0,43.7108726,-79.377861
34_0_34C,8789,34,true,1585521800,75,0,286.76,14484,283.71,288.15,False,0,43.7108726,-79.377861
34_0_34C,8789,34,true,1585521831,75,0,286.76,14484,283.71,288.15,False,0,43.7108726,-79.377861
34_0_34C,8789,34,true,1585521861,75,4,286.76,14484,283.71,288.15,False,0,43.7112274,-79.3759002
34_0_34C,8789,34,true,1585521891,74,49,286.7,14484,283.71,288.15,False,0,43.7120742,-79.3721237
34_0_34C,8789,34,true,1585521890,74,49,286.7,14484,283.71,288.15,False,0,43.7120742,-79.3721237
34_0_34C,8789,34,true,1585521921,76,46,286.7,14484,283.71,288.15,False,0,43.71315,-79.3667297
34_0_34C,8789,34,true,1585521920,76,46,286.7,14484,283.71,288.15,False,0,43.71315,-79.3667297
34_0_34C,8789,34,true,1585521950,75,0,286.71,14484,283.71,288.15,False,0,43.7135162,-79.3649139
34_0_34C,8789,34,true,1585521951,75,0,286.71,14484,283.71,288.15,False,0,43.7135162,-79.3649139
34_0_34C,8789,34,true,1585521981,75,19,286.71,14484,283.71,288.15,False,0,43.7135581,-79.3647308
34_0_34C,8789,34,true,1585522010,77,36,286.71,14484,283.71,288.15,False,0,43.7143745,-79.3603973
34_0_34C,8789,34,true,1585522011,77,36,286.71,14484,283.71,288.15,False,0,43.7143745,-79.3603973
34_0_34C,8789,34,true,1585522041,77,31,286.79,14484,283.71,288.71,False,0,43.7152976,-79.3566055
34_0_34C,8789,34,true,1585522040,77,31,286.79,14484,283.71,288.71,False,0,43.7152976,-79.3566055
34_0_34C,8789,34,true,1585522070,68,47,286.79,14484,283.71,288.15,False,0,43.7163581,-79.3521575
34_0_34C,8789,34,true,1585522071,68,47,286.79,14484,283.71,288.15,False,0,43.7163581,-79.3521575
34_0_34C,8789,34,true,1585522101,65,46,286.79,14484,283.71,288.15,False,0,43.7179336,-79.3470458
34_0_34C,8789,34,true,1585522100,65,46,286.79,14484,283.71,288.15,False,0,43.7179336,-79.3470458
34_0_34C,8789,34,true,1585522131,64,37,286.8,14484,283.71,288.15,False,0,43.7188491,-79.3441162
34_0_34C,8789,34,true,1585522161,67,26,286.8,14484,283.71,288.15,False,0,43.7202415,-79.339714
34_0_34C,8789,34,true,1585522160,67,26,286.8,14484,283.71,288.15,False,0,43.7202415,-79.339714
34_0_34C,8789,34,true,1585522190,66,36,286.8,14484,283.71,288.15,False,0,43.7206687,-79.3389205
34_0_34C,8789,34,true,1585522191,66,36,286.8,14484,283.71,288.15,False,0,43.7206687,-79.3389205
34_0_34C,8789,34,true,1585522222,162,46,286.8,14484,283.71,288.15,False,0,43.7201266,-79.335605
34_0_34C,8789,34,true,1585522221,162,46,286.8,14484,283.71,288.15,False,0,43.7201266,-79.335605
34_0_34C,8789,34,true,1585522310,66,0,286.8,14484,283.71,288.15,False,0,43.7204322,-79.3390502
34_0_34C,8789,34,true,1585522311,66,0,286.8,14484,283.71,288.15,False,0,43.7204322,-79.3390502
34_0_34C,8789,34,true,1585522340,69,0,286.8,14484,283.71,288.15,False,0,43.7204322,-79.3390502
34_0_34C,8789,34,true,1585522341,69,0,286.8,14484,283.71,288.15,False,0,43.7204322,-79.3390502
34_0_34C,8789,34,true,1585522371,341,23,286.78,14484,283.71,288.15,False,0,43.7206687,-79.3389205
34_0_34C,8789,34,true,1585522370,341,23,286.8,14484,283.71,288.15,False,0,43.7206687,-79.3389205
34_0_34C,8789,34,true,1585522400,348,28,286.8,14484,283.71,288.15,False,0,43.7228622,-79.3394927
34_0_34C,8789,34,true,1585522401,348,28,286.78,14484,283.71,288.15,False,0,43.7228622,-79.3394927
34_0_34C,8789,34,true,1585522431,49,46,286.8,14484,283.71,288.15,False,0,43.7239418,-79.3349609
34_0_34C,8789,34,true,1585522461,71,36,286.89,14484,283.71,288.15,False,0,43.7264404,-79.331871
34_0_34C,8789,34,true,1585522491,69,49,286.89,14484,283.71,288.15,False,0,43.7271385,-79.3284606
34_0_34C,8789,34,true,1585522490,69,49,286.89,14484,283.71,288.15,False,0,43.7271385,-79.3284606
34_0_34C,8789,34,true,1585522521,355,4,286.89,14484,283.71,288.15,False,0,43.7292022,-79.3283767
34_0_34C,8789,34,true,1585522551,175,17,286.89,14484,283.71,288.15,False,0,43.7295417,-79.3283996
34_0_34C,8789,34,true,1585522550,175,17,286.89,14484,283.71,288.15,False,0,43.7295417,-79.3283996
34_0_34C,8789,34,true,1585522580,154,25,286.89,14484,283.71,288.15,False,0,43.7276496,-79.3279418
34_0_34C,8789,34,true,1585522581,154,25,286.89,14484,283.71,288.15,False,0,43.7276496,-79.3279418
34_0_34C,8789,34,true,1585522610,142,42,286.89,14484,283.71,288.15,False,0,43.7259254,-79.3271179
34_0_34C,8789,34,true,1585522611,142,42,286.89,14484,283.71,288.15,False,0,43.7259254,-79.3271179
34_0_34C,8789,34,true,1585522641,175,29,286.84,14484,283.71,288.15,False,0,43.7233848,-79.324562
34_0_34C,8789,34,true,1585522671,192,46,286.8,14484,283.71,288.15,False,0,43.7215614,-79.327835
34_0_34C,8789,34,true,1585522670,192,46,286.8,14484,283.71,288.15,False,0,43.7215614,-79.327835
34_0_34C,8789,34,true,1585522700,218,25,286.8,14484,283.71,288.15,False,0,43.7192192,-79.3279571
34_0_34C,8789,34,true,1585522701,218,25,286.8,14484,283.71,288.15,False,0,43.7192192,-79.3279571
34_0_34C,8789,34,true,1585522731,249,9,286.8,14484,283.71,288.15,False,0,43.7184562,-79.3310852
34_0_34C,8789,34,true,1585522761,161,0,286.8,14484,283.71,288.15,False,0,43.7177124,-79.3310852
34_0_34C,8789,34,true,1585522791,161,0,286.8,14484,283.71,288.15,False,0,43.7177124,-79.3310852
34_0_34C,8789,34,true,1585522820,156,39,286.8,14484,283.71,288.15,False,0,43.7160197,-79.3301093
34_0_34C,8789,34,true,1585522821,156,39,286.8,14484,283.71,288.15,False,0,43.7160197,-79.3301093
34_0_34C,8789,34,true,1585522851,157,39,286.61,14484,283.15,288.15,False,0,43.7145618,-79.3274902
34_0_34C,8789,34,true,1585525371,111,10,285.42,14484,283.15,287.15,False,0,43.7050933,-79.3985671
34_0_34C,8789,34,true,1585525372,111,10,285.42,14484,283.15,287.15,False,0,43.7050933,-79.3985671
34_0_34C,8789,34,true,1585525402,216,0,285.42,14484,283.15,287.15,False,0,43.7050933,-79.3985671
34_0_34C,8789,34,true,1585525401,216,0,285.42,14484,283.15,287.15,False,0,43.7050933,-79.3985671
34_0_34C,8789,34,true,1585525432,216,0,285.42,14484,283.15,287.15,False,0,43.7050933,-79.3985671
34_0_34C,8789,34,true,1585525461,216,0,285.42,14484,283.15,287.15,False,0,43.7050933,-79.3985671
34_0_34C,8789,34,true,1585525462,216,0,285.42,14484,283.15,287.15,False,0,43.7050933,-79.3985671
34_0_34C,8789,34,true,1585525492,216,0,285.42,14484,283.15,287.15,False,0,43.7050933,-79.3985671
34_0_34C,8789,34,true,1585525491,216,0,285.42,14484,283.15,287.15,False,0,43.7050933,-79.3985671
34_0_34C,8789,34,true,1585525521,216,0,285.42,14484,283.15,287.15,False,0,43.7050933,-79.3985671
34_0_34C,8789,34,true,1585525522,216,0,285.42,14484,283.15,287.15,False,0,43.7050933,-79.3985671
34_0_34C,8789,34,true,1585525552,216,0,285.42,14484,283.15,287.15,False,0,43.7050933,-79.3985671
34_0_34C,8789,34,true,1585525551,216,0,285.42,14484,283.15,287.15,False,0,43.7050933,-79.3985671
34_0_34C,8789,34,true,1585525582,216,0,285.42,14484,283.15,287.15,False,0,43.7050933,-79.3985671
34_0_34C,8789,34,true,1585525611,277,16,285.42,14484,283.15,287.15,False,0,43.7050933,-79.3985671
34_0_34C,8789,34,true,1585525612,277,16,285.42,14484,283.15,287.15,False,0,43.7050933,-79.3985671
34_0_34C,8789,34,true,1585525641,352,5,285.42,14484,283.15,287.15,False,0,43.7062149,-79.4001083
34_0_34C,8789,34,true,1585525642,352,5,285.42,14484,283.15,287.15,False,0,43.7062149,-79.4001083
34_0_34C,8789,34,true,1585525671,8,5,285.42,14484,283.15,287.15,False,0,43.7062301,-79.4001083
34_0_34C,8789,34,true,1585525702,73,3,285.42,14484,283.15,287.15,False,0,43.7065353,-79.3993072
34_0_34C,8789,34,true,1585525701,73,3,285.42,14484,283.15,287.15,False,0,43.7065353,-79.3993072
34_0_34C,8789,34,true,1585525731,72,20,285.42,14484,283.15,287.15,False,0,43.7068786,-79.3976364
34_0_34C,8789,34,true,1585525732,72,20,285.2,14484,282.59,287.15,False,0,43.7068786,-79.3976364
34_0_34C,8789,34,true,1585525762,72,16,285.2,14484,282.59,287.15,False,0,43.7072067,-79.3956069
34_0_34C,8789,34,true,1585525761,72,16,285.2,14484,282.59,287.15,False,0,43.7072067,-79.3956069
34_0_34C,8789,34,true,1585525791,74,0,285.35,14484,282.59,287.15,False,0,43.707756,-79.3929367
34_0_34C,8789,34,true,1585525792,74,0,285.35,14484,282.59,287.15,False,0,43.707756,-79.3929367
34_0_34C,8789,34,true,1585525823,75,16,285.35,14484,282.59,287.15,False,0,43.7081031,-79.3916091
34_0_34C,8789,34,true,1585525852,73,19,285.35,14484,282.59,287.15,False,0,43.708538,-79.3894577
34_0_34C,8789,34,true,1585525851,73,19,285.35,14484,282.59,287.15,False,0,43.708538,-79.3894577
34_0_34C,8789,34,true,1585525882,74,10,285.35,14484,282.59,287.15,False,0,43.7087974,-79.3881454
34_0_34C,8789,34,true,1585525881,74,10,285.35,14484,282.59,287.15,False,0,43.7087974,-79.3881454
34_0_34C,8789,34,true,1585525911,69,30,285.35,14484,282.59,287.15,False,0,43.7092819,-79.3857116
34_0_34C,8789,34,true,1585525912,69,30,285.35,14484,282.59,287.15,False,0,43.7092819,-79.3857116
34_0_34C,8789,34,true,1585525942,74,28,285.18,14484,282.59,287.15,False,0,43.7098388,-79.3829498
34_0_34C,8789,34,true,1585525941,74,28,285.18,14484,282.59,287.15,False,0,43.7098388,-79.3829498
34_0_34C,8789,34,true,1585525972,74,0,285.18,14484,282.59,287.15,False,0,43.7099151,-79.3823394
34_0_34C,8789,34,true,1585525971,74,0,285.18,14484,282.59,287.15,False,0,43.7099151,-79.3823394
34_0_34C,8789,34,true,1585526002,73,22,285.18,14484,282.59,287.15,False,0,43.7100067,-79.3821258
34_0_34C,8789,34,true,1585526001,73,22,285.18,14484,282.59,287.15,False,0,43.7100067,-79.3821258
34_0_34C,8789,34,true,1585526031,75,19,285.18,14484,282.59,287.15,False,0,43.7107316,-79.3785134
34_0_34C,8789,34,true,1585526032,75,19,285.18,14484,282.59,287.15,False,0,43.7107316,-79.3785134
34_0_34C,8789,34,true,1585526062,72,3,285.18,14484,282.59,287.15,False,0,43.7109169,-79.3776495
34_0_34C,8789,34,true,1585526061,72,3,285.18,14484,282.59,287.15,False,0,43.7109169,-79.3776495
34_0_34C,8789,34,true,1585526092,75,0,285.18,14484,282.59,287.15,False,0,43.7109247,-79.3776132
34_0_34C,8789,34,true,1585526122,72,20,285.18,14484,282.59,287.15,False,0,43.7109988,-79.3772493
34_0_34C,8789,34,true,1585526151,74,22,285.18,14484,282.59,287.15,False,0,43.7111983,-79.3760203
34_0_34C,8789,34,true,1585526152,74,22,285.18,14484,282.59,287.15,False,0,43.7111983,-79.3760203
34_0_34C,8789,34,true,1585526182,74,33,285.19,14484,282.59,287.15,False,0,43.7125407,-79.3695602
34_0_34C,8789,34,true,1585526181,74,33,285.19,14484,282.59,287.15,False,0,43.7125407,-79.3695602
34_0_34C,8789,34,true,1585526212,72,33,285.19,14484,282.59,287.15,False,0,43.7130409,-79.3671367
34_0_34C,8789,34,true,1585526211,72,33,285.19,14484,282.59,287.15,False,0,43.7130409,-79.3671367
34_0_34C,8789,34,true,1585526242,75,0,285.2,14484,282.59,287.15,False,0,43.7134963,-79.3649767
34_0_34C,8789,34,true,1585526241,75,0,285.2,14484,282.59,287.15,False,0,43.7134963,-79.3649767
34_0_34C,8789,34,true,1585526272,75,0,285.2,14484,282.59,287.15,False,0,43.7134963,-79.3649767
34_0_34C,8789,34,true,1585526271,75,0,285.2,14484,282.59,287.15,False,0,43.7134963,-79.3649767
34_0_34C,8789,34,true,1585526301,75,31,285.2,14484,282.59,287.15,False,0,43.7137703,-79.3634385
34_0_34C,8789,34,true,1585526302,75,31,285.2,14484,282.59,287.15,False,0,43.7137703,-79.3634385
34_0_34C,8789,34,true,1585526332,75,8,285.2,14484,282.59,287.15,False,0,43.7139749,-79.362365
34_0_34C,8789,34,true,1585526361,79,6,285.2,14484,282.59,287.15,False,0,43.7144584,-79.3599014
34_0_34C,8789,34,true,1585526362,79,6,285.2,14484,282.59,287.15,False,0,43.7144584,-79.3599014
34_0_34C,8789,34,true,1585526392,69,24,285.2,14484,282.59,287.15,False,0,43.714625,-79.3596212
34_0_34C,8789,34,true,1585526391,69,24,285.2,14484,282.59,287.15,False,0,43.714625,-79.3596212
34_0_34C,8789,34,true,1585526422,77,29,285.13,14484,282.59,287.15,False,0,43.715299,-79.3565981
34_0_34C,8789,34,true,1585526421,77,29,285.13,14484,282.59,287.15,False,0,43.715299,-79.3565981
34_0_34C,8789,34,true,1585526451,60,23,285.2,14484,282.59,287.15,False,0,43.716081,-79.3531015
34_0_34C,8789,34,true,1585526452,60,23,285.2,14484,282.59,287.15,False,0,43.716081,-79.3531015
34_0_34C,8789,34,true,1585526482,67,20,285.2,14484,282.59,287.15,False,0,43.716938,-79.3503832
34_0_34C,8789,34,true,1585526481,67,20,285.2,14484,282.59,287.15,False,0,43.716938,-79.3503832
34_0_34C,8789,34,true,1585526512,67,34,285.2,14484,282.59,287.15,False,0,43.7177779,-79.3475522
34_0_34C,8789,34,true,1585526542,63,22,285.19,14484,282.59,287.15,False,0,43.7189183,-79.3438977
34_0_34C,8789,34,true,1585526541,63,22,285.19,14484,282.59,287.15,False,0,43.7189183,-79.3438977
34_0_34C,8789,34,true,1585526572,66,37,285.19,14484,282.59,287.15,False,0,43.7199513,-79.3405707
34_0_34C,8789,34,true,1585526571,66,37,285.19,14484,282.59,287.15,False,0,43.7199513,-79.3405707
34_0_34C,8789,34,true,1585526601,5,0,285.19,14484,282.59,287.15,False,0,43.7206562,-79.3389278
34_0_34C,8789,34,true,1585526602,5,0,285.03,14484,282.59,287.15,False,0,43.7206562,-79.3389278
34_0_34C,8789,34,true,1585526632,5,0,285.03,14484,282.59,287.15,False,0,43.7206562,-79.3389278
34_0_34C,8789,34,true,1585526631,5,0,285.03,14484,282.59,287.15,False,0,43.7206562,-79.3389278
34_0_34C,8789,34,true,1585526661,67,29,285.03,14484,282.59,287.15,False,0,43.7215754,-79.3390301
34_0_34C,8789,34,true,1585526662,67,29,285.03,14484,282.59,287.15,False,0,43.7215754,-79.3390301
34_0_34C,8789,34,true,1585526692,134,8,285.03,14484,282.59,287.15,False,0,43.72113,-79.3356616
34_0_34C,8789,34,true,1585526691,134,8,285.03,14484,282.59,287.15,False,0,43.72113,-79.3356616
34_0_34C,8789,34,true,1585526811,0,17,285.03,14484,282.59,287.15,False,0,43.7204322,-79.3390502
34_0_34C,8789,34,true,1585526812,0,17,285.03,14484,282.59,287.15,False,0,43.7204322,-79.3390502
34_0_34C,8789,34,true,1585526842,69,0,285.03,14484,282.59,287.15,False,0,43.7204322,-79.3390502
34_0_34C,8789,34,true,1585526841,69,0,285.03,14484,282.59,287.15,False,0,43.7204322,-79.3390502
34_0_34C,8789,34,true,1585526872,344,27,285.03,14484,282.59,287.15,False,0,43.7210197,-79.339035
34_0_34C,8789,34,true,1585526902,5,5,285.03,14484,282.59,287.15,False,0,43.7229576,-79.3394241
34_0_34C,8789,34,true,1585526932,81,26,285.03,14484,282.59,287.15,False,0,43.7232704,-79.3376312
34_0_34C,8789,34,true,1585526962,52,29,285.05,14484,282.59,287.15,False,0,43.7239418,-79.3349609
34_0_34C,8789,34,true,1585526992,31,28,285.05,14484,282.59,287.15,False,0,43.7248382,-79.3340682
34_0_34C,8789,34,true,1585527024,71,34,285.06,14484,282.59,287.15,False,0,43.7264404,-79.331871
34_0_34C,8789,34,true,1585527052,70,21,285.06,14484,282.59,287.15,False,0,43.727066,-79.3286819
34_0_34C,8789,34,true,1585527082,357,26,285.06,14484,282.59,287.15,False,0,43.7284851,-79.3283157
34_0_34C,8789,34,true,1585527112,356,21,285.06,14484,282.59,287.15,False,0,43.7297058,-79.3284149
34_0_34C,8789,34,true,1585527142,177,18,285.06,14484,282.59,287.15,False,0,43.7298507,-79.3284606
34_0_34C,8789,34,true,1585527141,177,18,285.06,14484,282.59,287.15,False,0,43.7298507,-79.3284606
34_0_34C,8789,34,true,1585527172,174,20,285.06,14484,282.59,287.15,False,0,43.7282981,-79.3283157
34_0_34C,8789,34,true,1585527202,125,0,285.06,14484,282.59,287.15,False,0,43.7278213,-79.3281097
34_0_34C,8789,34,true,1585527232,125,0,285.06,14484,282.59,287.15,False,0,43.7274818,-79.3278579
34_0_34C,8789,34,true,1585527261,152,9,285.06,14484,282.59,287.15,False,0,43.7274818,-79.3278579
34_0_34C,8789,34,true,1585527262,152,9,285.06,14484,282.59,287.15,False,0,43.7274818,-79.3278579
34_0_34C,8789,34,true,1585527292,140,31,285.06,14484,282.59,287.15,False,0,43.725212,-79.3259658
34_0_34C,8789,34,true,1585527322,176,20,285.05,14484,282.59,287.15,False,0,43.7233848,-79.324562
34_0_34C,8789,34,true,1585527352,239,28,284.85,14484,282.04,287.15,False,0,43.7225608,-79.3270263
34_0_34C,8789,34,true,1585527382,162,32,284.85,14484,282.04,287.15,False,0,43.7199935,-79.3280258
34_0_34C,8789,34,true,1585527412,253,32,284.85,14484,282.04,287.15,False,0,43.7189369,-79.3289871
34_0_34C,8789,34,true,1585527442,199,7,284.85,14484,282.04,287.15,False,0,43.7183532,-79.3313903
34_0_34C,8789,34,true,1585527472,158,12,284.85,14484,282.04,287.15,False,0,43.7167282,-79.3304672
34_0_34C,8789,34,true,1585527502,158,0,284.85,14484,282.04,287.15,False,0,43.7161216,-79.3301773
34_0_34C,8789,34,true,1585527532,134,17,284.85,14484,282.04,287.15,False,0,43.7154832,-79.3297566
34_0_34C,8789,34,true,1585527562,153,14,284.85,14484,282.04,287.15,False,0,43.7154104,-79.3281124
34_0_34C,8789,34,true,1585527592,157,25,284.73,14484,282.04,287.15,False,0,43.7141728,-79.3272649
34_0_34C,8789,34,true,1585529723,350,8,283.87,14484,282.04,285.37,False,0,43.7062149,-79.4001083
34_0_34C,8789,34,true,1585529722,350,8,283.87,14484,282.04,285.37,False,0,43.7062149,-79.4001083
34_0_34C,8789,34,true,1585529752,5,6,283.87,14484,282.04,285.37,False,0,43.7062301,-79.4001083
34_0_34C,8789,34,true,1585529753,5,6,283.87,14484,282.04,285.37,False,0,43.7062301,-79.4001083
34_0_34C,8789,34,true,1585529785,77,5,283.87,14484,282.04,285.37,False,0,43.7066307,-79.3988265
34_0_34C,8789,34,true,1585529784,77,5,283.87,14484,282.04,285.37,False,0,43.7066307,-79.3988265
34_0_34C,8789,34,true,1585529812,75,25,283.87,14484,282.04,285.37,False,0,43.7070236,-79.3969497
34_0_34C,8789,34,true,1585529813,75,25,283.87,14484,282.04,285.37,False,0,43.7070236,-79.3969497
34_0_34C,8789,34,true,1585529843,72,26,283.86,14484,282.04,285.37,False,0,43.7076263,-79.3938751
34_0_34C,8789,34,true,1585529842,72,26,283.86,14484,282.04,285.37,False,0,43.7076263,-79.3938751
34_0_34C,8789,34,true,1585529873,74,0,283.86,14484,282.04,285.37,False,0,43.707756,-79.3929367
34_0_34C,8789,34,true,1585529872,74,0,283.86,14484,282.04,285.37,False,0,43.707756,-79.3929367
34_0_34C,8789,34,true,1585529902,77,19,283.86,14484,282.04,285.37,False,0,43.708211,-79.3910952
34_0_34C,8789,34,true,1585529903,77,19,283.86,14484,282.04,285.37,False,0,43.708211,-79.3910952
34_0_34C,8789,34,true,1585529932,70,20,283.86,14484,282.04,285.37,False,0,43.7086351,-79.3889302
34_0_34C,8789,34,true,1585529933,70,20,283.86,14484,282.04,285.37,False,0,43.7086351,-79.3889302
34_0_34C,8789,34,true,1585529963,74,0,283.86,14484,282.04,285.37,False,0,43.7088394,-79.3876647
34_0_34C,8789,34,true,1585529993,72,29,283.86,14484,282.04,285.37,False,0,43.7091759,-79.386128
34_0_34C,8789,34,true,1585529992,72,29,283.86,14484,282.04,285.37,False,0,43.7091759,-79.386128
34_0_34C,8789,34,true,1585530022,73,33,283.83,14484,282.04,285.37,False,0,43.7100107,-79.382116
34_0_34C,8789,34,true,1585530023,73,33,283.83,14484,282.04,285.37,False,0,43.7100107,-79.382116
34_0_34C,8789,34,true,1585530053,77,22,283.83,14484,282.04,285.37,False,0,43.7107505,-79.3784075
34_0_34C,8789,34,true,1585530083,75,0,283.83,14484,282.04,285.37,False,0,43.710969,-79.3774104
34_0_34C,8789,34,true,1585530112,75,0,283.83,14484,282.04,285.37,False,0,43.710969,-79.3774104
34_0_34C,8789,34,true,1585530142,75,0,283.83,14484,282.04,285.37,False,0,43.710969,-79.3774104
34_0_34C,8789,34,true,1585530143,75,0,283.83,14484,282.04,285.37,False,0,43.710969,-79.3774104
34_0_34C,8789,34,true,1585530173,72,41,283.75,14484,282.04,285.37,False,0,43.7116347,-79.3742559
34_0_34C,8789,34,true,1585530203,74,39,283.75,14484,282.04,285.37,False,0,43.7123351,-79.3703541
34_0_34C,8789,34,true,1585530233,73,32,283.75,14484,282.04,285.37,False,0,43.7130546,-79.3671035
34_0_34C,8789,34,true,1585530263,75,0,283.85,14484,282.04,285.37,False,0,43.7135376,-79.3648205
34_0_34C,8789,34,true,1585530262,75,0,283.85,14484,282.04,285.37,False,0,43.7135376,-79.3648205
34_0_34C,8789,34,true,1585530293,74,31,283.85,14484,282.04,285.37,False,0,43.7137807,-79.363374
34_0_34C,8789,34,true,1585530323,76,24,283.85,14484,282.04,285.37,False,0,43.714356,-79.3605157
34_0_34C,8789,34,true,1585530353,67,0,283.85,14484,282.04,285.37,False,0,43.7145631,-79.3597269
34_0_34C,8789,34,true,1585530382,66,30,283.85,14484,282.04,285.37,False,0,43.7147557,-79.3591182
34_0_34C,8789,34,true,1585530383,66,30,283.85,14484,282.04,285.37,False,0,43.7147557,-79.3591182
34_0_34C,8789,34,true,1585530413,78,30,283.73,14484,282.04,285.37,False,0,43.7153975,-79.3560517
34_0_34C,8789,34,true,1585530412,78,30,283.73,14484,282.04,285.37,False,0,43.7153975,-79.3560517
34_0_34C,8789,34,true,1585530443,68,28,283.73,14484,282.04,285.37,False,0,43.7162361,-79.3525772
34_0_34C,8789,34,true,1585530472,65,30,283.73,14484,282.04,285.37,False,0,43.7169814,-79.3496387
34_0_34C,8789,34,true,1585530502,65,33,283.73,14484,282.04,285.37,False,0,43.7181478,-79.3463453
34_0_34C,8789,34,true,1585530503,65,33,283.73,14484,282.04,285.37,False,0,43.7181478,-79.3463453
