dir,id,route,predable,time,hdg,spd,temp,vis,t_min,t_max,snow,rain,lat,lon
34_1_34C,8648,34,true,1585442302,247,38,279.19,14484,277.59,280.93,False,0,43.721615,-79.3357666
34_1_34C,8648,34,true,1585442301,247,38,279.19,14484,277.59,280.93,False,0,43.721615,-79.3357666
34_1_34C,8648,34,true,1585442332,259,0,279.19,14484,277.59,280.93,False,0,43.7208683,-79.3385283
34_1_34C,8648,34,true,1585442331,259,0,279.19,14484,277.59,280.93,False,0,43.7208683,-79.3385283
34_1_34C,8648,34,true,1585442362,246,34,279.19,14484,277.59,280.93,False,0,43.7204716,-79.3396716
34_1_34C,8648,34,true,1585442361,246,34,279.19,14484,277.59,280.93,False,0,43.7204716,-79.3396716
34_1_34C,8648,34,true,1585442391,243,41,279.02,14484,277.59,280.37,False,0,43.719385,-79.3428816
34_1_34C,8648,34,true,1585442392,243,41,279.02,14484,277.59,280.37,False,0,43.719385,-79.3428816
34_1_34C,8648,34,true,1585442421,246,41,279.01,14484,277.59,280.37,False,0,43.7179216,-79.3473783
34_1_34C,8648,34,true,1585442422,246,41,279.01,14484,277.59,280.37,False,0,43.7179216,-79.3473783
34_1_34C,8648,34,true,1585442452,239,42,279.01,14484,277.59,280.37,False,0,43.7165483,-79.351735
34_1_34C,8648,34,true,1585442451,239,42,279.01,14484,277.59,280.37,False,0,43.7165483,-79.351735
34_1_34C,8648,34,true,1585442482,266,33,279.06,14484,277.59,280.37,False,0,43.7155016,-79.355775
34_1_34C,8648,34,true,1585442511,253,41,278.94,14484,277.59,279.82,False,0,43.7145866,-79.36006
34_1_34C,8648,34,true,1585442512,253,41,278.94,14484,277.59,279.82,False,0,43.7145866,-79.36006
34_1_34C,8648,34,true,1585442542,254,21,278.94,14484,277.59,279.82,False,0,43.713755,-79.3641116
34_1_34C,8648,34,true,1585442572,254,0,278.94,14484,277.59,279.82,False,0,43.7136816,-79.364485
34_1_34C,8648,34,true,1585442571,254,0,278.94,14484,277.59,279.82,False,0,43.7136816,-79.364485
34_1_34C,8648,34,true,1585442601,253,37,279.05,14484,277.59,280.37,False,0,43.7129383,-79.36811
34_1_34C,8648,34,true,1585442602,253,37,279.05,14484,277.59,280.37,False,0,43.7129383,-79.36811
34_1_34C,8648,34,true,1585442632,255,36,279.05,14484,277.59,280.37,False,0,43.7121333,-79.3720483
34_1_34C,8648,34,true,1585442631,255,36,279.05,14484,277.59,280.37,False,0,43.7121333,-79.3720483
34_1_34C,8648,34,true,1585442662,247,26,279.05,14484,277.59,280.37,False,0,43.71132,-79.3759283
34_1_34C,8648,34,true,1585442661,247,26,279.05,14484,277.59,280.37,False,0,43.71132,-79.3759283
34_1_34C,8648,34,true,1585442692,255,0,279.05,14484,277.59,280.37,False,0,43.7111466,-79.3764766
34_1_34C,8648,34,true,1585442722,255,0,279.05,14484,277.59,280.37,False,0,43.711135,-79.3765066
34_1_34C,8648,34,true,1585442721,255,0,279.05,14484,277.59,280.37,False,0,43.711135,-79.3765066
34_1_34C,8648,34,true,1585442751,253,23,279.05,14484,277.59,280.37,False,0,43.7110066,-79.377095
34_1_34C,8648,34,true,1585442752,253,23,279.05,14484,277.59,280.37,False,0,43.7110066,-79.377095
34_1_34C,8648,34,true,1585442781,253,40,279.05,14484,277.59,280.37,False,0,43.71034,-79.3807166
34_1_34C,8648,34,true,1585442782,253,40,279.05,14484,277.59,280.37,False,0,43.71034,-79.3807166
34_1_34C,8648,34,true,1585442812,254,40,278.94,14484,277.59,279.82,False,0,43.70946,-79.385075
34_1_34C,8648,34,true,1585442811,254,40,278.94,14484,277.59,279.82,False,0,43.70946,-79.385075
34_1_34C,8648,34,true,1585442841,245,19,278.94,14484,277.59,279.82,False,0,43.70875,-79.3887633
34_1_34C,8648,34,true,1585442842,245,19,278.94,14484,277.59,279.82,False,0,43.70875,-79.3887633
34_1_34C,8648,34,true,1585442872,254,0,278.94,14484,277.59,279.82,False,0,43.7084116,-79.3898383
34_1_34C,8648,34,true,1585442902,254,0,278.94,14484,277.59,279.82,False,0,43.7084116,-79.3898383
34_1_34C,8648,34,true,1585442901,254,0,278.94,14484,277.59,279.82,False,0,43.7084116,-79.3898383
34_1_34C,8648,34,true,1585442932,254,22,278.94,14484,277.59,279.82,False,0,43.70821,-79.3907933
34_1_34C,8648,34,true,1585442931,254,22,278.94,14484,277.59,279.82,False,0,43.70821,-79.3907933
34_1_34C,8648,34,true,1585442962,254,0,278.94,14484,277.59,279.82,False,0,43.7079166,-79.39251
34_1_34C,8648,34,true,1585442961,254,0,278.94,14484,277.59,279.82,False,0,43.7079166,-79.39251
34_1_34C,8648,34,true,1585442992,254,31,278.94,14484,277.59,279.82,False,0,43.7077633,-79.3932533
34_1_34C,8648,34,true,1585443022,253,25,279.05,14484,277.59,280.37,False,0,43.7070733,-79.3964066
34_1_34C,8648,34,true,1585443021,253,25,279.05,14484,277.59,280.37,False,0,43.7070733,-79.3964066
34_1_34C,8648,34,true,1585443051,253,0,279.02,14484,277.59,280.37,False,0,43.7068416,-79.3977516
34_1_34C,8648,34,true,1585443052,253,0,279.02,14484,277.59,280.37,False,0,43.7068416,-79.3977516
34_1_34C,8648,34,true,1585443081,257,11,279.02,14484,277.59,280.37,False,0,43.7065033,-79.399815
34_1_34C,8648,34,true,1585443082,257,11,279.02,14484,277.59,280.37,False,0,43.7065033,-79.399815
34_1_34C,8648,34,true,1585443112,102,13,279.02,14484,277.59,280.37,False,0,43.7062301,-79.4001083
34_1_34C,8648,34,true,1585443111,102,13,279.02,14484,277.59,280.37,False,0,43.7062301,-79.4001083
34_1_34C,8648,34,true,1585443142,173,0,279.02,14484,277.59,280.37,False,0,43.7051666,-79.3993133
34_1_34C,8648,34,true,1585443141,173,0,279.02,14484,277.59,280.37,False,0,43.7051666,-79.3993133
34_1_34C,8648,34,true,1585443172,173,0,279.02,14484,277.59,280.37,False,0,43.7052383,-79.3993716
34_1_34C,8648,34,true,1585443171,173,0,279.02,14484,277.59,280.37,False,0,43.7052383,-79.3993716
34_1_34C,8648,34,true,1585443202,173,0,279.02,14484,277.59,280.37,False,0,43.7052383,-79.3993716
34_1_34C,8648,34,true,1585443201,173,0,279.02,14484,277.59,280.37,False,0,43.7052383,-79.3993716
34_1_34C,8648,34,true,1585443232,173,0,279.02,14484,277.59,280.37,False,0,43.7052383,-79.3993716
34_1_34C,8648,34,true,1585443231,173,0,279.02,14484,277.59,280.37,False,0,43.7052383,-79.3993716
34_1_34C,8648,34,true,1585443261,173,0,279.02,14484,277.59,280.37,False,0,43.7052383,-79.3993716
34_1_34C,8648,34,true,1585443262,173,0,279.02,14484,277.59,280.37,False,0,43.7052383,-79.3993716
34_1_34C,8648,34,true,1585443292,173,0,279.02,14484,277.59,280.37,False,0,43.7052383,-79.3993716
34_1_34C,8648,34,true,1585443291,173,0,279.02,14484,277.59,280.37,False,0,43.7052383,-79.3993716
34_1_34C,8648,34,true,1585443322,173,0,279.02,14484,277.59,280.37,False,0,43.7052383,-79.3993716
34_1_34C,8648,34,true,1585443321,173,0,279.02,14484,277.59,280.37,False,0,43.7052383,-79.3993716
34_1_34C,8648,34,true,1585443351,173,0,279.02,14484,277.59,280.37,False,0,43.7052383,-79.3993716
34_1_34C,8648,34,true,1585443352,173,0,279.02,14484,277.59,280.37,False,0,43.7052383,-79.3993716
34_1_34C,8648,34,true,1585443382,173,0,279.02,14484,277.59,280.37,False,0,43.7052154,-79.3994445
34_1_34C,8648,34,true,1585443412,173,0,279.02,14484,277.59,280.37,False,0,43.7052154,-79.3994445
34_1_34C,8648,34,true,1585443411,173,0,279.02,14484,277.59,280.37,False,0,43.7052154,-79.3994445
34_1_34C,8648,34,true,1585443442,173,0,279.02,14484,277.59,280.37,False,0,43.7052154,-79.3994445
34_1_34C,8648,34,true,1585443441,173,0,279.02,14484,277.59,280.37,False,0,43.7052154,-79.3994445
34_1_34C,8648,34,true,1585443472,173,0,279.02,14484,277.59,280.37,False,0,43.7052154,-79.3994445
34_1_34C,8648,34,true,1585443502,173,0,279.02,14484,277.59,280.37,False,0,43.7052154,-79.3994445
34_1_34C,8648,34,true,1585444132,253,0,279,14484,277.59,280.37,False,0,43.7048568,-79.3993835
34_1_34C,8648,34,true,1585444162,114,0,278.99,14484,277.59,280.37,False,0,43.7055282,-79.39962
34_1_34C,8648,34,true,1585444192,173,0,278.99,14484,277.59,280.37,False,0,43.7050361,-79.399414
34_1_34C,8648,34,true,1585444222,173,0,278.99,14484,277.59,280.37,False,0,43.7055511,-79.3996887
