dir,id,route,predable,time,hdg,spd,temp,vis,t_min,t_max,snow,rain,lat,lon
34_0_34A,8689,34,true,1585486826,216,0,278.49,9656,276.48,280.37,False,2,43.7048933,-79.3991483
34_0_34A,8689,34,true,1585486827,216,0,278.49,9656,276.48,280.37,False,2,43.7048933,-79.3991483
34_0_34A,8689,34,true,1585486856,216,0,278.49,9656,276.48,280.37,False,2,43.7048933,-79.3991483
34_0_34A,8689,34,true,1585486886,216,0,278.49,9656,276.48,280.37,False,2,43.7048933,-79.3991483
34_0_34A,8689,34,true,1585486887,216,0,278.49,9656,276.48,280.37,False,2,43.7048933,-79.3991483
34_0_34A,8689,34,true,1585486918,216,0,278.49,9656,276.48,280.37,False,2,43.7048933,-79.3991483
34_0_34A,8689,34,true,1585486919,216,0,278.49,9656,276.48,280.37,False,2,43.7048933,-79.3991483
34_0_34A,8689,34,true,1585486947,216,0,278.49,9656,276.48,280.37,False,2,43.7048933,-79.3991483
34_0_34A,8689,34,true,1585486946,216,0,278.49,9656,276.48,280.37,False,2,43.7048933,-79.3991483
34_0_34A,8689,34,true,1585486976,216,0,278.49,9656,276.48,280.37,False,2,43.7048933,-79.3991483
34_0_34A,8689,34,true,1585487006,346,9,278.47,8047,276.48,280.37,False,2,43.7052574,-79.3986129
34_0_34A,8689,34,true,1585487007,346,9,278.47,8047,276.48,280.37,False,2,43.7052574,-79.3986129
34_0_34A,8689,34,true,1585487036,216,1,278.47,8047,276.48,280.37,False,2,43.7052574,-79.3986129
34_0_34A,8689,34,true,1585487037,216,1,278.47,8047,276.48,280.37,False,2,43.7052574,-79.3986129
34_0_34A,8689,34,true,1585487067,216,0,278.47,8047,276.48,280.37,False,2,43.7052574,-79.3986129
34_0_34A,8689,34,true,1585487066,216,0,278.47,8047,276.48,280.37,False,2,43.7052574,-79.3986129
34_0_34A,8689,34,true,1585487096,216,0,278.47,8047,276.48,280.37,False,2,43.7052574,-79.3986129
34_0_34A,8689,34,true,1585487097,216,0,278.47,8047,276.48,280.37,False,2,43.7052574,-79.3986129
34_0_34A,8689,34,true,1585487127,317,11,278.47,8047,276.48,280.37,False,2,43.7052574,-79.3986129
34_0_34A,8689,34,true,1585487126,317,11,278.47,8047,276.48,280.37,False,2,43.7052574,-79.3986129
34_0_34A,8689,34,true,1585487156,357,17,278.47,8047,276.48,280.37,False,2,43.7058563,-79.4000854
34_0_34A,8689,34,true,1585487157,357,17,278.47,8047,276.48,280.37,False,2,43.7058563,-79.4000854
34_0_34A,8689,34,true,1585487187,38,13,278.47,8047,276.48,280.37,False,2,43.7062301,-79.4001083
34_0_34A,8689,34,true,1585487186,38,13,278.47,8047,276.48,280.37,False,2,43.7062301,-79.4001083
34_0_34A,8689,34,true,1585487216,74,29,278.53,8047,276.48,280.37,False,2,43.7068786,-79.3976364
34_0_34A,8689,34,true,1585487217,74,29,278.53,8047,276.48,280.37,False,2,43.7068786,-79.3976364
34_0_34A,8689,34,true,1585487246,76,0,278.53,8047,276.48,280.37,False,2,43.7072067,-79.3956069
34_0_34A,8689,34,true,1585487247,76,0,278.53,8047,276.48,280.37,False,2,43.7072067,-79.3956069
34_0_34A,8689,34,true,1585487277,73,17,278.53,8047,276.48,280.37,False,2,43.7072757,-79.3954524
34_0_34A,8689,34,true,1585487276,73,17,278.53,8047,276.48,280.37,False,2,43.7072757,-79.3954524
34_0_34A,8689,34,true,1585487306,73,24,278.49,8047,276.48,280.37,False,2,43.7078266,-79.3927587
34_0_34A,8689,34,true,1585487307,73,24,278.49,8047,276.48,280.37,False,2,43.7078266,-79.3927587
34_0_34A,8689,34,true,1585487336,73,20,278.49,8047,276.48,280.37,False,2,43.7084121,-79.3901214
34_0_34A,8689,34,true,1585487367,74,36,278.49,8047,276.48,280.37,False,2,43.7090151,-79.3869228
34_0_34A,8689,34,true,1585487366,74,36,278.49,8047,276.48,280.37,False,2,43.7090151,-79.3869228
34_0_34A,8689,34,true,1585487397,73,35,278.55,8047,276.48,280.37,False,2,43.7100044,-79.3821311
34_0_34A,8689,34,true,1585487396,73,35,278.55,8047,276.48,280.37,False,2,43.7100044,-79.3821311
34_0_34A,8689,34,true,1585487426,73,33,278.55,8047,276.48,280.37,False,2,43.7104837,-79.3795873
34_0_34A,8689,34,true,1585487427,73,33,278.55,8047,276.48,280.37,False,2,43.7104837,-79.3795873
34_0_34A,8689,34,true,1585487456,75,0,278.55,8047,276.48,280.37,False,2,43.7109004,-79.3777284
34_0_34A,8689,34,true,1585487486,75,0,278.55,8047,276.48,280.37,False,2,43.7109004,-79.3777284
34_0_34A,8689,34,true,1585487516,73,30,278.55,8047,276.48,280.37,False,2,43.7110413,-79.3769921
34_0_34A,8689,34,true,1585487546,75,38,278.56,8047,276.48,280.37,False,2,43.7118381,-79.37334
34_0_34A,8689,34,true,1585487576,74,28,278.56,8047,276.48,280.37,False,2,43.7125482,-79.3695429
34_0_34A,8689,34,true,1585487606,70,39,278.56,8047,276.48,280.37,False,2,43.7132723,-79.3659786
34_0_34A,8689,34,true,1585487637,75,0,278.57,8047,276.48,280.37,False,2,43.7135261,-79.3648708
34_0_34A,8689,34,true,1585487636,75,0,278.57,8047,276.48,280.37,False,2,43.7135261,-79.3648708
34_0_34A,8689,34,true,1585487666,75,0,278.57,8047,276.48,280.37,False,2,43.7135261,-79.3648708
34_0_34A,8689,34,true,1585487696,77,40,278.57,8047,276.48,280.37,False,2,43.7139733,-79.3623686
34_0_34A,8689,34,true,1585487726,69,40,278.57,8047,276.48,280.37,False,2,43.7148661,-79.3586462
34_0_34A,8689,34,true,1585487756,76,26,278.61,8047,276.48,280.37,False,2,43.7157087,-79.3545485
34_0_34A,8689,34,true,1585487757,76,26,278.61,8047,276.48,280.37,False,2,43.7157087,-79.3545485
34_0_34A,8689,34,true,1585487786,62,19,278.61,8047,276.48,280.37,False,2,43.7161039,-79.3530234
34_0_34A,8689,34,true,1585487787,62,19,278.61,8047,276.48,280.37,False,2,43.7161039,-79.3530234
34_0_34A,8689,34,true,1585487817,66,18,278.61,8047,276.48,280.37,False,2,43.7169405,-79.3503759
34_0_34A,8689,34,true,1585487816,66,18,278.61,8047,276.48,280.37,False,2,43.7169405,-79.3503759
34_0_34A,8689,34,true,1585487846,66,0,278.61,8047,276.48,280.37,False,2,43.7169655,-79.3500417
34_0_34A,8689,34,true,1585487847,66,0,278.61,8047,276.48,280.37,False,2,43.7169655,-79.3500417
34_0_34A,8689,34,true,1585487877,64,16,278.61,8047,276.48,280.37,False,2,43.7169717,-79.3496567
34_0_34A,8689,34,true,1585487876,64,16,278.61,8047,276.48,280.37,False,2,43.7169717,-79.3496567
34_0_34A,8689,34,true,1585487907,64,23,278.61,8047,276.48,280.37,False,2,43.7176926,-79.3478571
34_0_34A,8689,34,true,1585487906,64,23,278.61,8047,276.48,280.37,False,2,43.7176926,-79.3478571
34_0_34A,8689,34,true,1585487937,69,19,278.61,8047,276.48,280.37,False,2,43.7185138,-79.3451628
34_0_34A,8689,34,true,1585487936,69,19,278.61,8047,276.48,280.37,False,2,43.7185138,-79.3451628
34_0_34A,8689,34,true,1585487966,66,17,278.6,8047,277.04,280.37,False,2,43.7191058,-79.3433199
34_0_34A,8689,34,true,1585487967,66,17,278.6,8047,277.04,280.37,False,2,43.7191058,-79.3433199
34_0_34A,8689,34,true,1585488000,67,37,278.6,8047,277.04,280.37,False,2,43.7201896,-79.3398696
34_0_34A,8689,34,true,1585488026,65,0,278.6,8047,277.04,280.37,False,2,43.7206352,-79.3375778
34_0_34A,8689,34,true,1585488027,65,0,278.6,8047,277.04,280.37,False,2,43.7206352,-79.3375778
34_0_34A,8689,34,true,1585488057,64,33,278.6,8047,277.04,280.37,False,2,43.721329,-79.3361448
34_0_34A,8689,34,true,1585488056,64,33,278.6,8047,277.04,280.37,False,2,43.721329,-79.3361448
34_0_34A,8689,34,true,1585488087,67,28,278.65,8047,276.48,280.37,False,2,43.7224362,-79.3322517
34_0_34A,8689,34,true,1585488086,67,28,278.65,8047,276.48,280.37,False,2,43.7224362,-79.3322517
34_0_34A,8689,34,true,1585488116,69,0,278.65,8047,276.48,280.37,False,2,43.7226024,-79.3319459
34_0_34A,8689,34,true,1585488117,69,0,278.65,8047,276.48,280.37,False,2,43.7226024,-79.3319459
34_0_34A,8689,34,true,1585488147,66,8,278.65,8047,276.48,280.37,False,2,43.7226212,-79.3318835
34_0_34A,8689,34,true,1585488146,66,8,278.65,8047,276.48,280.37,False,2,43.7226212,-79.3318835
34_0_34A,8689,34,true,1585488177,69,25,278.65,8047,277.04,280.37,False,2,43.723386,-79.3288132
