dir,id,route,predable,time,hdg,spd,temp,vis,t_min,t_max,snow,rain,lat,lon
34_1_34C,8868,34,true,1585433570,254,7,280.06,14484,276.48,283.15,False,0,43.7135848,-79.3646774
34_1_34C,8868,34,true,1585433569,254,7,280.06,14484,276.48,283.15,False,0,43.7135848,-79.3646774
34_1_34C,8868,34,true,1585433599,254,0,280.04,14484,276.48,283.15,False,0,43.713581,-79.3652038
34_1_34C,8868,34,true,1585433600,254,0,280.04,14484,276.48,283.15,False,0,43.713581,-79.3652038
34_1_34C,8868,34,true,1585433629,253,35,280.04,14484,276.48,283.15,False,0,43.7128696,-79.368396
34_1_34C,8868,34,true,1585433630,253,35,280.04,14484,276.48,283.15,False,0,43.7128696,-79.368396
34_1_34C,8868,34,true,1585433659,254,32,280.04,14484,276.48,283.15,False,0,43.7122872,-79.3713011
34_1_34C,8868,34,true,1585433660,254,32,280.04,14484,276.48,283.15,False,0,43.7122872,-79.3713011
34_1_34C,8868,34,true,1585433689,252,26,280.03,14484,276.48,283.15,False,0,43.711494,-79.3755148
34_1_34C,8868,34,true,1585433690,252,26,280.03,14484,276.48,283.15,False,0,43.711494,-79.3755148
34_1_34C,8868,34,true,1585433719,253,0,280.03,14484,276.48,283.15,False,0,43.7112426,-79.3768234
34_1_34C,8868,34,true,1585433720,253,0,280.03,14484,276.48,283.15,False,0,43.7112426,-79.3768234
34_1_34C,8868,34,true,1585433750,253,0,280.03,14484,276.48,283.15,False,0,43.7112426,-79.3768234
34_1_34C,8868,34,true,1585433749,253,0,280.03,14484,276.48,283.15,False,0,43.7112426,-79.3768234
34_1_34C,8868,34,true,1585433780,253,16,280.03,14484,276.48,283.15,False,0,43.7111663,-79.3769378
34_1_34C,8868,34,true,1585433779,253,16,280.03,14484,276.48,283.15,False,0,43.7111663,-79.3769378
34_1_34C,8868,34,true,1585433809,254,38,280.03,14484,276.48,283.15,False,0,43.7104498,-79.3802452
34_1_34C,8868,34,true,1585433810,254,38,280.03,14484,276.48,283.15,False,0,43.7104498,-79.3802452
34_1_34C,8868,34,true,1585433839,253,15,280.03,14484,276.48,283.15,False,0,43.7100529,-79.3822696
34_1_34C,8868,34,true,1585433840,253,15,280.03,14484,276.48,283.15,False,0,43.7100529,-79.3822696
34_1_34C,8868,34,true,1585433869,253,33,280.02,14484,276.48,283.15,False,0,43.7091952,-79.386143
34_1_34C,8868,34,true,1585433870,253,33,280.02,14484,276.48,283.15,False,0,43.7091952,-79.386143
34_1_34C,8868,34,true,1585433899,254,26,280.02,14484,276.48,283.15,False,0,43.7090478,-79.3871023
34_1_34C,8868,34,true,1585433900,254,26,280.02,14484,276.48,283.15,False,0,43.7090478,-79.3871023
34_1_34C,8868,34,true,1585433930,253,24,280.02,14484,276.48,283.15,False,0,43.7085675,-79.3893055
34_1_34C,8868,34,true,1585433929,253,24,280.02,14484,276.48,283.15,False,0,43.7085675,-79.3893055
34_1_34C,8868,34,true,1585433959,255,26,280.02,14484,276.48,283.15,False,0,43.7080637,-79.3920173
34_1_34C,8868,34,true,1585433960,255,26,280.02,14484,276.48,283.15,False,0,43.7080637,-79.3920173
34_1_34C,8868,34,true,1585433990,255,24,280.02,14484,276.48,283.15,False,0,43.7075327,-79.3946336
34_1_34C,8868,34,true,1585433989,255,24,280.02,14484,276.48,283.15,False,0,43.7075327,-79.3946336
34_1_34C,8868,34,true,1585434019,253,4,280.01,14484,276.48,283.15,False,0,43.707412,-79.3953709
34_1_34C,8868,34,true,1585434020,253,4,280.01,14484,276.48,283.15,False,0,43.707412,-79.3953709
34_1_34C,8868,34,true,1585434049,254,22,280.01,14484,276.48,283.15,False,0,43.7068513,-79.3977665
34_1_34C,8868,34,true,1585434050,254,22,280.01,14484,276.48,283.15,False,0,43.7068513,-79.3977665
34_1_34C,8868,34,true,1585434080,253,0,280.01,14484,276.48,283.15,False,0,43.7064136,-79.3999209
34_1_34C,8868,34,true,1585434079,253,0,280.01,14484,276.48,283.15,False,0,43.7064136,-79.3999209
34_1_34C,8868,34,true,1585434109,165,17,280.01,14484,276.48,283.15,False,0,43.7057882,-79.4001062
34_1_34C,8868,34,true,1585434110,165,17,280.01,14484,276.48,283.15,False,0,43.7057882,-79.4001062
34_1_34C,8868,34,true,1585434139,160,14,279.93,14484,276.48,283.15,False,0,43.7047468,-79.3993621
34_1_34C,8868,34,true,1585434140,160,14,279.93,14484,276.48,283.15,False,0,43.7047468,-79.3993621
34_1_34C,8868,34,true,1585434170,8,0,279.93,14484,276.48,283.15,False,0,43.7042828,-79.3985623
34_1_34C,8868,34,true,1585434169,8,0,279.93,14484,276.48,283.15,False,0,43.7042828,-79.3985623
34_1_34C,8868,34,true,1585434200,8,0,279.93,14484,276.48,283.15,False,0,43.7042828,-79.3985623
34_1_34C,8868,34,true,1585434229,8,0,279.93,14484,276.48,283.15,False,0,43.7042828,-79.3985623
34_1_34C,8868,34,true,1585434230,8,0,279.93,14484,276.48,283.15,False,0,43.7042828,-79.3985623
34_1_34C,8868,34,true,1585434379,8,0,279.93,14484,276.48,283.15,False,0,43.7042828,-79.3985623
34_1_34C,8868,34,true,1585434469,8,0,280.08,14484,277.59,282.59,False,0,43.7042828,-79.3985623
34_1_34C,8868,34,true,1585434530,8,0,280.08,14484,277.59,282.59,False,0,43.7042828,-79.3985623
34_1_34C,8868,34,true,1585434560,8,0,280.08,14484,277.59,282.59,False,0,43.7042828,-79.3985623
34_1_34C,8868,34,true,1585434589,8,0,280.08,14484,277.59,282.59,False,0,43.7042828,-79.3985623
34_1_34C,8868,34,true,1585434619,8,0,280.08,14484,277.59,282.59,False,0,43.7042828,-79.3985623
34_1_34C,8868,34,true,1585434650,8,0,280.08,14484,277.59,282.59,False,0,43.7042828,-79.3985623
34_1_34C,8868,34,true,1585434680,8,0,280.08,14484,277.59,282.59,False,0,43.7042828,-79.3985623
34_1_34C,8868,34,true,1585434710,8,0,280.08,14484,277.59,282.59,False,0,43.7042828,-79.3985623
34_1_34C,8868,34,true,1585434770,8,0,280.08,14484,277.59,282.59,False,0,43.7042828,-79.3985623
34_1_34C,8868,34,true,1585436481,188,0,279.87,14484,277.04,282.04,False,0,43.7131866,-79.3268416
34_1_34C,8868,34,true,1585436480,188,0,279.87,14484,277.04,282.04,False,0,43.7131866,-79.3268416
34_1_34C,8868,34,true,1585436511,118,0,279.87,14484,277.04,282.04,False,0,43.7128933,-79.3265483
34_1_34C,8868,34,true,1585436510,118,0,279.87,14484,277.04,282.04,False,0,43.7128933,-79.3265483
34_1_34C,8868,34,true,1585436541,118,0,279.87,14484,277.04,282.04,False,0,43.7128933,-79.3265466
34_1_34C,8868,34,true,1585436540,118,0,279.87,14484,277.04,282.04,False,0,43.7128933,-79.3265466
34_1_34C,8868,34,true,1585436570,118,0,279.87,14484,277.04,282.04,False,0,43.7128933,-79.3265466
34_1_34C,8868,34,true,1585436571,118,0,279.87,14484,277.04,282.04,False,0,43.7128933,-79.3265466
34_1_34C,8868,34,true,1585436600,118,0,279.87,14484,277.04,282.04,False,0,43.7128933,-79.3265466
34_1_34C,8868,34,true,1585436601,118,0,279.87,14484,277.04,282.04,False,0,43.7128933,-79.3265466
34_1_34C,8868,34,true,1585436632,118,0,279.87,14484,277.04,282.04,False,0,43.7128933,-79.3265466
34_1_34C,8868,34,true,1585436633,118,0,279.87,14484,277.04,282.04,False,0,43.7128933,-79.3265466
34_1_34C,8868,34,true,1585436660,118,0,279.87,14484,277.04,282.04,False,0,43.7128933,-79.3265466
34_1_34C,8868,34,true,1585436661,118,0,279.87,14484,277.04,282.04,False,0,43.7128933,-79.3265466
34_1_34C,8868,34,true,1585436690,118,0,279.87,14484,277.04,282.04,False,0,43.7128933,-79.3265466
34_1_34C,8868,34,true,1585436691,118,0,279.87,14484,277.04,282.04,False,0,43.7128933,-79.3265466
34_1_34C,8868,34,true,1585436721,118,0,279.87,14484,277.04,282.04,False,0,43.7128933,-79.3265466
34_1_34C,8868,34,true,1585436720,118,0,279.87,14484,277.04,282.04,False,0,43.7128933,-79.3265466
34_1_34C,8868,34,true,1585436750,118,0,279.87,14484,277.04,282.04,False,0,43.7128933,-79.3265466
34_1_34C,8868,34,true,1585436751,118,0,279.87,14484,277.04,282.04,False,0,43.7128933,-79.3265466
34_1_34C,8868,34,true,1585436781,118,0,279.87,14484,277.04,282.04,False,0,43.7128933,-79.3265466
34_1_34C,8868,34,true,1585436780,118,0,279.87,14484,277.04,282.04,False,0,43.7128933,-79.3265466
34_1_34C,8868,34,true,1585436811,118,0,279.87,14484,277.04,282.04,False,0,43.7128933,-79.3265466
