dir,id,route,predable,time,hdg,spd,temp,vis,t_min,t_max,snow,rain,lat,lon
34_0_34C,8868,34,true,1585434169,8,0,279.93,14484,276.48,283.15,False,0,43.7042828,-79.3985623
34_0_34C,8868,34,true,1585434170,8,0,279.93,14484,276.48,283.15,False,0,43.7042828,-79.3985623
34_0_34C,8868,34,true,1585434199,8,0,279.93,14484,276.48,283.15,False,0,43.7042828,-79.3985623
34_0_34C,8868,34,true,1585434200,8,0,279.93,14484,276.48,283.15,False,0,43.7042828,-79.3985623
34_0_34C,8868,34,true,1585434230,8,0,279.93,14484,276.48,283.15,False,0,43.7042828,-79.3985623
34_0_34C,8868,34,true,1585434229,8,0,279.93,14484,276.48,283.15,False,0,43.7042828,-79.3985623
34_0_34C,8868,34,true,1585434260,8,0,279.93,14484,276.48,283.15,False,0,43.7042828,-79.3985623
34_0_34C,8868,34,true,1585434259,8,0,279.93,14484,276.48,283.15,False,0,43.7042828,-79.3985623
34_0_34C,8868,34,true,1585434289,8,0,279.93,14484,276.48,283.15,False,0,43.7042828,-79.3985623
34_0_34C,8868,34,true,1585434290,8,0,279.93,14484,276.48,283.15,False,0,43.7042828,-79.3985623
34_0_34C,8868,34,true,1585434320,8,0,279.93,14484,276.48,283.15,False,0,43.7042828,-79.3985623
34_0_34C,8868,34,true,1585434319,8,0,279.93,14484,276.48,283.15,False,0,43.7042828,-79.3985623
34_0_34C,8868,34,true,1585434349,8,0,279.93,14484,276.48,283.15,False,0,43.7042828,-79.3985623
34_0_34C,8868,34,true,1585434350,8,0,279.93,14484,276.48,283.15,False,0,43.7042828,-79.3985623
34_0_34C,8868,34,true,1585434379,8,0,279.93,14484,276.48,283.15,False,0,43.7042828,-79.3985623
34_0_34C,8868,34,true,1585434380,8,0,279.93,14484,276.48,283.15,False,0,43.7042828,-79.3985623
34_0_34C,8868,34,true,1585434409,8,0,280.08,14484,277.59,282.59,False,0,43.7042828,-79.3985623
34_0_34C,8868,34,true,1585434410,8,0,280.08,14484,277.59,282.59,False,0,43.7042828,-79.3985623
34_0_34C,8868,34,true,1585434439,8,0,280.08,14484,277.59,282.59,False,0,43.7042828,-79.3985623
34_0_34C,8868,34,true,1585434440,8,0,280.08,14484,277.59,282.59,False,0,43.7042828,-79.3985623
34_0_34C,8868,34,true,1585434470,8,0,280.08,14484,277.59,282.59,False,0,43.7042828,-79.3985623
34_0_34C,8868,34,true,1585434469,8,0,280.08,14484,277.59,282.59,False,0,43.7042828,-79.3985623
34_0_34C,8868,34,true,1585434500,8,0,280.08,14484,277.59,282.59,False,0,43.7042828,-79.3985623
34_0_34C,8868,34,true,1585434499,8,0,280.08,14484,277.59,282.59,False,0,43.7042828,-79.3985623
34_0_34C,8868,34,true,1585434530,8,0,280.08,14484,277.59,282.59,False,0,43.7042828,-79.3985623
34_0_34C,8868,34,true,1585434560,8,0,280.08,14484,277.59,282.59,False,0,43.7042828,-79.3985623
34_0_34C,8868,34,true,1585434559,8,0,280.08,14484,277.59,282.59,False,0,43.7042828,-79.3985623
34_0_34C,8868,34,true,1585434590,8,0,280.08,14484,277.59,282.59,False,0,43.7042828,-79.3985623
34_0_34C,8868,34,true,1585434589,8,0,280.08,14484,277.59,282.59,False,0,43.7042828,-79.3985623
34_0_34C,8868,34,true,1585434620,8,0,280.08,14484,277.59,282.59,False,0,43.7042828,-79.3985623
34_0_34C,8868,34,true,1585434650,8,0,280.08,14484,277.59,282.59,False,0,43.7042828,-79.3985623
34_0_34C,8868,34,true,1585434649,8,0,280.08,14484,277.59,282.59,False,0,43.7042828,-79.3985623
34_0_34C,8868,34,true,1585434680,8,0,280.08,14484,277.59,282.59,False,0,43.7042828,-79.3985623
34_0_34C,8868,34,true,1585434679,8,0,280.08,14484,277.59,282.59,False,0,43.7042828,-79.3985623
34_0_34C,8868,34,true,1585434710,8,0,280.08,14484,277.59,282.59,False,0,43.7042828,-79.3985623
34_0_34C,8868,34,true,1585434711,8,0,280.08,14484,277.59,282.59,False,0,43.7042828,-79.3985623
34_0_34C,8868,34,true,1585434740,8,0,280.08,14484,277.59,282.59,False,0,43.7042828,-79.3985623
34_0_34C,8868,34,true,1585434739,8,0,280.08,14484,277.59,282.59,False,0,43.7042828,-79.3985623
34_0_34C,8868,34,true,1585434770,8,0,280.08,14484,277.59,282.59,False,0,43.7042828,-79.3985623
34_0_34C,8868,34,true,1585434800,8,0,280.08,14484,277.59,282.59,False,0,43.7042828,-79.3985623
34_0_34C,8868,34,true,1585434799,8,0,280.08,14484,277.59,282.59,False,0,43.7042828,-79.3985623
34_0_34C,8868,34,true,1585434830,346,15,280.02,14484,277.59,282.04,False,0,43.705677,-79.4000701
34_0_34C,8868,34,true,1585434860,69,24,280.02,14484,277.59,282.04,False,0,43.7064895,-79.3995513
34_0_34C,8868,34,true,1585434890,76,0,280.02,14484,277.59,282.04,False,0,43.7066307,-79.3988265
34_0_34C,8868,34,true,1585434920,76,22,280.02,14484,277.59,282.04,False,0,43.7068786,-79.3976364
34_0_34C,8868,34,true,1585434950,74,0,280.02,14484,277.59,282.04,False,0,43.7073707,-79.3952407
34_0_34C,8868,34,true,1585434980,74,0,279.93,14484,277.04,282.04,False,0,43.707756,-79.3929367
34_0_34C,8868,34,true,1585435010,71,25,279.93,14484,277.04,282.04,False,0,43.7079544,-79.3923263
34_0_34C,8868,34,true,1585435039,71,23,279.93,14484,277.04,282.04,False,0,43.7086257,-79.388977
34_0_34C,8868,34,true,1585435040,71,23,279.93,14484,277.04,282.04,False,0,43.7086257,-79.388977
34_0_34C,8868,34,true,1585435070,74,30,279.93,14484,277.04,282.04,False,0,43.7090339,-79.3868026
34_0_34C,8868,34,true,1585435100,74,32,279.94,14484,277.04,282.04,False,0,43.7098388,-79.3829498
34_0_34C,8868,34,true,1585435130,76,30,279.94,14484,277.04,282.04,False,0,43.7106094,-79.3791503
34_0_34C,8868,34,true,1585435160,75,0,279.94,14484,277.04,282.04,False,0,43.7108726,-79.377861
34_0_34C,8868,34,true,1585435190,73,25,279.94,14484,277.04,282.04,False,0,43.7110557,-79.3768997
34_0_34C,8868,34,true,1585435220,75,35,279.94,14484,277.04,282.04,False,0,43.7118415,-79.3733215
34_0_34C,8868,34,true,1585435250,74,33,279.94,14484,277.04,282.04,False,0,43.7126502,-79.3691635
34_0_34C,8868,34,true,1585435251,74,33,279.94,14484,277.04,282.04,False,0,43.7126502,-79.3691635
34_0_34C,8868,34,true,1585435280,74,0,279.94,14484,277.04,282.04,False,0,43.7129631,-79.3673248
34_0_34C,8868,34,true,1585435310,76,34,279.94,14484,277.04,282.04,False,0,43.7135581,-79.3647308
34_0_34C,8868,34,true,1585435311,76,34,279.94,14484,277.04,282.04,False,0,43.7135581,-79.3647308
34_0_34C,8868,34,true,1585435340,73,35,279.94,14484,277.04,282.04,False,0,43.7141342,-79.3618545
34_0_34C,8868,34,true,1585435370,74,0,279.94,14484,277.04,282.04,False,0,43.7144584,-79.3599014
34_0_34C,8868,34,true,1585435401,62,35,279.94,14484,277.04,282.04,False,0,43.7149124,-79.3584671
34_0_34C,8868,34,true,1585435400,62,35,279.94,14484,277.04,282.04,False,0,43.7149124,-79.3584671
34_0_34C,8868,34,true,1585435430,66,39,279.97,14484,277.04,282.04,False,0,43.7157821,-79.3542404
34_0_34C,8868,34,true,1585435431,66,39,279.97,14484,277.04,282.04,False,0,43.7157821,-79.3542404
34_0_34C,8868,34,true,1585435460,68,24,279.97,14484,277.04,282.04,False,0,43.716835,-79.3506698
34_0_34C,8868,34,true,1585435490,64,35,279.96,14484,277.04,282.04,False,0,43.7173423,-79.3489608
34_0_34C,8868,34,true,1585435520,66,37,279.96,14484,277.04,282.04,False,0,43.7185554,-79.3450241
34_0_34C,8868,34,true,1585435550,67,39,279.99,14484,277.04,282.04,False,0,43.7198638,-79.3408432
34_0_34C,8868,34,true,1585435580,69,0,279.99,14484,277.04,282.04,False,0,43.7204322,-79.3390502
34_0_34C,8868,34,true,1585435581,69,0,279.99,14484,277.04,282.04,False,0,43.7204322,-79.3390502
34_0_34C,8868,34,true,1585435610,69,0,279.99,14484,277.04,282.04,False,0,43.7204322,-79.3390502
34_0_34C,8868,34,true,1585435611,69,0,279.99,14484,277.04,282.04,False,0,43.7204322,-79.3390502
34_0_34C,8868,34,true,1585435640,69,0,279.99,14484,277.04,282.04,False,0,43.7204322,-79.3390502
34_0_34C,8868,34,true,1585435641,69,0,279.99,14484,277.04,282.04,False,0,43.7204322,-79.3390502
34_0_34C,8868,34,true,1585435670,66,33,279.99,14484,277.04,282.04,False,0,43.7209666,-79.3367016
34_0_34C,8868,34,true,1585435820,66,0,279.99,14484,277.04,282.04,False,0,43.7204322,-79.3390502
34_0_34C,8868,34,true,1585435821,66,0,279.99,14484,277.04,282.04,False,0,43.7204322,-79.3390502
34_0_34C,8868,34,true,1585435850,340,25,279.99,14484,277.04,282.04,False,0,43.7206687,-79.3389205
34_0_34C,8868,34,true,1585435851,340,25,279.99,14484,277.04,282.04,False,0,43.7206687,-79.3389205
34_0_34C,8868,34,true,1585435880,349,31,279.99,14484,277.04,282.04,False,0,43.7225646,-79.3394699
34_0_34C,8868,34,true,1585435911,76,37,279.99,14484,277.04,282.04,False,0,43.723526,-79.3361358
34_0_34C,8868,34,true,1585435910,76,37,279.99,14484,277.04,282.04,False,0,43.723526,-79.3361358
34_0_34C,8868,34,true,1585435940,31,39,280.01,14484,277.59,282.04,False,0,43.7254486,-79.3335647
34_0_34C,8868,34,true,1585435941,31,39,280.01,14484,277.59,282.04,False,0,43.7254486,-79.3335647
34_0_34C,8868,34,true,1585435970,70,34,280.01,14484,277.59,282.04,False,0,43.7269477,-79.3296127
34_0_34C,8868,34,true,1585435971,70,34,280.01,14484,277.59,282.04,False,0,43.7269477,-79.3296127
34_0_34C,8868,34,true,1585436000,74,6,280.01,14484,277.59,282.04,False,0,43.7272071,-79.3282318
34_0_34C,8868,34,true,1585436001,74,6,280.01,14484,277.59,282.04,False,0,43.7272071,-79.3282318
34_0_34C,8868,34,true,1585436030,358,29,280.01,14484,277.59,282.04,False,0,43.7284851,-79.3283157
34_0_34C,8868,34,true,1585436031,358,29,280.01,14484,277.59,282.04,False,0,43.7284851,-79.3283157
34_0_34C,8868,34,true,1585436060,353,15,279.96,14484,277.59,282.04,False,0,43.7301902,-79.3283843
34_0_34C,8868,34,true,1585436061,353,15,279.96,14484,277.59,282.04,False,0,43.7301902,-79.3283843
34_0_34C,8868,34,true,1585436090,176,18,279.96,14484,277.59,282.04,False,0,43.7295417,-79.3283996
34_0_34C,8868,34,true,1585436091,176,18,279.96,14484,277.59,282.04,False,0,43.7295417,-79.3283996
34_0_34C,8868,34,true,1585436120,153,6,279.96,14484,277.59,282.04,False,0,43.7278213,-79.3281097
34_0_34C,8868,34,true,1585436121,153,6,279.96,14484,277.59,282.04,False,0,43.7278213,-79.3281097
34_0_34C,8868,34,true,1585436150,125,0,279.96,14484,277.59,282.04,False,0,43.7278213,-79.3281097
34_0_34C,8868,34,true,1585436151,125,0,279.96,14484,277.59,282.04,False,0,43.7278213,-79.3281097
34_0_34C,8868,34,true,1585436181,154,23,279.96,14484,277.59,282.04,False,0,43.7276496,-79.3279418
34_0_34C,8868,34,true,1585436180,154,23,279.96,14484,277.59,282.04,False,0,43.7276496,-79.3279418
34_0_34C,8868,34,true,1585436210,148,33,279.96,14484,277.59,282.04,False,0,43.7250442,-79.3258819
34_0_34C,8868,34,true,1585436211,148,33,279.96,14484,277.59,282.04,False,0,43.7250442,-79.3258819
34_0_34C,8868,34,true,1585436240,147,32,279.97,14484,277.59,282.04,False,0,43.7245172,-79.3254362
34_0_34C,8868,34,true,1585436241,147,32,279.97,14484,277.59,282.04,False,0,43.7245172,-79.3254362
34_0_34C,8868,34,true,1585436271,267,36,279.97,14484,277.59,282.04,False,0,43.7227307,-79.3261389
34_0_34C,8868,34,true,1585436270,267,36,279.97,14484,277.59,282.04,False,0,43.7227307,-79.3261389
34_0_34C,8868,34,true,1585436300,165,38,279.97,14484,277.59,282.04,False,0,43.7201991,-79.3281126
34_0_34C,8868,34,true,1585436301,165,38,279.97,14484,277.59,282.04,False,0,43.7201991,-79.3281126
34_0_34C,8868,34,true,1585436330,240,28,279.97,14484,277.59,282.04,False,0,43.7191112,-79.3281913
34_0_34C,8868,34,true,1585436331,240,28,279.97,14484,277.59,282.04,False,0,43.7191112,-79.3281913
34_0_34C,8868,34,true,1585436360,157,26,279.97,14484,277.59,282.04,False,0,43.7181412,-79.3312924
34_0_34C,8868,34,true,1585436361,157,26,279.97,14484,277.59,282.04,False,0,43.7181412,-79.3312924
34_0_34C,8868,34,true,1585436390,153,28,279.97,14484,277.59,282.04,False,0,43.7174524,-79.3309204
34_0_34C,8868,34,true,1585436391,153,28,279.97,14484,277.59,282.04,False,0,43.7174524,-79.3309204
34_0_34C,8868,34,true,1585436421,121,27,279.97,14484,277.59,282.04,False,0,43.7153035,-79.3294606
34_0_34C,8868,34,true,1585436420,121,27,279.97,14484,277.59,282.04,False,0,43.7153035,-79.3294606
34_0_34C,8868,34,true,1585436450,141,19,279.97,14484,277.59,282.04,False,0,43.7154029,-79.3281019
34_0_34C,8868,34,true,1585436451,141,19,279.97,14484,277.59,282.04,False,0,43.7154029,-79.3281019
34_0_34C,8868,34,true,1585439364,74,40,279.53,14484,277.59,281.48,False,0,43.711435,-79.3752433
34_0_34C,8868,34,true,1585439391,75,42,279.53,14484,277.59,281.48,False,0,43.7123766,-79.3705883
34_0_34C,8868,34,true,1585439421,74,35,279.53,14484,277.59,281.48,False,0,43.7133066,-79.3661483
34_0_34C,8868,34,true,1585439422,74,35,279.53,14484,277.59,281.48,False,0,43.7133066,-79.3661483
