scode,stock,grouping1.region,grouping2.region
432,Basin_Cr_RT,1,1
246,Blanchard_Lk,1,1
441,BorderSlough_RT,1,1
515,Bridge_Silver,1,1
218,Detour_Cr_RT,1,1
438,Goat_Cr_RT,1,1
567,Klukshu_LK,2,2
566,Klukshu_R,2,2
217,Kudwat_Cr_RT,1,1
513,Kwatini_Cr,1,1
434,LowFog_RT,1,1
166,Nesketahin,1,2
247,OConnor_RT,1,1
497,Sediment_Cr_RT,1,1
244,Stanley_Cr_RT,1,1
220,Stinky_Cr_RT,1,1
435,Takhanne_RT,1,1
249,Tats_main_Kane,1,1
168,Tatshenshi_RT,1,1
433,Tweedsmuir_RT,1,1
437,VernRichie_RT,1,1
