<?xml version="1.0" encoding="UTF-8"?>
<glyph name="Lslash" format="1">
  <advance width="582"/>
  <unicode hex="0141"/>
  <outline>
    <contour>
      <point x="552" y="0" type="line"/>
      <point x="112" y="0" type="line"/>
      <point x="112" y="289" type="line"/>
      <point x="39" y="243" type="line"/>
      <point x="39" y="310" type="line"/>
      <point x="112" y="356" type="line"/>
      <point x="112" y="712" type="line"/>
      <point x="189" y="712" type="line"/>
      <point x="189" y="404" type="line"/>
      <point x="343" y="502" type="line"/>
      <point x="343" y="436" type="line"/>
      <point x="189" y="338" type="line"/>
      <point x="189" y="68" type="line"/>
      <point x="552" y="68" type="line"/>
    </contour>
  </outline>
  <lib>
    <dict>
      <key>com.fontlab.hintData</key>
      <dict>
        <key>hhints</key>
        <array>
          <dict>
            <key>position</key>
            <integer>0</integer>
            <key>width</key>
            <integer>68</integer>
          </dict>
          <dict>
            <key>position</key>
            <integer>692</integer>
            <key>width</key>
            <integer>20</integer>
          </dict>
        </array>
        <key>vhints</key>
        <array>
          <dict>
            <key>position</key>
            <integer>39</integer>
            <key>width</key>
            <integer>150</integer>
          </dict>
          <dict>
            <key>position</key>
            <integer>112</integer>
            <key>width</key>
            <integer>77</integer>
          </dict>
          <dict>
            <key>position</key>
            <integer>112</integer>
            <key>width</key>
            <integer>231</integer>
          </dict>
        </array>
      </dict>
    </dict>
  </lib>
</glyph>
