<?xml version="1.0" encoding="UTF-8"?>
<glyph name="D" format="1">
  <advance width="1545"/>
  <unicode hex="0044"/>
  <outline>
    <contour>
      <point x="1269" y="143" type="qcurve"/>
      <point x="1269" y="143" type="line"/>
      <point x="1511" y="299"/>
      <point x="1515" y="719" type="qcurve" smooth="yes"/>
      <point x="1518" y="1065"/>
      <point x="1202" y="1214" type="qcurve" smooth="yes"/>
      <point x="936" y="1339"/>
      <point x="393" y="1339" type="qcurve" smooth="yes"/>
      <point x="308" y="1339"/>
      <point x="203" y="1321" type="qcurve" smooth="yes"/>
      <point x="63" y="1297"/>
      <point x="63" y="1258" type="qcurve" smooth="yes"/>
      <point x="63" y="1253"/>
      <point x="65" y="1249" type="qcurve" smooth="yes"/>
      <point x="67" y="1241"/>
      <point x="525" y="1045"/>
      <point x="525" y="1034" type="qcurve" smooth="yes"/>
      <point x="525" y="999"/>
      <point x="396" y="969" type="qcurve"/>
      <point x="396" y="965" type="line"/>
      <point x="495" y="975"/>
      <point x="572" y="995" type="qcurve"/>
      <point x="599" y="330" type="line"/>
      <point x="522" y="352"/>
      <point x="396" y="365" type="qcurve"/>
      <point x="396" y="360" type="line"/>
      <point x="525" y="330"/>
      <point x="525" y="295" type="qcurve" smooth="yes"/>
      <point x="525" y="284"/>
      <point x="67" y="88"/>
      <point x="65" y="80" type="qcurve" smooth="yes"/>
      <point x="63" y="76"/>
      <point x="63" y="72" type="qcurve" smooth="yes"/>
      <point x="63" y="32"/>
      <point x="203" y="8" type="qcurve" smooth="yes"/>
      <point x="307" y="-10"/>
      <point x="393" y="-10" type="qcurve" smooth="yes"/>
      <point x="504" y="-10"/>
      <point x="609" y="-4" type="qcurve"/>
      <point x="612" y="-59" type="line"/>
      <point x="618" y="-59" type="line"/>
      <point x="618" y="-2" type="line"/>
      <point x="1093" y="31"/>
    </contour>
    <contour>
      <point x="563" y="1180" type="qcurve"/>
      <point x="563" y="1180" type="line"/>
      <point x="563" y="1151" type="line"/>
      <point x="341" y="1208" type="line" smooth="yes"/>
      <point x="230" y="1237"/>
      <point x="234" y="1264" type="qcurve" smooth="yes"/>
      <point x="242" y="1311"/>
      <point x="396" y="1311" type="qcurve" smooth="yes"/>
      <point x="457" y="1311"/>
      <point x="534" y="1309" type="qcurve"/>
      <point x="562" y="1204"/>
    </contour>
    <contour>
      <point x="1179" y="1104" type="qcurve" smooth="yes"/>
      <point x="1287" y="985"/>
      <point x="1319" y="723" type="qcurve"/>
      <point x="1311" y="410"/>
      <point x="1190" y="262" type="qcurve" smooth="yes"/>
      <point x="1031" y="68"/>
      <point x="621" y="29" type="qcurve"/>
      <point x="633" y="219" type="line"/>
      <point x="674" y="246"/>
      <point x="674" y="274" type="qcurve" smooth="yes"/>
      <point x="674" y="293"/>
      <point x="642" y="313" type="qcurve"/>
      <point x="701" y="1294" type="line"/>
      <point x="1045" y="1251"/>
    </contour>
    <contour>
      <point x="599" y="201" type="qcurve"/>
      <point x="599" y="201" type="line"/>
      <point x="609" y="27" type="line"/>
      <point x="507" y="18"/>
      <point x="396" y="18" type="qcurve" smooth="yes"/>
      <point x="257" y="18"/>
      <point x="243" y="68" type="qcurve" smooth="yes"/>
      <point x="236" y="92"/>
      <point x="396" y="141" type="qcurve" smooth="yes"/>
      <point x="438" y="153"/>
    </contour>
  </outline>
</glyph>
