<?xml version="1.0" encoding="UTF-8"?>
<glyph name="questiondown.case" format="1">
  <advance width="497"/>
  <outline>
    <contour>
      <point x="421" y="177" type="line"/>
      <point x="421" y="75"/>
      <point x="342" y="-6"/>
      <point x="234" y="-6" type="curve" smooth="yes"/>
      <point x="129" y="-6"/>
      <point x="46" y="70"/>
      <point x="46" y="177" type="curve" smooth="yes"/>
      <point x="46" y="224"/>
      <point x="66" y="259"/>
      <point x="92" y="297" type="curve" smooth="yes"/>
      <point x="174" y="415" type="line" smooth="yes"/>
      <point x="186" y="433"/>
      <point x="192" y="457"/>
      <point x="192" y="473" type="curve" smooth="yes"/>
      <point x="192" y="513" type="line"/>
      <point x="264" y="513" type="line"/>
      <point x="264" y="472" type="line" smooth="yes"/>
      <point x="264" y="433"/>
      <point x="253" y="408"/>
      <point x="232" y="378" type="curve" smooth="yes"/>
      <point x="151" y="262" type="line" smooth="yes"/>
      <point x="132" y="234"/>
      <point x="118" y="211"/>
      <point x="118" y="177" type="curve" smooth="yes"/>
      <point x="118" y="110"/>
      <point x="167" y="59"/>
      <point x="234" y="59" type="curve" smooth="yes"/>
      <point x="305" y="59"/>
      <point x="349" y="114"/>
      <point x="349" y="177" type="curve"/>
    </contour>
    <contour>
      <point x="270" y="628" type="line"/>
      <point x="185" y="628" type="line"/>
      <point x="185" y="712" type="line"/>
      <point x="270" y="712" type="line"/>
    </contour>
  </outline>
  <lib>
    <dict>
      <key>com.fontlab.hintData</key>
      <dict>
        <key>hhints</key>
        <array>
          <dict>
            <key>position</key>
            <integer>-6</integer>
            <key>width</key>
            <integer>65</integer>
          </dict>
          <dict>
            <key>position</key>
            <integer>-6</integer>
            <key>width</key>
            <integer>183</integer>
          </dict>
          <dict>
            <key>position</key>
            <integer>628</integer>
            <key>width</key>
            <integer>84</integer>
          </dict>
        </array>
        <key>vhints</key>
        <array>
          <dict>
            <key>position</key>
            <integer>46</integer>
            <key>width</key>
            <integer>72</integer>
          </dict>
          <dict>
            <key>position</key>
            <integer>185</integer>
            <key>width</key>
            <integer>79</integer>
          </dict>
          <dict>
            <key>position</key>
            <integer>349</integer>
            <key>width</key>
            <integer>72</integer>
          </dict>
        </array>
      </dict>
    </dict>
  </lib>
</glyph>
