<?xml version="1.0" encoding="UTF-8"?>
<glyph name="R" format="1">
  <advance width="656"/>
  <unicode hex="0052"/>
  <outline>
    <contour>
      <point x="601" y="0" type="line"/>
      <point x="512" y="0" type="line"/>
      <point x="350" y="316" type="line"/>
      <point x="179" y="316" type="line"/>
      <point x="179" y="0" type="line"/>
      <point x="103" y="0" type="line"/>
      <point x="103" y="712" type="line"/>
      <point x="376" y="712" type="line" smooth="yes"/>
      <point x="500" y="712"/>
      <point x="587" y="637"/>
      <point x="587" y="514" type="curve" smooth="yes"/>
      <point x="587" y="410"/>
      <point x="524" y="342"/>
      <point x="432" y="323" type="curve"/>
    </contour>
    <contour>
      <point x="511" y="513" type="curve" smooth="yes"/>
      <point x="511" y="600"/>
      <point x="452" y="644"/>
      <point x="369" y="644" type="curve" smooth="yes"/>
      <point x="179" y="644" type="line"/>
      <point x="179" y="383" type="line"/>
      <point x="369" y="383" type="line" smooth="yes"/>
      <point x="452" y="383"/>
      <point x="511" y="426"/>
    </contour>
  </outline>
  <lib>
    <dict>
      <key>com.fontlab.hintData</key>
      <dict>
        <key>hhints</key>
        <array>
          <dict>
            <key>position</key>
            <integer>0</integer>
            <key>width</key>
            <integer>21</integer>
          </dict>
          <dict>
            <key>position</key>
            <integer>316</integer>
            <key>width</key>
            <integer>67</integer>
          </dict>
          <dict>
            <key>position</key>
            <integer>644</integer>
            <key>width</key>
            <integer>68</integer>
          </dict>
        </array>
        <key>vhints</key>
        <array>
          <dict>
            <key>position</key>
            <integer>103</integer>
            <key>width</key>
            <integer>76</integer>
          </dict>
          <dict>
            <key>position</key>
            <integer>511</integer>
            <key>width</key>
            <integer>76</integer>
          </dict>
        </array>
      </dict>
    </dict>
  </lib>
</glyph>
