<?xml version="1.0" encoding="UTF-8"?>
<glyph name="Rho" format="1">
  <advance width="630"/>
  <unicode hex="03A1"/>
  <outline>
    <contour>
      <point x="588" y="503" type="curve" smooth="yes"/>
      <point x="588" y="375"/>
      <point x="498" y="293"/>
      <point x="368" y="293" type="curve" smooth="yes"/>
      <point x="179" y="293" type="line"/>
      <point x="179" y="0" type="line"/>
      <point x="103" y="0" type="line"/>
      <point x="103" y="712" type="line"/>
      <point x="368" y="712" type="line" smooth="yes"/>
      <point x="498" y="712"/>
      <point x="588" y="631"/>
    </contour>
    <contour>
      <point x="512" y="503" type="curve" smooth="yes"/>
      <point x="512" y="597"/>
      <point x="450" y="644"/>
      <point x="361" y="644" type="curve" smooth="yes"/>
      <point x="179" y="644" type="line"/>
      <point x="179" y="361" type="line"/>
      <point x="361" y="361" type="line" smooth="yes"/>
      <point x="450" y="361"/>
      <point x="512" y="409"/>
    </contour>
  </outline>
  <lib>
    <dict>
      <key>com.fontlab.hintData</key>
      <dict>
        <key>hhints</key>
        <array>
          <dict>
            <key>position</key>
            <integer>0</integer>
            <key>width</key>
            <integer>21</integer>
          </dict>
          <dict>
            <key>position</key>
            <integer>293</integer>
            <key>width</key>
            <integer>68</integer>
          </dict>
          <dict>
            <key>position</key>
            <integer>644</integer>
            <key>width</key>
            <integer>68</integer>
          </dict>
        </array>
        <key>vhints</key>
        <array>
          <dict>
            <key>position</key>
            <integer>103</integer>
            <key>width</key>
            <integer>76</integer>
          </dict>
          <dict>
            <key>position</key>
            <integer>512</integer>
            <key>width</key>
            <integer>76</integer>
          </dict>
        </array>
      </dict>
    </dict>
  </lib>
</glyph>
