<?xml version="1.0" encoding="UTF-8"?>
<glyph name="logicalnot" format="1">
  <advance width="1536"/>
  <unicode hex="00AC"/>
  <outline>
    <contour>
      <point x="191" y="0" type="line"/>
      <point x="1343" y="0" type="line"/>
      <point x="1343" y="1358" type="line"/>
      <point x="191" y="1358" type="line"/>
    </contour>
    <contour>
      <point x="381" y="129" type="line"/>
      <point x="381" y="1229" type="line"/>
      <point x="1149" y="1229" type="line"/>
      <point x="1149" y="129" type="line"/>
    </contour>
  </outline>
</glyph>
