<?xml version="1.0" encoding="UTF-8"?>
<glyph name="afii10028.ss01" format="1">
  <advance width="673"/>
  <outline>
    <contour>
      <point x="514" y="583" type="curve" smooth="yes"/>
      <point x="460" y="450" type="line" smooth="yes"/>
      <point x="444" y="409"/>
      <point x="412" y="380"/>
      <point x="383" y="367" type="curve"/>
      <point x="433" y="359"/>
      <point x="456" y="317"/>
      <point x="475" y="275" type="curve" smooth="yes"/>
      <point x="537" y="135" type="line" smooth="yes"/>
      <point x="558" y="87"/>
      <point x="560" y="68"/>
      <point x="614" y="68" type="curve" smooth="yes"/>
      <point x="643" y="68" type="line"/>
      <point x="643" y="0" type="line"/>
      <point x="604" y="0" type="line" smooth="yes"/>
      <point x="528" y="0"/>
      <point x="495" y="32"/>
      <point x="470" y="99" type="curve"/>
      <point x="399" y="260" type="line" smooth="yes"/>
      <point x="375" y="315"/>
      <point x="329" y="325"/>
      <point x="298" y="325" type="curve" smooth="yes"/>
      <point x="179" y="325" type="line"/>
      <point x="179" y="0" type="line"/>
      <point x="103" y="0" type="line"/>
      <point x="103" y="712" type="line"/>
      <point x="179" y="712" type="line"/>
      <point x="179" y="393" type="line"/>
      <point x="288" y="393" type="line" smooth="yes"/>
      <point x="340" y="393"/>
      <point x="381" y="439"/>
      <point x="400" y="485" type="curve" smooth="yes"/>
      <point x="454" y="618" type="line" smooth="yes"/>
      <point x="481" y="684"/>
      <point x="513" y="712"/>
      <point x="583" y="712" type="curve" smooth="yes"/>
      <point x="609" y="712" type="line"/>
      <point x="609" y="644" type="line"/>
      <point x="591" y="644" type="line" smooth="yes"/>
      <point x="537" y="644"/>
      <point x="533" y="630"/>
    </contour>
  </outline>
  <lib>
    <dict>
      <key>com.fontlab.hintData</key>
      <dict>
        <key>hhints</key>
        <array>
          <dict>
            <key>position</key>
            <integer>0</integer>
            <key>width</key>
            <integer>68</integer>
          </dict>
          <dict>
            <key>position</key>
            <integer>325</integer>
            <key>width</key>
            <integer>68</integer>
          </dict>
          <dict>
            <key>position</key>
            <integer>644</integer>
            <key>width</key>
            <integer>68</integer>
          </dict>
        </array>
        <key>vhints</key>
        <array>
          <dict>
            <key>position</key>
            <integer>103</integer>
            <key>width</key>
            <integer>76</integer>
          </dict>
        </array>
      </dict>
    </dict>
  </lib>
</glyph>
