<?xml version="1.0" encoding="UTF-8"?>
<glyph name="quotesinglbase" format="1">
  <advance width="329"/>
  <unicode hex="201A"/>
  <outline>
    <contour>
      <point x="47" y="195" type="qcurve"/>
      <point x="47" y="195" type="line"/>
      <point x="188" y="244" type="line"/>
      <point x="234" y="156"/>
      <point x="234" y="76" type="qcurve" smooth="yes"/>
      <point x="234" y="-37"/>
      <point x="126" y="-176" type="qcurve"/>
      <point x="153" y="-100"/>
      <point x="153" y="-37" type="qcurve" smooth="yes"/>
      <point x="153" y="88"/>
    </contour>
  </outline>
</glyph>
