<?xml version="1.0" encoding="UTF-8"?>
<glyph name="fl" format="1">
  <advance width="588"/>
  <unicode hex="FB02"/>
  <outline>
    <contour>
      <point x="231" y="0" type="line"/>
      <point x="78" y="0" type="line"/>
      <point x="78" y="377" type="line"/>
      <point x="14" y="377" type="line"/>
      <point x="14" y="489" type="line"/>
      <point x="78" y="489" type="line"/>
      <point x="78" y="511" type="line" smooth="yes"/>
      <point x="78" y="566"/>
      <point x="106" y="628"/>
      <point x="153" y="666" type="curve" smooth="yes"/>
      <point x="200" y="704"/>
      <point x="261" y="721"/>
      <point x="339" y="721" type="curve" smooth="yes"/>
      <point x="412" y="721"/>
      <point x="478" y="707"/>
      <point x="527" y="680" type="curve"/>
      <point x="527" y="0" type="line"/>
      <point x="375" y="0" type="line"/>
      <point x="375" y="598" type="line"/>
      <point x="363" y="604"/>
      <point x="345" y="608"/>
      <point x="317" y="608" type="curve" smooth="yes"/>
      <point x="256" y="608"/>
      <point x="230" y="564"/>
      <point x="230" y="509" type="curve" smooth="yes"/>
      <point x="230" y="489" type="line"/>
      <point x="318" y="489" type="line"/>
      <point x="318" y="377" type="line"/>
      <point x="231" y="377" type="line"/>
    </contour>
  </outline>
  <lib>
    <dict>
      <key>com.fontlab.hintData</key>
      <dict>
        <key>hhints</key>
        <array>
          <dict>
            <key>position</key>
            <integer>0</integer>
            <key>width</key>
            <integer>21</integer>
          </dict>
          <dict>
            <key>position</key>
            <integer>377</integer>
            <key>width</key>
            <integer>112</integer>
          </dict>
          <dict>
            <key>position</key>
            <integer>608</integer>
            <key>width</key>
            <integer>113</integer>
          </dict>
        </array>
        <key>vhints</key>
        <array>
          <dict>
            <key>position</key>
            <integer>78</integer>
            <key>width</key>
            <integer>153</integer>
          </dict>
          <dict>
            <key>position</key>
            <integer>375</integer>
            <key>width</key>
            <integer>152</integer>
          </dict>
        </array>
      </dict>
    </dict>
  </lib>
</glyph>
