<?xml version="1.0" encoding="UTF-8"?>
<glyph name="f_f_j" format="1">
  <advance width="886"/>
  <unicode hex="E003"/>
  <outline>
    <contour>
      <point x="782" y="695" type="curve"/>
      <point x="749" y="581" type="line"/>
      <point x="725" y="592"/>
      <point x="690" y="601"/>
      <point x="649" y="601" type="curve" smooth="yes"/>
      <point x="569" y="601"/>
      <point x="541" y="560"/>
      <point x="541" y="506" type="curve" smooth="yes"/>
      <point x="541" y="489" type="line"/>
      <point x="839" y="489" type="line"/>
      <point x="839" y="65" type="line" smooth="yes"/>
      <point x="839" y="-42"/>
      <point x="815" y="-107"/>
      <point x="770" y="-149" type="curve" smooth="yes"/>
      <point x="725" y="-191"/>
      <point x="654" y="-209"/>
      <point x="581" y="-209" type="curve"/>
      <point x="566" y="-90" type="line"/>
      <point x="606" y="-87"/>
      <point x="637" y="-78"/>
      <point x="656" y="-58" type="curve" smooth="yes"/>
      <point x="678" y="-35"/>
      <point x="686" y="4"/>
      <point x="686" y="101" type="curve" smooth="yes"/>
      <point x="686" y="377" type="line"/>
      <point x="542" y="377" type="line"/>
      <point x="542" y="0" type="line"/>
      <point x="390" y="0" type="line"/>
      <point x="390" y="377" type="line"/>
      <point x="231" y="377" type="line"/>
      <point x="231" y="0" type="line"/>
      <point x="78" y="0" type="line"/>
      <point x="78" y="377" type="line"/>
      <point x="14" y="377" type="line"/>
      <point x="14" y="489" type="line"/>
      <point x="78" y="489" type="line"/>
      <point x="78" y="500" type="line" smooth="yes"/>
      <point x="78" y="558"/>
      <point x="97" y="617"/>
      <point x="141" y="658" type="curve" smooth="yes"/>
      <point x="174" y="689"/>
      <point x="222" y="710"/>
      <point x="288" y="710" type="curve" smooth="yes"/>
      <point x="322" y="710"/>
      <point x="354" y="701"/>
      <point x="373" y="694" type="curve"/>
      <point x="339" y="584" type="line"/>
      <point x="328" y="589"/>
      <point x="312" y="594"/>
      <point x="296" y="594" type="curve" smooth="yes"/>
      <point x="276" y="594"/>
      <point x="261" y="587"/>
      <point x="251" y="577" type="curve" smooth="yes"/>
      <point x="235" y="560"/>
      <point x="230" y="532"/>
      <point x="230" y="506" type="curve" smooth="yes"/>
      <point x="230" y="489" type="line"/>
      <point x="390" y="489" type="line"/>
      <point x="390" y="510" type="line" smooth="yes"/>
      <point x="390" y="645"/>
      <point x="494" y="721"/>
      <point x="645" y="721" type="curve" smooth="yes"/>
      <point x="693" y="721"/>
      <point x="749" y="711"/>
    </contour>
  </outline>
  <lib>
    <dict>
      <key>com.fontlab.hintData</key>
      <dict>
        <key>hhints</key>
        <array>
          <dict>
            <key>position</key>
            <integer>-209</integer>
            <key>width</key>
            <integer>21</integer>
          </dict>
          <dict>
            <key>position</key>
            <integer>0</integer>
            <key>width</key>
            <integer>21</integer>
          </dict>
          <dict>
            <key>position</key>
            <integer>377</integer>
            <key>width</key>
            <integer>112</integer>
          </dict>
          <dict>
            <key>position</key>
            <integer>594</integer>
            <key>width</key>
            <integer>116</integer>
          </dict>
          <dict>
            <key>position</key>
            <integer>601</integer>
            <key>width</key>
            <integer>120</integer>
          </dict>
        </array>
        <key>vhints</key>
        <array>
          <dict>
            <key>position</key>
            <integer>78</integer>
            <key>width</key>
            <integer>153</integer>
          </dict>
          <dict>
            <key>position</key>
            <integer>390</integer>
            <key>width</key>
            <integer>152</integer>
          </dict>
          <dict>
            <key>position</key>
            <integer>686</integer>
            <key>width</key>
            <integer>153</integer>
          </dict>
        </array>
      </dict>
    </dict>
  </lib>
</glyph>
