<?xml version="1.0" encoding="UTF-8"?>
<glyph name="Ohungarumlaut" format="1">
  <advance width="650"/>
  <unicode hex="0150"/>
  <outline>
    <contour>
      <point x="574" y="356" type="curve" smooth="yes"/>
      <point x="574" y="193"/>
      <point x="569" y="131"/>
      <point x="502" y="64" type="curve" smooth="yes"/>
      <point x="458" y="20"/>
      <point x="399" y="-6"/>
      <point x="325" y="-6" type="curve" smooth="yes"/>
      <point x="251" y="-6"/>
      <point x="191" y="20"/>
      <point x="147" y="64" type="curve" smooth="yes"/>
      <point x="80" y="131"/>
      <point x="76" y="193"/>
      <point x="76" y="356" type="curve" smooth="yes"/>
      <point x="76" y="519"/>
      <point x="80" y="581"/>
      <point x="147" y="648" type="curve" smooth="yes"/>
      <point x="191" y="692"/>
      <point x="251" y="718"/>
      <point x="325" y="718" type="curve" smooth="yes"/>
      <point x="399" y="718"/>
      <point x="458" y="692"/>
      <point x="502" y="648" type="curve" smooth="yes"/>
      <point x="569" y="581"/>
      <point x="574" y="519"/>
    </contour>
    <contour>
      <point x="498" y="356" type="curve" smooth="yes"/>
      <point x="498" y="502"/>
      <point x="493" y="554"/>
      <point x="448" y="600" type="curve" smooth="yes"/>
      <point x="415" y="633"/>
      <point x="373" y="650"/>
      <point x="325" y="650" type="curve" smooth="yes"/>
      <point x="277" y="650"/>
      <point x="235" y="633"/>
      <point x="202" y="600" type="curve" smooth="yes"/>
      <point x="157" y="554"/>
      <point x="152" y="502"/>
      <point x="152" y="356" type="curve" smooth="yes"/>
      <point x="152" y="210"/>
      <point x="157" y="158"/>
      <point x="202" y="112" type="curve" smooth="yes"/>
      <point x="235" y="79"/>
      <point x="277" y="62"/>
      <point x="325" y="62" type="curve" smooth="yes"/>
      <point x="373" y="62"/>
      <point x="415" y="79"/>
      <point x="448" y="112" type="curve" smooth="yes"/>
      <point x="493" y="158"/>
      <point x="498" y="210"/>
    </contour>
    <contour>
      <point x="379" y="934" type="line"/>
      <point x="271" y="781" type="line"/>
      <point x="205" y="781" type="line"/>
      <point x="294" y="934" type="line"/>
    </contour>
    <contour>
      <point x="542" y="934" type="line"/>
      <point x="433" y="781" type="line"/>
      <point x="368" y="781" type="line"/>
      <point x="457" y="934" type="line"/>
    </contour>
  </outline>
  <lib>
    <dict>
      <key>com.fontlab.hintData</key>
      <dict>
        <key>hhints</key>
        <array>
          <dict>
            <key>position</key>
            <integer>-6</integer>
            <key>width</key>
            <integer>68</integer>
          </dict>
          <dict>
            <key>position</key>
            <integer>650</integer>
            <key>width</key>
            <integer>68</integer>
          </dict>
          <dict>
            <key>position</key>
            <integer>781</integer>
            <key>width</key>
            <integer>153</integer>
          </dict>
        </array>
        <key>vhints</key>
        <array>
          <dict>
            <key>position</key>
            <integer>76</integer>
            <key>width</key>
            <integer>76</integer>
          </dict>
          <dict>
            <key>position</key>
            <integer>498</integer>
            <key>width</key>
            <integer>76</integer>
          </dict>
        </array>
      </dict>
    </dict>
  </lib>
</glyph>
