<?xml version="1.0" encoding="UTF-8"?>
<glyph name="hyphen.cap" format="1">
  <advance width="322"/>
  <unicode hex="F6BA"/>
  <outline>
    <contour>
      <point x="30" y="388" type="line"/>
      <point x="292" y="388" type="line"/>
      <point x="292" y="287" type="line"/>
      <point x="30" y="287" type="line"/>
    </contour>
  </outline>
  <lib>
    <dict>
      <key>com.fontlab.hintData</key>
      <dict>
        <key>hhints</key>
        <array>
          <dict>
            <key>position</key>
            <integer>287</integer>
            <key>width</key>
            <integer>101</integer>
          </dict>
        </array>
        <key>vhints</key>
        <array>
          <dict>
            <key>position</key>
            <integer>30</integer>
            <key>width</key>
            <integer>262</integer>
          </dict>
        </array>
      </dict>
    </dict>
  </lib>
</glyph>
