<?xml version="1.0" encoding="UTF-8"?>
<glyph name="Aring" format="1">
  <advance width="611"/>
  <unicode hex="00C5"/>
  <outline>
    <contour>
      <point x="599" y="0" type="line"/>
      <point x="518" y="0" type="line"/>
      <point x="461" y="161" type="line"/>
      <point x="150" y="161" type="line"/>
      <point x="93" y="0" type="line"/>
      <point x="12" y="0" type="line"/>
      <point x="274" y="712" type="line"/>
      <point x="338" y="712" type="line"/>
    </contour>
    <contour>
      <point x="439" y="227" type="line"/>
      <point x="307" y="603" type="line"/>
      <point x="173" y="227" type="line"/>
    </contour>
    <contour>
      <point x="420" y="867" type="curve" smooth="yes"/>
      <point x="420" y="802"/>
      <point x="367" y="748"/>
      <point x="302" y="748" type="curve" smooth="yes"/>
      <point x="237" y="748"/>
      <point x="184" y="802"/>
      <point x="184" y="867" type="curve" smooth="yes"/>
      <point x="184" y="932"/>
      <point x="237" y="985"/>
      <point x="302" y="985" type="curve" smooth="yes"/>
      <point x="367" y="985"/>
      <point x="420" y="933"/>
    </contour>
    <contour>
      <point x="371" y="867" type="curve" smooth="yes"/>
      <point x="371" y="905"/>
      <point x="340" y="935"/>
      <point x="302" y="935" type="curve" smooth="yes"/>
      <point x="264" y="935"/>
      <point x="233" y="905"/>
      <point x="233" y="867" type="curve" smooth="yes"/>
      <point x="233" y="829"/>
      <point x="264" y="798"/>
      <point x="302" y="798" type="curve" smooth="yes"/>
      <point x="340" y="798"/>
      <point x="371" y="829"/>
    </contour>
  </outline>
  <lib>
    <dict>
      <key>com.fontlab.hintData</key>
      <dict>
        <key>hhints</key>
        <array>
          <dict>
            <key>position</key>
            <integer>0</integer>
            <key>width</key>
            <integer>21</integer>
          </dict>
          <dict>
            <key>position</key>
            <integer>161</integer>
            <key>width</key>
            <integer>66</integer>
          </dict>
          <dict>
            <key>position</key>
            <integer>692</integer>
            <key>width</key>
            <integer>20</integer>
          </dict>
          <dict>
            <key>position</key>
            <integer>748</integer>
            <key>width</key>
            <integer>50</integer>
          </dict>
          <dict>
            <key>position</key>
            <integer>935</integer>
            <key>width</key>
            <integer>50</integer>
          </dict>
        </array>
        <key>vhints</key>
        <array>
          <dict>
            <key>position</key>
            <integer>184</integer>
            <key>width</key>
            <integer>49</integer>
          </dict>
          <dict>
            <key>position</key>
            <integer>371</integer>
            <key>width</key>
            <integer>49</integer>
          </dict>
        </array>
      </dict>
    </dict>
  </lib>
</glyph>
