<?xml version="1.0" encoding="UTF-8"?>
<glyph name="uni1E8A" format="1">
  <advance width="551"/>
  <unicode hex="1E8A"/>
  <outline>
    <contour>
      <point x="536" y="0" type="line"/>
      <point x="448" y="0" type="line"/>
      <point x="275" y="299" type="line"/>
      <point x="101" y="0" type="line"/>
      <point x="15" y="0" type="line"/>
      <point x="233" y="365" type="line"/>
      <point x="29" y="712" type="line"/>
      <point x="117" y="712" type="line"/>
      <point x="275" y="431" type="line"/>
      <point x="433" y="712" type="line"/>
      <point x="521" y="712" type="line"/>
      <point x="316" y="365" type="line"/>
    </contour>
    <contour>
      <point x="238" y="797" type="line"/>
      <point x="238" y="873" type="line"/>
      <point x="313" y="873" type="line"/>
      <point x="313" y="797" type="line"/>
    </contour>
  </outline>
  <lib>
    <dict>
      <key>com.fontlab.hintData</key>
      <dict>
        <key>hhints</key>
        <array>
          <dict>
            <key>position</key>
            <integer>0</integer>
            <key>width</key>
            <integer>21</integer>
          </dict>
          <dict>
            <key>position</key>
            <integer>692</integer>
            <key>width</key>
            <integer>20</integer>
          </dict>
          <dict>
            <key>position</key>
            <integer>797</integer>
            <key>width</key>
            <integer>76</integer>
          </dict>
        </array>
        <key>vhints</key>
        <array>
          <dict>
            <key>position</key>
            <integer>238</integer>
            <key>width</key>
            <integer>75</integer>
          </dict>
        </array>
      </dict>
    </dict>
  </lib>
</glyph>
