<?xml version="1.0" encoding="UTF-8"?>
<glyph name="aacute" format="1">
  <advance width="519"/>
  <unicode hex="00E1"/>
  <outline>
    <contour>
      <point x="535" y="1133" type="line"/>
      <point x="154" y="797" type="line"/>
      <point x="295" y="1079" type="line"/>
    </contour>
    <contour>
      <point x="411" y="315" type="qcurve" smooth="yes"/>
      <point x="411" y="245"/>
      <point x="432" y="88"/>
      <point x="452" y="-2" type="qcurve"/>
      <point x="375" y="80"/>
      <point x="332" y="211" type="qcurve"/>
      <point x="312" y="180"/>
      <point x="233" y="80"/>
      <point x="173" y="8" type="qcurve"/>
      <point x="47" y="168"/>
      <point x="47" y="446" type="qcurve" smooth="yes"/>
      <point x="47" y="519"/>
      <point x="53" y="590" type="qcurve"/>
      <point x="194" y="670" type="line"/>
      <point x="323" y="592" type="line"/>
      <point x="332" y="640"/>
      <point x="344" y="684" type="qcurve"/>
      <point x="476" y="584" type="line"/>
      <point x="411" y="499"/>
    </contour>
    <contour>
      <point x="302" y="420" type="qcurve" smooth="yes"/>
      <point x="302" y="475"/>
      <point x="317" y="535" type="qcurve"/>
      <point x="233" y="578"/>
      <point x="179" y="590" type="qcurve"/>
      <point x="164" y="506"/>
      <point x="164" y="414" type="qcurve" smooth="yes"/>
      <point x="164" y="247"/>
      <point x="215" y="111" type="qcurve"/>
      <point x="313" y="231"/>
      <point x="317" y="295" type="qcurve"/>
      <point x="302" y="353"/>
    </contour>
  </outline>
</glyph>
