<?xml version="1.0" encoding="UTF-8"?>
<glyph name="aacute" format="1">
  <advance width="528"/>
  <unicode hex="00E1"/>
  <outline>
    <contour>
      <point x="476" y="0" type="curve"/>
      <point x="339" y="0" type="line"/>
      <point x="330" y="49" type="line"/>
      <point x="327" y="49" type="line"/>
      <point x="295" y="10"/>
      <point x="245" y="-11"/>
      <point x="187" y="-11" type="curve" smooth="yes"/>
      <point x="88" y="-11"/>
      <point x="29" y="61"/>
      <point x="29" y="139" type="curve" smooth="yes"/>
      <point x="29" y="266"/>
      <point x="143" y="327"/>
      <point x="316" y="326" type="curve"/>
      <point x="316" y="333" type="line" smooth="yes"/>
      <point x="316" y="359"/>
      <point x="302" y="396"/>
      <point x="227" y="396" type="curve" smooth="yes"/>
      <point x="177" y="396"/>
      <point x="124" y="379"/>
      <point x="92" y="359" type="curve"/>
      <point x="64" y="457" type="line"/>
      <point x="98" y="476"/>
      <point x="165" y="500"/>
      <point x="254" y="500" type="curve" smooth="yes"/>
      <point x="417" y="500"/>
      <point x="469" y="404"/>
      <point x="469" y="289" type="curve" smooth="yes"/>
      <point x="469" y="119" type="line" smooth="yes"/>
      <point x="469" y="72"/>
      <point x="471" y="27"/>
    </contour>
    <contour>
      <point x="321" y="178" type="curve" smooth="yes"/>
      <point x="321" y="231" type="line"/>
      <point x="241" y="232"/>
      <point x="179" y="213"/>
      <point x="179" y="154" type="curve" smooth="yes"/>
      <point x="179" y="115"/>
      <point x="205" y="96"/>
      <point x="239" y="96" type="curve" smooth="yes"/>
      <point x="277" y="96"/>
      <point x="308" y="121"/>
      <point x="318" y="152" type="curve" smooth="yes"/>
      <point x="320" y="160"/>
      <point x="321" y="169"/>
    </contour>
    <contour>
      <point x="281" y="702" type="line"/>
      <point x="422" y="702" type="line"/>
      <point x="300" y="550" type="line"/>
      <point x="195" y="550" type="line"/>
    </contour>
  </outline>
  <lib>
    <dict>
      <key>com.fontlab.hintData</key>
      <dict>
        <key>hhints</key>
        <array>
          <dict>
            <key>position</key>
            <integer>-11</integer>
            <key>width</key>
            <integer>107</integer>
          </dict>
          <dict>
            <key>position</key>
            <integer>0</integer>
            <key>width</key>
            <integer>21</integer>
          </dict>
          <dict>
            <key>position</key>
            <integer>231</integer>
            <key>width</key>
            <integer>95</integer>
          </dict>
          <dict>
            <key>position</key>
            <integer>396</integer>
            <key>width</key>
            <integer>104</integer>
          </dict>
          <dict>
            <key>position</key>
            <integer>550</integer>
            <key>width</key>
            <integer>152</integer>
          </dict>
        </array>
        <key>vhints</key>
        <array>
          <dict>
            <key>position</key>
            <integer>29</integer>
            <key>width</key>
            <integer>150</integer>
          </dict>
          <dict>
            <key>position</key>
            <integer>321</integer>
            <key>width</key>
            <integer>148</integer>
          </dict>
        </array>
      </dict>
    </dict>
  </lib>
</glyph>
