<?xml version="1.0" encoding="utf-8"?>
<!-- Generator: Adobe Illustrator 22.1.0, SVG Export Plug-In . SVG Version: 6.00 Build 0)  -->
<svg version="1.1" id="Layer_1" xmlns="http://www.w3.org/2000/svg" xmlns:xlink="http://www.w3.org/1999/xlink" x="0px" y="0px"
	 viewBox="0 0 2003.2 1589.4" style="enable-background:new 0 0 2003.2 1589.4;" xml:space="preserve">
<style type="text/css">
	.st0{clip-path:url(#SVGID_2_);fill:#FFFFFF;}
	.st1{clip-path:url(#SVGID_4_);fill:#FFFFFF;}
	.st2{clip-path:url(#SVGID_6_);fill:#FFFFFF;}
	.st3{clip-path:url(#SVGID_8_);fill:#FFFFFF;}
	.st4{clip-path:url(#SVGID_10_);fill:#FFFFFF;}
	.st5{fill:#FFFFFF;}
</style>
<g>
	<g>
		<g>
			<g id="XMLID_121_">
				<g id="XMLID_138_">
					<g>
						<defs>
							<path id="SVGID_1_" d="M670.7,907.2v-32.8h-94.2V1108h94.2V981.5c0-12.5,4-22.4,11.4-29.8c6.9-6.5,16.4-9.9,28.2-9.9
								c25.3,0,38.2,13.4,38.2,39.7V1108h93.7V955.2c0-26.7-7.9-48-24.3-63c-16.4-15.1-38.7-22.9-66.9-22.9
								C719.8,869.3,693,881.8,670.7,907.2"/>
						</defs>
						<use xlink:href="#SVGID_1_"  style="overflow:visible;fill:#FFFFFF;"/>
						<clipPath id="SVGID_2_">
							<use xlink:href="#SVGID_1_"  style="overflow:visible;"/>
						</clipPath>
						<rect id="XMLID_140_" x="576.5" y="869.3" class="st0" width="265.7" height="238.7"/>
					</g>
				</g>
				<g id="XMLID_135_">
					<g>
						<defs>
							<rect id="SVGID_3_" x="453.7" y="874.5" width="99.1" height="233.5"/>
						</defs>
						<use xlink:href="#SVGID_3_"  style="overflow:visible;fill:#FFFFFF;"/>
						<clipPath id="SVGID_4_">
							<use xlink:href="#SVGID_3_"  style="overflow:visible;"/>
						</clipPath>
						<rect id="XMLID_137_" x="453.7" y="874.5" class="st1" width="99.1" height="233.5"/>
					</g>
				</g>
				<g id="XMLID_132_">
					<g>
						<defs>
							<polygon id="SVGID_5_" points="385.1,741.6 273.7,992.8 162.2,741.6 57.2,741.6 223.5,1106 223.6,1106 323.8,1106 
								323.9,1106 490.2,741.6 							"/>
						</defs>
						<use xlink:href="#SVGID_5_"  style="overflow:visible;fill:#FFFFFF;"/>
						<clipPath id="SVGID_6_">
							<use xlink:href="#SVGID_5_"  style="overflow:visible;"/>
						</clipPath>
						<rect id="XMLID_134_" x="57.2" y="741.6" class="st2" width="433" height="364.4"/>
					</g>
				</g>
				<g id="XMLID_129_">
					<g>
						<defs>
							<path id="SVGID_7_" d="M1345.8,42.2c-191,19.9-386.2,74.7-399.1,240.5c-6,77.6,21.4,135.8,52.3,192
								c-77.6-66.6-189.7-119.9-346.8-106.9c95.7,23.7,208.6,68.8,269.3,128.5c12.8,12.8,31.6,34.7,27.2,53.5
								c-7.4,31.5-74,25.1-114.3,26.7c83.7,29.2,177.2,81.9,296.5,78.4c59.6-1.7,103.4-33.2,98.8-91.8
								c-8.4-105.2-97.3-195.1-106.6-314c-7.1-92,41.6-144,112-174.7l0,0c0,0,3-1.3,8.4-3.5c1.6-0.7,3.3-1.3,5-2
								c0.4-0.1,0.8-0.3,1.2-0.4c2.4-1,4.9-1.9,7.4-2.8c20.3-7.4,52.7-17.7,89.2-23.8h-0.5V42.2z"/>
						</defs>
						<use xlink:href="#SVGID_7_"  style="overflow:visible;fill:#FFFFFF;"/>
						<clipPath id="SVGID_8_">
							<use xlink:href="#SVGID_7_"  style="overflow:visible;"/>
						</clipPath>
						<rect id="XMLID_131_" x="619.1" y="-15.2" class="st3" width="867.6" height="683.7"/>
					</g>
				</g>
				<g id="XMLID_126_">
					<g>
						<defs>
							<polygon id="SVGID_9_" points="1268.2,802.7 1338.3,863.7 1408.4,802.6 1338.3,741.6 							"/>
						</defs>
						<use xlink:href="#SVGID_9_"  style="overflow:visible;fill:#FFFFFF;"/>
						<clipPath id="SVGID_10_">
							<use xlink:href="#SVGID_9_"  style="overflow:visible;"/>
						</clipPath>
						<rect id="XMLID_128_" x="1268.2" y="741.6" class="st4" width="140.2" height="122.1"/>
					</g>
				</g>
				<path id="XMLID_125_" class="st5" d="M1550.7,945.5v-8.4v-5.6h69.1v-59h-69.1v-69.9h-50.4h-10.6h-0.4c0.1,1.3,0.2,2.6,0.2,4
					c0,36-33.2,65.2-74.4,65.9v0.1v6.2v52.8h36.3v74.4v12.8c0,48.1,44.2,87.1,99.1,88c0.7,0,1.3,0.1,2,0.1
					c25.8,0,49.2-8.5,67.1-22.3V1026c-10.1,6.6-22.6,10.6-36.3,10.6c-5.9,0-11.5-0.8-16.9-2.1c-13.2-3.4-15.6-12.3-16-16.8V1006
					v-60.5H1550.7z"/>
				<rect id="XMLID_124_" x="1288.7" y="872.6" class="st5" width="99.1" height="233.5"/>
				<polygon id="XMLID_123_" class="st5" points="1841.6,872.6 1785.7,994.4 1742.5,872.6 1643.3,872.6 1732.4,1105.4 1679.3,1226 
					1785.4,1226 1941.7,872.6 				"/>
				<path id="XMLID_122_" class="st5" d="M1066.7,1029.8c-58.3,0-105.5-47.3-105.5-105.5c0-58.3,47.3-105.5,105.5-105.5
					c49.7,0,91.2,34.3,102.4,80.6h99.5c-13.5-89-98.3-157.7-201-157.7c-112.1,0-202.9,81.7-202.9,182.6s90.9,182.6,202.9,182.6
					c102.7,0,187.5-68.7,201-157.7h-99.5C1158,995.4,1116.4,1029.8,1066.7,1029.8"/>
			</g>
			<g>
				<path class="st5" d="M548.8,1260.9c14.6,0,23.1-0.2,25.4-0.6c2.3-0.3,3.5-2,3.5-4.7c0-3.3-1.6-5.4-4.9-6.2
					c-3.2-0.9-11.3-1.3-24.1-1.3c-25.4,0-41.4-1.7-48.1-4.8c-6.6-3.2-10-11.1-10-23.9c0-11.8,4.3-19.3,13-22.6
					c6.6-2.5,21.4-3.7,44.3-3.7c20.4,0,33.3,0.4,38.8,1.4c12.8,2.2,19.2,11.8,19.2,28.4h-25.3c-2.6,0-5-1.7-5.5-3.9
					s-1.5-3.6-3.1-4.2c-2.3-0.8-10.3-1.1-24-1.1s-21.7,0.2-23.8,0.7c-2.1,0.4-3.2,2.1-3.2,4.8c0,3,1.8,5,5.4,5.8
					c3.6,0.9,11,1.3,22.2,1.3c25.1,0,41.2,1.8,48.5,5.2c7.2,3.4,10.8,11.4,10.8,23.9c0,11.4-4.1,18.8-12.2,22.1
					c-7,2.8-22.8,4.1-47.3,4.1c-18.9,0-31.2-0.3-36.8-1.1c-8.7-1.1-14.6-3.7-17.7-7.9c-3.1-4.1-4.7-11.3-4.7-21.6h25.3
					c2.6,0,5,1.7,5.5,3.9c0.5,2.5,1.6,4,3.2,4.5C525.9,1260.6,534.3,1260.9,548.8,1260.9z"/>
				<path class="st5" d="M649.9,1194.3h74.5c16.2,0,26.9,1.8,32.1,5.2c6.4,4.3,9.7,13.3,9.7,27.4c0,13.9-3.2,23-9.5,27.2
					c-5.3,3.5-16,5.4-32.2,5.4h-44v16.2c0,2.8-2.5,5-5.7,5H650L649.9,1194.3L649.9,1194.3z M680.4,1237.1h44c3.6,0,6.3-0.7,8.2-2.1
					c2.2-1.7,3.3-4.3,3.3-8.1c0-3.9-1.1-6.6-3.3-8.3c-1.8-1.3-4.6-2-8.2-2h-44V1237.1z"/>
				<path class="st5" d="M937.8,1237.4c0,20.9-2.9,33.4-8.7,37.6c-6.3,4.4-25.2,6.6-56.7,6.6c-23.1,0-38.2-0.7-45.4-2.1
					c-9-1.9-14.8-5.8-17.2-12.1c-1.8-4.7-2.8-14.7-2.8-30c0-21,2.9-33.6,8.6-37.6c6.3-4.5,25.2-6.7,56.8-6.7
					c31.4,0,50.3,2.2,56.6,6.6C934.8,1203.8,937.8,1216.4,937.8,1237.4z M837.5,1237.4c0,11,1.4,17.4,4.4,19.3
					c2.9,1.9,13.1,2.8,30.5,2.8c17.5,0,27.7-0.9,30.6-2.8c2.9-1.9,4.4-8.3,4.4-19.3c0-11.1-1.5-17.6-4.4-19.4
					c-2.9-1.8-13.1-2.8-30.5-2.8c-17.5,0-27.7,0.9-30.6,2.8C839,1219.8,837.5,1226.3,837.5,1237.4z"/>
				<path class="st5" d="M979.9,1194.3h88.6c10.9,0,18.6,1.8,23.1,5.2c4.9,3.7,7.3,10.5,7.3,19.9c0,7.4-1,12.9-3,16.4
					c-2,3.5-5.6,6.2-10.6,7.9c5.5,2.1,9.1,4.2,10.9,6.3c1.8,2.1,2.7,5.8,2.7,11.2v19.3h-30.4V1265c0-2.2-0.7-4.1-2.1-5.6
					c-1.8-2.1-4.4-3.1-7.9-3.1h-48.1v19.1c0,2.8-2.6,5-5.7,5h-24.8V1194.3z M1010.4,1216.6v17.5h48.9c3.3,0,5.7-0.7,7.1-1.9
					s2.2-3.5,2.2-6.8s-0.7-5.6-2.2-6.8c-1.5-1.3-3.8-1.9-7-1.9h-49V1216.6z"/>
				<path class="st5" d="M1140.2,1216.6v-22.3H1258v22.3h-43.7v59c0,2.8-2.5,5-5.6,5h-24.8v-63.8h-43.7V1216.6z"/>
				<path class="st5" d="M1297.3,1280.5v-86h30.5v81.1c0,2.8-2.6,5-5.7,5H1297.3z"/>
				<path class="st5" d="M1408.2,1194.4h52.3l49,86H1474l-9.4-14.3h-60.3l-9.5,14.3h-35.5L1408.2,1194.4z M1436.7,1213.7h-4.7
					l-16.4,30h37.5L1436.7,1213.7z"/>
			</g>
		</g>
		<g>
			<path class="st5" d="M1625.1,1551H373.8v-195.6h1251.3V1551z M384.4,1541.6h1230v-177h-1230L384.4,1541.6L384.4,1541.6z"/>
			<g>
				<path class="st5" d="M517.6,1428.2h-30.7v-13.8h78.6v13.8h-30.7v70.6h-17.2L517.6,1428.2L517.6,1428.2z"/>
				<path class="st5" d="M560.8,1480.4v-0.2c0-6.6,2.8-11.8,8.4-15.4c5.3-3.4,12.4-5.1,21.7-5.1c6.8,0,13.3,0.9,19.6,2.6v-1.5
					c0-9.2-6.1-13.9-18.1-13.9c-6.6,0-13.5,1.3-20.9,4l-4.4-11.4c8.9-3.5,18-5.2,27.5-5.2c10.9,0,19,2.4,24.2,7.2
					c5.3,4.5,7.9,11.1,7.9,19.6v37.7h-16.3v-7.9c-5.9,6.2-13.8,9.2-23.8,9.2c-7.2,0-13.3-1.7-18.1-5.1
					C563.5,1491.4,560.8,1486.6,560.8,1480.4z M588.1,1409.4h15.5l16.2,17.7h-13.3l-10.8-8l-10.7,8h-13L588.1,1409.4z M610.9,1475.9
					v-4.3c-5-1.7-10.5-2.5-16.6-2.5c-11.5,0-17.1,3.5-17.1,10.6v0.2c0,3,1.4,5.3,4.1,7.2c2.6,1.7,6,2.5,10.1,2.5
					c5.7,0,10.2-1.2,14-3.7C609.1,1483.3,610.9,1479.9,610.9,1475.9z"/>
				<path class="st5" d="M694.7,1435.2h17.4l-29,65.5c-2.9,6.5-6.2,11.1-9.8,13.8c-3.6,2.8-8.3,4.1-14.3,4.1
					c-6.1,0-11.9-1.3-17.3-3.9l5.7-10.9c3.5,1.5,6.6,2.4,9.8,2.4c4.4,0,7.9-2.4,10.4-7.3l-30.4-63.7h18l20.6,47.2L694.7,1435.2z"/>
				<path class="st5" d="M769.8,1414.4h18.1l29.5,39.8l29.5-39.8H865v84.3h-17v-60.5l-30.6,39.7h-0.6l-30.3-39.5v60.2h-16.7V1414.4z
					"/>
				<path class="st5" d="M883.8,1467.4v-0.2c0-9.2,3.7-17.2,11.1-23.5c7.6-6.5,16.9-9.8,27.9-9.8c11.1,0,20.3,3.3,27.8,9.7
					c7.3,6.4,11.1,14.2,11.1,23.3v0.2c0,9.1-3.7,16.9-11.1,23.3c-7.6,6.5-16.9,9.8-28.1,9.8c-11.1,0-20.3-3.3-27.7-9.7
					C887.5,1484.2,883.8,1476.5,883.8,1467.4z M913.5,1398.7c-3,0-5.5,2.1-7.6,6.1l-9.3-2.5c3.2-10,8.3-15,15.5-15
					c2.9,0,6.8,0.9,11.6,2.5c3.9,1.5,6.6,2.3,8.3,2.3c3,0,5.5-2.1,7.6-6.1l9.3,2.4c-3.2,10-8.3,15.1-15.5,15.1
					c-2.9,0-6.8-0.9-11.6-2.5C918,1399.5,915.2,1398.7,913.5,1398.7z M914.9,1409.4h15.5l16.2,17.7h-13.3l-10.8-8l-10.7,8h-13
					L914.9,1409.4z M944.9,1467.4v-0.2c0-5.6-2.1-10.5-6.2-14.4c-4.3-4-9.7-6.1-16.2-6.1s-11.9,2-16,5.9c-4,3.9-6,8.7-6,14.3v0.2
					c0,5.6,2.1,10.3,6.2,14.3c4.3,4,9.7,6.1,16,6.1c6.6,0,12-2,16.2-5.9C943,1477.7,944.9,1473.1,944.9,1467.4z"/>
				<path class="st5" d="M972.8,1510.2c8.4-1.4,12.4-5.2,11.9-11.3h-7.2v-16.6h18.4v14.1c0,12.3-7.1,19-21.3,20.1L972.8,1510.2z"/>
				<path class="st5" d="M1063.3,1463.1h-10.4v-13.2h10.4v-35.3h36.1c15.1,0,27.4,4,37.2,12c9.5,7.9,14.2,17.9,14.2,29.9v0.2
					c0,12-4.7,22-14.2,30c-9.8,8-22.1,12.2-37.2,12.2h-36.1V1463.1z M1080.3,1463.1v22.3h19.1c10.1,0,18.3-2.6,24.5-8
					c6.1-5.2,9.1-12,9.1-20.4v-0.2c0-8.4-3-15.2-9.1-20.5c-6.2-5.4-14.4-8.3-24.5-8.3h-19.1v21.8h24.2v13.2L1080.3,1463.1
					L1080.3,1463.1z"/>
				<path class="st5" d="M1164.6,1480.4v-0.2c0-6.6,2.8-11.8,8.4-15.4c5.3-3.4,12.4-5.1,21.7-5.1c6.8,0,13.3,0.9,19.6,2.6v-1.5
					c0-9.2-6.1-13.9-18.1-13.9c-6.6,0-13.5,1.3-20.9,4l-4.4-11.4c8.9-3.5,18-5.2,27.5-5.2c10.9,0,19,2.4,24.2,7.2
					c5.3,4.5,7.9,11.1,7.9,19.6v37.7h-16.3v-7.9c-5.9,6.2-13.8,9.2-23.8,9.2c-7.2,0-13.3-1.7-18.1-5.1
					C1167.2,1491.4,1164.6,1486.6,1164.6,1480.4z M1214.7,1475.9v-4.3c-5-1.7-10.5-2.5-16.6-2.5c-11.5,0-17.1,3.5-17.1,10.6v0.2
					c0,3,1.4,5.3,4.1,7.2c2.6,1.7,6,2.5,10.1,2.5c5.7,0,10.2-1.2,14-3.7C1212.9,1483.3,1214.7,1479.9,1214.7,1475.9z M1189.5,1508.7
					h16.2v14.4h-16.2V1508.7z"/>
				<path class="st5" d="M1250.8,1411.6h18v13.9h-18V1411.6z M1251.5,1435.2h16.7v63.6h-16.7V1435.2z"/>
				<path class="st5" d="M1333.5,1414.4h18.1l29.5,39.8l29.5-39.8h18.1v84.3h-17v-60.5l-30.6,39.7h-0.6l-30.3-39.5v60.2h-16.7
					V1414.4z"/>
				<path class="st5" d="M1447.5,1467.4v-0.2c0-9.2,3.7-17.2,11.1-23.5c7.6-6.5,16.9-9.8,27.9-9.8c11.1,0,20.3,3.3,27.8,9.7
					c7.3,6.4,11.1,14.2,11.1,23.3v0.2c0,9.1-3.7,16.9-11.1,23.3c-7.6,6.5-16.9,9.8-28.1,9.8c-11.1,0-20.3-3.3-27.7-9.7
					C1451.2,1484.2,1447.5,1476.5,1447.5,1467.4z M1477.2,1398.7c-3,0-5.5,2.1-7.6,6.1l-9.3-2.5c3.2-10,8.3-15,15.5-15
					c2.9,0,6.8,0.9,11.6,2.5c3.9,1.5,6.6,2.3,8.3,2.3c3,0,5.5-2.1,7.6-6.1l9.3,2.4c-3.2,10-8.3,15.1-15.5,15.1
					c-2.9,0-6.8-0.9-11.6-2.5C1481.6,1399.5,1478.9,1398.7,1477.2,1398.7z M1478.6,1409.4h15.5l16.2,17.7H1497l-10.8-8l-10.7,8h-13
					L1478.6,1409.4z M1508.6,1467.4v-0.2c0-5.6-2.1-10.5-6.2-14.4c-4.3-4-9.7-6.1-16.2-6.1s-11.9,2-16,5.9c-4,3.9-5.9,8.7-5.9,14.3
					v0.2c0,5.6,2.1,10.3,6.2,14.3c4.3,4,9.7,6.1,16,6.1c6.6,0,12-2,16.2-5.9C1506.7,1477.7,1508.6,1473.1,1508.6,1467.4z"/>
			</g>
		</g>
	</g>
</g>
</svg>
