<?xml version="1.0" encoding="UTF-8"?>
<glyph name="product" format="1">
  <advance width="696"/>
  <unicode hex="220F"/>
  <outline>
    <contour>
      <point x="593" y="-220" type="line"/>
      <point x="517" y="-220" type="line"/>
      <point x="517" y="692" type="line"/>
      <point x="179" y="692" type="line"/>
      <point x="179" y="-220" type="line"/>
      <point x="103" y="-220" type="line"/>
      <point x="103" y="760" type="line"/>
      <point x="593" y="760" type="line"/>
    </contour>
  </outline>
  <lib>
    <dict>
      <key>com.fontlab.hintData</key>
      <dict>
        <key>hhints</key>
        <array>
          <dict>
            <key>position</key>
            <integer>-220</integer>
            <key>width</key>
            <integer>21</integer>
          </dict>
          <dict>
            <key>position</key>
            <integer>692</integer>
            <key>width</key>
            <integer>68</integer>
          </dict>
        </array>
        <key>vhints</key>
        <array>
          <dict>
            <key>position</key>
            <integer>103</integer>
            <key>width</key>
            <integer>76</integer>
          </dict>
          <dict>
            <key>position</key>
            <integer>517</integer>
            <key>width</key>
            <integer>76</integer>
          </dict>
        </array>
      </dict>
    </dict>
  </lib>
</glyph>
