<?xml version="1.0" encoding="UTF-8"?>
<glyph name="A" format="1">
  <advance width="656"/>
  <unicode hex="0041"/>
  <outline>
    <contour>
      <point x="416" y="173" type="line"/>
      <point x="223" y="173" type="line"/>
      <point x="175" y="0" type="line"/>
      <point x="17" y="0" type="line"/>
      <point x="223" y="674" type="line"/>
      <point x="423" y="674" type="line"/>
      <point x="632" y="0" type="line"/>
      <point x="468" y="0" type="line"/>
    </contour>
    <contour>
      <point x="245" y="287" type="line"/>
      <point x="394" y="287" type="line"/>
      <point x="352" y="430" type="line" smooth="yes"/>
      <point x="340" y="470"/>
      <point x="328" y="520"/>
      <point x="318" y="560" type="curve"/>
      <point x="316" y="560" type="line"/>
      <point x="306" y="520"/>
      <point x="296" y="469"/>
      <point x="285" y="430" type="curve" smooth="yes"/>
    </contour>
  </outline>
  <lib>
    <dict>
      <key>com.fontlab.hintData</key>
      <dict>
        <key>hhints</key>
        <array>
          <dict>
            <key>position</key>
            <integer>0</integer>
            <key>width</key>
            <integer>21</integer>
          </dict>
          <dict>
            <key>position</key>
            <integer>173</integer>
            <key>width</key>
            <integer>114</integer>
          </dict>
          <dict>
            <key>position</key>
            <integer>560</integer>
            <key>width</key>
            <integer>114</integer>
          </dict>
          <dict>
            <key>position</key>
            <integer>654</integer>
            <key>width</key>
            <integer>20</integer>
          </dict>
        </array>
        <key>vhints</key>
        <array>
          <dict>
            <key>position</key>
            <integer>17</integer>
            <key>width</key>
            <integer>615</integer>
          </dict>
        </array>
      </dict>
    </dict>
  </lib>
</glyph>
