<?xml version="1.0" encoding="UTF-8"?>
<glyph name="guillemotleft" format="1">
  <advance width="554"/>
  <unicode hex="00AB"/>
  <outline>
    <contour>
      <point x="250" y="58" type="line"/>
      <point x="40" y="268" type="line"/>
      <point x="250" y="478" type="line"/>
      <point x="250" y="388" type="line"/>
      <point x="130" y="268" type="line"/>
      <point x="250" y="147" type="line"/>
    </contour>
    <contour>
      <point x="476" y="58" type="line"/>
      <point x="266" y="268" type="line"/>
      <point x="476" y="478" type="line"/>
      <point x="476" y="388" type="line"/>
      <point x="355" y="268" type="line"/>
      <point x="476" y="147" type="line"/>
    </contour>
  </outline>
  <lib>
    <dict>
      <key>com.fontlab.hintData</key>
      <dict>
        <key>hhints</key>
        <array>
          <dict>
            <key>position</key>
            <integer>58</integer>
            <key>width</key>
            <integer>21</integer>
          </dict>
          <dict>
            <key>position</key>
            <integer>458</integer>
            <key>width</key>
            <integer>20</integer>
          </dict>
        </array>
      </dict>
    </dict>
  </lib>
</glyph>
