<?xml version="1.0" encoding="UTF-8"?>
<glyph name="Edotaccent" format="1">
  <advance width="534"/>
  <unicode hex="0116"/>
  <outline>
    <contour>
      <point x="467" y="409" type="line"/>
      <point x="467" y="285" type="line"/>
      <point x="219" y="285" type="line"/>
      <point x="219" y="125" type="line"/>
      <point x="496" y="125" type="line"/>
      <point x="496" y="0" type="line"/>
      <point x="66" y="0" type="line"/>
      <point x="66" y="674" type="line"/>
      <point x="482" y="674" type="line"/>
      <point x="482" y="549" type="line"/>
      <point x="219" y="549" type="line"/>
      <point x="219" y="409" type="line"/>
    </contour>
    <contour>
      <point x="270" y="713" type="curve" smooth="yes"/>
      <point x="230" y="713"/>
      <point x="200" y="745"/>
      <point x="200" y="781" type="curve" smooth="yes"/>
      <point x="200" y="820"/>
      <point x="230" y="850"/>
      <point x="270" y="850" type="curve" smooth="yes"/>
      <point x="307" y="850"/>
      <point x="337" y="820"/>
      <point x="337" y="781" type="curve" smooth="yes"/>
      <point x="337" y="745"/>
      <point x="307" y="713"/>
    </contour>
  </outline>
  <lib>
    <dict>
      <key>com.fontlab.hintData</key>
      <dict>
        <key>hhints</key>
        <array>
          <dict>
            <key>position</key>
            <integer>0</integer>
            <key>width</key>
            <integer>125</integer>
          </dict>
          <dict>
            <key>position</key>
            <integer>285</integer>
            <key>width</key>
            <integer>124</integer>
          </dict>
          <dict>
            <key>position</key>
            <integer>549</integer>
            <key>width</key>
            <integer>125</integer>
          </dict>
          <dict>
            <key>position</key>
            <integer>713</integer>
            <key>width</key>
            <integer>137</integer>
          </dict>
        </array>
        <key>vhints</key>
        <array>
          <dict>
            <key>position</key>
            <integer>66</integer>
            <key>width</key>
            <integer>153</integer>
          </dict>
          <dict>
            <key>position</key>
            <integer>200</integer>
            <key>width</key>
            <integer>137</integer>
          </dict>
        </array>
      </dict>
    </dict>
  </lib>
</glyph>
