<?xml version="1.0" encoding="UTF-8"?>
<glyph name="Chi" format="1">
  <advance width="613"/>
  <unicode hex="03A7"/>
  <outline>
    <contour>
      <point x="597" y="0" type="line"/>
      <point x="421" y="0" type="line"/>
      <point x="360" y="122" type="line" smooth="yes"/>
      <point x="335" y="169"/>
      <point x="319" y="204"/>
      <point x="300" y="243" type="curve"/>
      <point x="298" y="243" type="line"/>
      <point x="284" y="204"/>
      <point x="267" y="169"/>
      <point x="246" y="122" type="curve" smooth="yes"/>
      <point x="190" y="0" type="line"/>
      <point x="16" y="0" type="line"/>
      <point x="211" y="341" type="line"/>
      <point x="23" y="674" type="line"/>
      <point x="198" y="674" type="line"/>
      <point x="257" y="551" type="line" smooth="yes"/>
      <point x="277" y="510"/>
      <point x="292" y="477"/>
      <point x="308" y="439" type="curve"/>
      <point x="310" y="439" type="line"/>
      <point x="326" y="482"/>
      <point x="339" y="512"/>
      <point x="356" y="551" type="curve" smooth="yes"/>
      <point x="413" y="674" type="line"/>
      <point x="587" y="674" type="line"/>
      <point x="397" y="345" type="line"/>
    </contour>
  </outline>
  <lib>
    <dict>
      <key>com.fontlab.hintData</key>
      <dict>
        <key>hhints</key>
        <array>
          <dict>
            <key>position</key>
            <integer>0</integer>
            <key>width</key>
            <integer>21</integer>
          </dict>
          <dict>
            <key>position</key>
            <integer>654</integer>
            <key>width</key>
            <integer>20</integer>
          </dict>
        </array>
        <key>vhints</key>
        <array>
          <dict>
            <key>position</key>
            <integer>16</integer>
            <key>width</key>
            <integer>581</integer>
          </dict>
        </array>
      </dict>
    </dict>
  </lib>
</glyph>
