<?xml version="1.0" encoding="UTF-8"?>
<glyph name="edotaccent" format="1">
  <advance width="530"/>
  <unicode hex="0117"/>
  <outline>
    <contour>
      <point x="467" y="227" type="line"/>
      <point x="135" y="227" type="line"/>
      <point x="135" y="119"/>
      <point x="185" y="57"/>
      <point x="280" y="57" type="curve" smooth="yes"/>
      <point x="337" y="57"/>
      <point x="370" y="74"/>
      <point x="409" y="113" type="curve"/>
      <point x="458" y="70" type="line"/>
      <point x="408" y="20"/>
      <point x="361" y="-6"/>
      <point x="278" y="-6" type="curve" smooth="yes"/>
      <point x="147" y="-6"/>
      <point x="63" y="72"/>
      <point x="63" y="246" type="curve" smooth="yes"/>
      <point x="63" y="406"/>
      <point x="140" y="498"/>
      <point x="265" y="498" type="curve" smooth="yes"/>
      <point x="393" y="498"/>
      <point x="467" y="407"/>
      <point x="467" y="259" type="curve" smooth="yes"/>
    </contour>
    <contour>
      <point x="396" y="281" type="line"/>
      <point x="393" y="321"/>
      <point x="392" y="337"/>
      <point x="380" y="363" type="curve" smooth="yes"/>
      <point x="359" y="408"/>
      <point x="318" y="437"/>
      <point x="265" y="437" type="curve" smooth="yes"/>
      <point x="212" y="437"/>
      <point x="171" y="408"/>
      <point x="150" y="363" type="curve" smooth="yes"/>
      <point x="138" y="337"/>
      <point x="137" y="321"/>
      <point x="135" y="281" type="curve"/>
    </contour>
    <contour>
      <point x="226" y="610" type="line"/>
      <point x="226" y="687" type="line"/>
      <point x="301" y="687" type="line"/>
      <point x="301" y="610" type="line"/>
    </contour>
  </outline>
  <lib>
    <dict>
      <key>com.fontlab.hintData</key>
      <dict>
        <key>hhints</key>
        <array>
          <dict>
            <key>position</key>
            <integer>-6</integer>
            <key>width</key>
            <integer>63</integer>
          </dict>
          <dict>
            <key>position</key>
            <integer>227</integer>
            <key>width</key>
            <integer>54</integer>
          </dict>
          <dict>
            <key>position</key>
            <integer>437</integer>
            <key>width</key>
            <integer>61</integer>
          </dict>
          <dict>
            <key>position</key>
            <integer>610</integer>
            <key>width</key>
            <integer>77</integer>
          </dict>
        </array>
        <key>vhints</key>
        <array>
          <dict>
            <key>position</key>
            <integer>63</integer>
            <key>width</key>
            <integer>72</integer>
          </dict>
          <dict>
            <key>position</key>
            <integer>226</integer>
            <key>width</key>
            <integer>75</integer>
          </dict>
        </array>
      </dict>
    </dict>
  </lib>
</glyph>
