<?xml version="1.0" encoding="UTF-8"?>
<glyph name="S" format="1">
  <advance width="588"/>
  <unicode hex="0053"/>
  <outline>
    <contour>
      <point x="532" y="196" type="curve" smooth="yes"/>
      <point x="532" y="71"/>
      <point x="435" y="-6"/>
      <point x="286" y="-6" type="curve" smooth="yes"/>
      <point x="180" y="-6"/>
      <point x="109" y="21"/>
      <point x="43" y="88" type="curve"/>
      <point x="94" y="139" type="line"/>
      <point x="153" y="80"/>
      <point x="208" y="62"/>
      <point x="288" y="62" type="curve" smooth="yes"/>
      <point x="393" y="62"/>
      <point x="457" y="110"/>
      <point x="457" y="194" type="curve" smooth="yes"/>
      <point x="457" y="232"/>
      <point x="446" y="262"/>
      <point x="422" y="283" type="curve" smooth="yes"/>
      <point x="400" y="303"/>
      <point x="380" y="310"/>
      <point x="329" y="318" type="curve" smooth="yes"/>
      <point x="246" y="330" type="line" smooth="yes"/>
      <point x="190" y="339"/>
      <point x="148" y="356"/>
      <point x="116" y="384" type="curve" smooth="yes"/>
      <point x="80" y="416"/>
      <point x="61" y="460"/>
      <point x="61" y="518" type="curve" smooth="yes"/>
      <point x="61" y="639"/>
      <point x="148" y="718"/>
      <point x="289" y="718" type="curve" smooth="yes"/>
      <point x="380" y="718"/>
      <point x="440" y="694"/>
      <point x="501" y="640" type="curve"/>
      <point x="452" y="591" type="line"/>
      <point x="409" y="632"/>
      <point x="360" y="653"/>
      <point x="286" y="653" type="curve" smooth="yes"/>
      <point x="190" y="653"/>
      <point x="135" y="600"/>
      <point x="135" y="520" type="curve" smooth="yes"/>
      <point x="135" y="485"/>
      <point x="145" y="456"/>
      <point x="167" y="437" type="curve" smooth="yes"/>
      <point x="189" y="418"/>
      <point x="223" y="406"/>
      <point x="260" y="400" type="curve" smooth="yes"/>
      <point x="343" y="387" type="line" smooth="yes"/>
      <point x="409" y="377"/>
      <point x="440" y="365"/>
      <point x="472" y="336" type="curve" smooth="yes"/>
      <point x="510" y="303"/>
      <point x="532" y="255"/>
    </contour>
  </outline>
  <lib>
    <dict>
      <key>com.fontlab.hintData</key>
      <dict>
        <key>hhints</key>
        <array>
          <dict>
            <key>position</key>
            <integer>-6</integer>
            <key>width</key>
            <integer>68</integer>
          </dict>
          <dict>
            <key>position</key>
            <integer>653</integer>
            <key>width</key>
            <integer>65</integer>
          </dict>
        </array>
        <key>vhints</key>
        <array>
          <dict>
            <key>position</key>
            <integer>61</integer>
            <key>width</key>
            <integer>74</integer>
          </dict>
          <dict>
            <key>position</key>
            <integer>457</integer>
            <key>width</key>
            <integer>75</integer>
          </dict>
        </array>
      </dict>
    </dict>
  </lib>
</glyph>
