<?xml version="1.0" encoding="UTF-8"?>
<glyph name="Thorn" format="1">
  <advance width="642"/>
  <unicode hex="00DE"/>
  <outline>
    <contour>
      <point x="588" y="359" type="curve" smooth="yes"/>
      <point x="588" y="231"/>
      <point x="498" y="150"/>
      <point x="368" y="150" type="curve" smooth="yes"/>
      <point x="179" y="150" type="line"/>
      <point x="179" y="0" type="line"/>
      <point x="103" y="0" type="line"/>
      <point x="103" y="712" type="line"/>
      <point x="179" y="712" type="line"/>
      <point x="179" y="569" type="line"/>
      <point x="368" y="569" type="line" smooth="yes"/>
      <point x="498" y="569"/>
      <point x="588" y="487"/>
    </contour>
    <contour>
      <point x="512" y="359" type="curve" smooth="yes"/>
      <point x="512" y="453"/>
      <point x="450" y="500"/>
      <point x="361" y="500" type="curve" smooth="yes"/>
      <point x="179" y="500" type="line"/>
      <point x="179" y="218" type="line"/>
      <point x="361" y="218" type="line" smooth="yes"/>
      <point x="450" y="218"/>
      <point x="512" y="265"/>
    </contour>
  </outline>
  <lib>
    <dict>
      <key>com.fontlab.hintData</key>
      <dict>
        <key>hhints</key>
        <array>
          <dict>
            <key>position</key>
            <integer>0</integer>
            <key>width</key>
            <integer>21</integer>
          </dict>
          <dict>
            <key>position</key>
            <integer>150</integer>
            <key>width</key>
            <integer>68</integer>
          </dict>
          <dict>
            <key>position</key>
            <integer>500</integer>
            <key>width</key>
            <integer>69</integer>
          </dict>
          <dict>
            <key>position</key>
            <integer>692</integer>
            <key>width</key>
            <integer>20</integer>
          </dict>
        </array>
        <key>vhints</key>
        <array>
          <dict>
            <key>position</key>
            <integer>103</integer>
            <key>width</key>
            <integer>76</integer>
          </dict>
          <dict>
            <key>position</key>
            <integer>512</integer>
            <key>width</key>
            <integer>76</integer>
          </dict>
        </array>
      </dict>
    </dict>
  </lib>
</glyph>
