{
  "version": "0.0.24",
  "apps": [
    {
      "name": "Web3 Space",
      "version": "0.0.8",
      "hash": "335d3df52df4852c962277ca563e4a7cb67f450a31f9b3fe80543f262bf3f71c",
      "pubKey": "927c8f340255d5a2d7b839ce4859f7dc33c64e5967fe40dde023c0751a53dff3925eec1eaaeb60f83c203c85e9c5b223",
      "sign": "a72c0b66b936b36525fdc1f07c94266a8280abd6acb04d1d87477d8ea790c98593084649f5be7fb7653c8ffcc34dd3e5067b2ffac7feaa85e5e574c972b7363dc0ac7df937c82cdce2ccae7cf6c2df265a3e8c9188cda23d872da08a0e2fa5a4",
      "logo": "https://metanode.co/images/browser.png",
      "urlLauchScreen": "",
      "urlLoadingScreen": "",
      "urlZip": "https://metanode.co/zip/browser/browser_0.0.5.zip",
      "id": "com.web3space.metaword",
      "orientation": "portrait",
      "author": "n/a",
      "full_screen": true,
      "status_bar": "hide"
    },
    {
      "name": "2048",
      "version": "1.0.0",
      "hash": "335d3df52df4852c962277ca563e4a7cb67f450a31f9b3fe80543f262bf3f71c",
      "pubKey": "927c8f340255d5a2d7b839ce4859f7dc33c64e5967fe40dde023c0751a53dff3925eec1eaaeb60f83c203c85e9c5b223",
      "sign": "a72c0b66b936b36525fdc1f07c94266a8280abd6acb04d1d87477d8ea790c98593084649f5be7fb7653c8ffcc34dd3e5067b2ffac7feaa85e5e574c972b7363dc0ac7df937c82cdce2ccae7cf6c2df265a3e8c9188cda23d872da08a0e2fa5a4",
      "logo": "https://upload.wikimedia.org/wikipedia/commons/thumb/1/18/2048_logo.svg/1200px-2048_logo.svg.png",
      "urlLauchScreen": "",
      "urlLoadingScreen": "",
      "urlZip": "https://gitlab.com/QuangFiIt/upload_app/-/raw/feature/reupgame/game/2048.zip",
      "id": "com.2048.metaword",
      "orientation": "portrait",
      "author": "n/a",
      "isLocal": false,
      "full_screen": true,
      "status_bar": "hide"
    },
    {
      "name": "Clumsy-Vird",
      "version": "1.0.0",
      "hash": "335d3df52df4852c962277ca563e4a7cb67f450a31f9b3fe80543f262bf3f71c",
      "pubKey": "927c8f340255d5a2d7b839ce4859f7dc33c64e5967fe40dde023c0751a53dff3925eec1eaaeb60f83c203c85e9c5b223",
      "sign": "a72c0b66b936b36525fdc1f07c94266a8280abd6acb04d1d87477d8ea790c98593084649f5be7fb7653c8ffcc34dd3e5067b2ffac7feaa85e5e574c972b7363dc0ac7df937c82cdce2ccae7cf6c2df265a3e8c9188cda23d872da08a0e2fa5a4",
      "logo": "https://mobimg.b-cdn.net/v2/fetch/67/67ecbe8c7e8e46f21e728e7a8eb08539.jpeg",
      "urlLauchScreen": "",
      "urlLoadingScreen": "",
      "urlZip": "https://gitlab.com/QuangFiIt/upload_app/-/raw/feature/reupgame/game/clumsy-bird.zip",
      "id": "com.clumsy-bird.metaword",
      "orientation": "landscape",
      "author": "n/a",
      "isLocal": false,
      "full_screen": true,
      "status_bar": "hide"
    },
    {
      "name": "Coil",
      "version": "1.0.0",
      "hash": "335d3df52df4852c962277ca563e4a7cb67f450a31f9b3fe80543f262bf3f71c",
      "pubKey": "927c8f340255d5a2d7b839ce4859f7dc33c64e5967fe40dde023c0751a53dff3925eec1eaaeb60f83c203c85e9c5b223",
      "sign": "a72c0b66b936b36525fdc1f07c94266a8280abd6acb04d1d87477d8ea790c98593084649f5be7fb7653c8ffcc34dd3e5067b2ffac7feaa85e5e574c972b7363dc0ac7df937c82cdce2ccae7cf6c2df265a3e8c9188cda23d872da08a0e2fa5a4",
      "logo": "https://encrypted-tbn0.gstatic.com/images?q=tbn:ANd9GcSH48XpqnE8yKMTg_107fP-ag7iw5ePAh7Ibw&usqp=CAU",
      "urlLauchScreen": "",
      "urlLoadingScreen": "",
      "urlZip": "https://gitlab.com/QuangFiIt/upload_app/-/raw/feature/reupgame/game/Coil.zip",
      "id": "com.Coil.metaword",
      "orientation": "landscape",
      "author": "n/a",
      "isLocal": false,
      "full_screen": true,
      "status_bar": "hide"
    },
    {
      "name": "CrappyBird",
      "version": "1.0.0",
      "hash": "335d3df52df4852c962277ca563e4a7cb67f450a31f9b3fe80543f262bf3f71c",
      "pubKey": "927c8f340255d5a2d7b839ce4859f7dc33c64e5967fe40dde023c0751a53dff3925eec1eaaeb60f83c203c85e9c5b223",
      "sign": "a72c0b66b936b36525fdc1f07c94266a8280abd6acb04d1d87477d8ea790c98593084649f5be7fb7653c8ffcc34dd3e5067b2ffac7feaa85e5e574c972b7363dc0ac7df937c82cdce2ccae7cf6c2df265a3e8c9188cda23d872da08a0e2fa5a4",
      "logo": "https://encrypted-tbn0.gstatic.com/images?q=tbn:ANd9GcRVUj_84RKRTzjT8FvyXq-J0Bnauz7tkTfuug&usqp=CAU",
      "urlLauchScreen": "",
      "urlLoadingScreen": "",
      "urlZip": "https://gitlab.com/QuangFiIt/upload_app/-/raw/feature/reupgame/game/CrappyBird.zip",
      "id": "com.CrappyBird.metaword",
      "orientation": "portrait",
      "author": "n/a",
      "isLocal": false,
      "full_screen": true,
      "status_bar": "hide"
    },
    {
      "name": "DuckHunt-JS",
      "version": "1.0.0",
      "hash": "335d3df52df4852c962277ca563e4a7cb67f450a31f9b3fe80543f262bf3f71c",
      "pubKey": "927c8f340255d5a2d7b839ce4859f7dc33c64e5967fe40dde023c0751a53dff3925eec1eaaeb60f83c203c85e9c5b223",
      "sign": "a72c0b66b936b36525fdc1f07c94266a8280abd6acb04d1d87477d8ea790c98593084649f5be7fb7653c8ffcc34dd3e5067b2ffac7feaa85e5e574c972b7363dc0ac7df937c82cdce2ccae7cf6c2df265a3e8c9188cda23d872da08a0e2fa5a4",
      "logo": "https://user-images.githubusercontent.com/34944174/51281258-2aa0df00-19e2-11e9-95f7-2557d40a81ee.png",
      "urlLauchScreen": "",
      "urlLoadingScreen": "",
      "urlZip": "https://gitlab.com/QuangFiIt/upload_app/-/raw/feature/reupgame/game/DuckHunt-JS.zip",
      "id": "com.DuckHunt-JS.metaword",
      "orientation": "landscape",
      "author": "n/a",
      "isLocal": true,
      "full_screen": true,
      "status_bar": "hide"
    },
    {
      "name": "Web3 Space Development",
      "version": "1.0.10",
      "hash": "335d3df52df4852c962277ca563e4a7cb67f450a31f9b3fe80543f262bf3f71c",
      "pubKey": "927c8f340255d5a2d7b839ce4859f7dc33c64e5967fe40dde023c0751a53dff3925eec1eaaeb60f83c203c85e9c5b223",
      "sign": "a72c0b66b936b36525fdc1f07c94266a8280abd6acb04d1d87477d8ea790c98593084649f5be7fb7653c8ffcc34dd3e5067b2ffac7feaa85e5e574c972b7363dc0ac7df937c82cdce2ccae7cf6c2df265a3e8c9188cda23d872da08a0e2fa5a4",
      "logo": "https://metanode.co/images/browser.png",
      "urlLauchScreen": "",
      "urlLoadingScreen": "",
      "urlZip": "https://gitlab.com/tranhuy.beearning/upload-d-apps/-/raw/main/meta_browser/meta_browser_0.0.13.zip",
      "id": "com.web3space-dev.metaword",
      "orientation": "portrait",
      "author": "n/a",
      "full_screen": true,
      "status_bar": "hide"
    }
  ]
}