{
  "name": "Izzili - ADA API",
  "version": "0.0.0",
  "description": "A Serverless Project and its Serverless Plugin dependencies.",
  "tilte": "Izzili - ADA API",
  "url": "https://3o6qsqm39d.execute-api.ap-northeast-1.amazonaws.com/dev",
  "order": [
    "Authentication",
    "User",
    "ChangeRequest",
    "ShowRoom",
    "Lead"
  ],
  "sampleUrl": false,
  "apidoc": "0.2.0",
  "generator": {
    "name": "apidoc",
    "time": "2016-09-06T11:53:00.270Z",
    "url": "http://apidocjs.com",
    "version": "0.16.1"
  }
}
