{
  "images": [
    {
      "orientation": "portrait",
      "extent": "full-screen",
      "minimum-system-version": "7.0",
      "idiom": "iphone",
      "scale": "2x",
      "filename": "Default@2x.png",
      "size": "640x960"
    },
    {
      "orientation": "portrait",
      "extent": "full-screen",
      "minimum-system-version": "7.0",
      "subtype": "retina4",
      "idiom": "iphone",
      "scale": "2x",
      "filename": "Default-568h@2x.png",
      "size": "640x1136"
    },
    {
      "orientation": "portrait",
      "extent": "full-screen",
      "minimum-system-version": "7.0",
      "idiom": "ipad",
      "scale": "1x",
      "filename": "Default-Portrait.png",
      "size": "768x1024"
    },
    {
      "orientation": "landscape",
      "extent": "full-screen",
      "minimum-system-version": "7.0",
      "idiom": "ipad",
      "scale": "1x",
      "filename": "Default-Landscape.png",
      "size": "1024x768"
    },
    {
      "orientation": "portrait",
      "extent": "full-screen",
      "minimum-system-version": "7.0",
      "idiom": "ipad",
      "scale": "2x",
      "filename": "Default-Portrait@2x.png",
      "size": "1536x2048"
    },
    {
      "orientation": "landscape",
      "extent": "full-screen",
      "minimum-system-version": "7.0",
      "idiom": "ipad",
      "scale": "2x",
      "filename": "Default-Landscape@2x.png",
      "size": "2048x1536"
    }
  ],
  "info": {
    "version": 1,
    "author": ""
  }
}