{
  "supermarket": [
    {
      "name": "Minus Stock",
      "disabled": false,
      "color": "#9999CC",
      "icon": "thumbs-down",
      "type": "FontAwesome",
      "have_adjusment": true,
      "insight": true
    },
    {
      "name": "Minus Margin",
      "disabled": false,
      "color": "#FF8787",
      "icon": "minus-square",
      "type": "FontAwesome",
      "have_adjusment": true,
      "insight": true
    },
    {
      "name": "Dead Stock",
      "disabled": false,
      "color": "#86C3E1",
      "icon": "bed",
      "type": "FontAwesome",
      "have_adjusment": true,
      "insight": true
    },
    {
      "name": "Over Stock",
      "disabled": false,
      "color": "#FF8D68",
      "icon": "stack-overflow",
      "type": "FontAwesome",
      "have_adjusment": true,
      "insight": true
    },
    {
      "name": "Out Of Stock",
      "disabled": false,
      "color": "#85C368",
      "icon": "hourglass-o",
      "type": "FontAwesome",
      "have_adjusment": true,
      "insight": true
    },
    {
      "name": "Good In Transit",
      "disabled": false,
      "color": "#FFCD68",
      "icon": "layers",
      "type": "Feather",
      "have_adjusment": true,
      "insight": true
    },
    {
      "name": "5 Days Before OOS",
      "disabled": false,
      "color": "#A4A4C3",
      "icon": "battery-quarter",
      "type": "FontAwesome",
      "have_adjusment": true,
      "insight": false
    },
    {
      "name": "New Product",
      "disabled": false,
      "color": "#68CD9A",
      "icon": "leaf",
      "type": "FontAwesome",
      "have_adjusment": false,
      "insight": false
    },
    {
      "name": "Ready Stock & 7 Days Naos",
      "disabled": false,
      "color": "#A6A6A6",
      "icon": "tags",
      "type": "FontAwesome",
      "have_adjusment": true,
      "insight": false
    },
    {
      "name": "Must SO",
      "disabled": false,
      "color": "#CCCC33",
      "icon": "bug",
      "type": "FontAwesome",
      "have_adjusment": false,
      "insight": false
    },
    {
      "name": "Minus Stock Fresh",
      "disabled": false,
      "color": "pink",
      "icon": "info",
      "type": "FontAwesome",
      "have_adjusment": true,
      "insight": false
    },
    {
      "name": "Fresh Ready to 10",
      "disabled": false,
      "color": "green",
      "icon": "camera",
      "type": "FontAwesome",
      "have_adjusment": false,
      "insight": false,
      "upload": true,
      "menu": "SUPERMARKET"
    },
    {
      "name": "Shinkage Fresh",
      "disabled": false,
      "color": "#A6A6A6",
      "icon": "layers",
      "type": "Feather",
      "have_adjusment": true,
      "insight": false,
      "listType": "shrinkage"
    },
    {
      "name": "Yesterday TOP Sales",
      "disabled": false,
      "color": "#FF8D68",
      "icon": "line-chart",
      "type": "FontAwesome",
      "have_adjusment": false,
      "insight": true
    }
  ],
  "fashion": [
    {
      "name": "Minus Stock",
      "disabled": false,
      "color": "#9999CC",
      "icon": "thumbs-down",
      "type": "FontAwesome",
      "have_adjusment": true,
      "insight": true
    },
    {
      "name": "Minus Margin",
      "disabled": false,
      "color": "#FF8787",
      "icon": "minus-square",
      "type": "FontAwesome",
      "have_adjusment": true,
      "insight": true
    },
    {
      "name": "Dead Stock",
      "disabled": false,
      "color": "#86C3E1",
      "icon": "bed",
      "type": "FontAwesome",
      "have_adjusment": true,
      "insight": true
    },
    {
      "name": "Good In Transit",
      "disabled": false,
      "color": "#FFCD68",
      "icon": "layers",
      "type": "Feather",
      "have_adjusment": true,
      "insight": true
    },
    {
      "name": "Shinkage Fashion",
      "disabled": false,
      "color": "#CCCC33",
      "icon": "bug",
      "type": "FontAwesome",
      "have_adjusment": false,
      "insight": false
    },
    {
      "name": "Display Photo Report",
      "disabled": false,
      "color": "#68CD9A",
      "icon": "camera",
      "type": "FontAwesome",
      "have_adjusment": false,
      "insight": false,
      "upload": true,
      "menu": "DISPLAYPHOTOREPORT"
    },
    {
      "name": "New Product PUTUS",
      "disabled": true,
      "color": "#AAAAAA",
      "icon": "bug",
      "type": "FontAwesome",
      "have_adjusment": false,
      "insight": false
    },
    {
      "name": "Yesterday TOP Sales",
      "disabled": true,
      "color": "#FF8D68",
      "icon": "line-chart",
      "type": "FontAwesome",
      "have_adjusment": false,
      "insight": true
    }
  ],
  "home bakery": [
    {
      "name": "Minus Stock",
      "disabled": false,
      "color": "#9999CC",
      "icon": "thumbs-down",
      "type": "FontAwesome",
      "have_adjusment": true,
      "insight": true
    },
    {
      "name": "Minus Margin",
      "disabled": false,
      "color": "#FF8787",
      "icon": "minus-square",
      "type": "FontAwesome",
      "have_adjusment": true,
      "insight": true
    },
    {
      "name": "Shrinkage Home Bakery",
      "disabled": false,
      "color": "#85C368",
      "icon": "trash-o",
      "type": "FontAwesome",
      "have_adjusment": false,
      "insight": false,
      "listType": "shrinkage"
    },
    {
      "name": "Yesterday TOP Sales",
      "disabled": false,
      "color": "#FF8D68",
      "icon": "line-chart",
      "type": "FontAwesome",
      "have_adjusment": false,
      "insight": true
    },
    {
      "name": "Stock Packaging & Bahan Baku",
      "disabled": false,
      "color": "#FFCD68",
      "icon": "layers",
      "type": "Feather",
      "have_adjusment": true,
      "insight": true
    },
    {
      "name": "Estimasi for Production",
      "disabled": false,
      "color": "#A4A4C3",
      "icon": "signal",
      "type": "FontAwesome",
      "have_adjusment": false,
      "insight": false,
      "listType": "estimasi"
    },
    {
      "name": "Bakery Ready to 10 Images",
      "disabled": false,
      "color": "#68CD9A",
      "icon": "camera",
      "type": "FontAwesome",
      "have_adjusment": false,
      "insight": false,
      "upload": true,
      "menu": "READYTO10"
    },
    {
      "name": "Production & Storage Area Images",
      "disabled": false,
      "color": "#CCCC33",
      "icon": "camera",
      "type": "FontAwesome",
      "have_adjusment": false,
      "insight": false,
      "upload": true,
      "menu": "AREA"
    }
  ],
  "food station": [
    {
      "name": "Minus Stock",
      "disabled": false,
      "color": "#9999CC",
      "icon": "thumbs-down",
      "type": "FontAwesome",
      "have_adjusment": true,
      "insight": true
    },
    {
      "name": "Minus Margin",
      "disabled": false,
      "color": "#FF8787",
      "icon": "minus-square",
      "type": "FontAwesome",
      "have_adjusment": true,
      "insight": true
    },
    {
      "name": "Dead Stock",
      "disabled": false,
      "color": "#86C3E1",
      "icon": "bed",
      "type": "FontAwesome",
      "have_adjusment": true,
      "insight": true
    },
    {
      "name": "Ready to Service Photo",
      "disabled": false,
      "color": "#FF8D68",
      "icon": "camera",
      "type": "FontAwesome",
      "have_adjusment": true,
      "insight": true,
      "upload": true,
      "menu": "READYTOSERVICEFNB"
    },
    {
      "name": "Out Of Stock",
      "disabled": false,
      "color": "#85C368",
      "icon": "hourglass-o",
      "type": "FontAwesome",
      "have_adjusment": true,
      "insight": true
    },
    {
      "name": "Yesterday TOP Sales",
      "disabled": false,
      "color": "#FFCD68",
      "icon": "line-chart",
      "type": "FontAwesome",
      "have_adjusment": false,
      "insight": false
    }
  ],
  "yo-el": [
    {
      "name": "Minus Stock",
      "disabled": false,
      "color": "#9999CC",
      "icon": "thumbs-down",
      "type": "FontAwesome",
      "have_adjusment": true,
      "insight": true
    },
    {
      "name": "Minus Margin",
      "disabled": false,
      "color": "#FF8787",
      "icon": "minus-square",
      "type": "FontAwesome",
      "have_adjusment": true,
      "insight": true
    },
    {
      "name": "Dead Stock",
      "disabled": false,
      "color": "#86C3E1",
      "icon": "bed",
      "type": "FontAwesome",
      "have_adjusment": true,
      "insight": true
    },
    {
      "name": "Over Stock",
      "disabled": false,
      "color": "#FF8D68",
      "icon": "stack-overflow",
      "type": "FontAwesome",
      "have_adjusment": true,
      "insight": true
    },
    {
      "name": "Good In Transit",
      "disabled": false,
      "color": "#FFCD68",
      "icon": "layers",
      "type": "Feather",
      "insight": true
    },
    {
      "name": "Update Aging Product",
      "disabled": false,
      "color": "#85C368",
      "icon": "tags",
      "type": "FontAwesome",
      "have_adjusment": true,
      "insight": false
    },
    {
      "name": "Yesterday TOP Sales",
      "disabled": false,
      "color": "#FF8D68",
      "icon": "line-chart",
      "type": "FontAwesome",
      "have_adjusment": false,
      "insight": true
    },
    {
      "name": "Out Of Stock",
      "disabled": false,
      "color": "#11C068",
      "icon": "hourglass-o",
      "type": "FontAwesome",
      "have_adjusment": true,
      "insight": true
    },
    {
      "name": "Ready To Service",
      "disabled": false,
      "color": "#A4A4C3",
      "icon": "camera",
      "type": "FontAwesome",
      "have_adjusment": false,
      "insight": false,
      "upload": true,
      "menu": "READYTOSERVICE"
    }
  ],
  "planogram": [
    {
      "name": "Planogram Food",
      "disabled": false,
      "color": "#FFFFFF",
      "icon": "food",
      "icon-color": "#FF9900",
      "type": "MaterialCommunityIcons",
      "insight": true
    },
    {
      "name": "Planogram Non Food",
      "disabled": false,
      "color": "#FFFFFF",
      "icon": "food-off",
      "icon-color": "#FF9900",
      "type": "MaterialCommunityIcons",
      "insight": true
    },
    {
      "name": "Planogram Fresh",
      "disabled": false,
      "color": "#FFFFFF",
      "icon": "carrot",
      "icon-color": "#FF9900",
      "type": "MaterialCommunityIcons",
      "insight": true
    },
    {
      "name": "Planogram GMS",
      "disabled": false,
      "color": "#FFFFFF",
      "icon": "store",
      "icon-color": "#FF9900",
      "type": "MaterialCommunityIcons",
      "insight": true
    },
    {
      "name": "Planogram Stationery",
      "disabled": false,
      "color": "#FFFFFF",
      "icon": "paperclip",
      "icon-color": "#FF9900",
      "type": "MaterialCommunityIcons",
      "insight": true
    }
  ]
}