{
  "apiKey": "AIzaSyCKPh8z6hvLXqXOTq6pGRlvjvr6C7Fv2PA",
  "authDomain": "yotodo-dev.firebaseapp.com",
  "databaseURL": "https://yotodo-dev.firebaseio.com",
  "projectId": "yotodo-dev",
  "storageBucket": "yotodo-dev.appspot.com",
  "messagingSenderId": "490860042219",
  "appId": "1:490860042219:web:6dc000b8328213e2fb6bae",
  "measurementId": "G-R56VRB29W5"
}