{
  "iisSettings": {
    "windowsAuthentication": false,
    "anonymousAuthentication": true,
    "iisExpress": {
      "applicationUrl": "http://localhost:59609",
      "sslPort": 0
    }
  },
  "profiles": {
    "IIS Express": {
      "commandName": "IISExpress",
      "launchBrowser": true,
      "environmentVariables": {
        "ASPNETCORE_ENVIRONMENT": "Development"
      }
    },
    "TriagemApp": {
      "commandName": "Project",
      "launchBrowser": true,
      "environmentVariables": {
        "SenhaNovoSGA": "44admP2020G7",
        "SGAClienteID": "2_19xzm2lkgsckcko4wkwow0kk84ggwskgksksoog0840skwcgko",
        "SGAClienteChave": "54lqy7pmjxc0cwkc0ow88ccgc44sw4ss8cow4w4cg8co0wog8o",
        "ASPNETCORE_ENVIRONMENT": "Development"
      },
      "applicationUrl": "http://localhost:5000"
    }
  }
}