<?xml version="1.0" encoding="utf-8"?>
<!-- Generator: Adobe Illustrator 23.0.2, SVG Export Plug-In . SVG Version: 6.00 Build 0)  -->
<svg version="1.1" id="Capa_1" xmlns="http://www.w3.org/2000/svg" xmlns:xlink="http://www.w3.org/1999/xlink" x="0px" y="0px"
	 viewBox="0 0 493.2 240.9" style="enable-background:new 0 0 493.2 240.9;" xml:space="preserve">
<style type="text/css">
	.st0{fill:#F5D432;}
	.st1{opacity:0.84;}
	.st2{opacity:0.43;fill:url(#SVGID_1_);}
	.st3{opacity:0.43;fill:url(#SVGID_2_);}
	.st4{opacity:0.43;fill:url(#SVGID_3_);}
	.st5{opacity:0.43;fill:url(#SVGID_4_);}
	.st6{opacity:0.43;fill:url(#SVGID_5_);}
	.st7{opacity:0.43;fill:url(#SVGID_6_);}
	.st8{opacity:0.43;fill:url(#SVGID_7_);}
	.st9{opacity:0.43;fill:url(#SVGID_8_);}
	.st10{opacity:0.53;fill:url(#SVGID_9_);}
	.st11{opacity:0.1;}
	.st12{opacity:0.92;}
	.st13{fill:#AFA9A1;}
	.st14{fill:#727272;}
	.st15{fill:#2B2C27;}
	.st16{fill:#3A4D9C;stroke:#3A4D9C;stroke-width:0.57;stroke-miterlimit:10;}
	.st17{fill:#FFFFFF;}
	.st18{fill:#1E1E1C;}
	.st19{fill:#3A4D9C;}
	.st20{opacity:0.43;}
	.st21{fill:none;}
	.st22{fill:#3A4D9C;stroke:#3A4D9C;stroke-width:0.5667;stroke-miterlimit:10;}
	.st23{fill:#3A4D9C;stroke:#3A4D9C;stroke-width:0.3381;stroke-miterlimit:10;}
	.st24{fill:none;stroke:#3A4D9C;stroke-width:1.6902;stroke-miterlimit:10;}
	.st25{opacity:0.43;fill:url(#SVGID_10_);}
	.st26{opacity:0.43;fill:url(#SVGID_11_);}
	.st27{opacity:0.43;fill:url(#SVGID_12_);}
	.st28{opacity:0.43;fill:url(#SVGID_13_);}
	.st29{opacity:0.43;fill:url(#SVGID_14_);}
	.st30{opacity:0.43;fill:url(#SVGID_15_);}
	.st31{opacity:0.43;fill:url(#SVGID_16_);}
	.st32{opacity:0.43;fill:url(#SVGID_17_);}
	.st33{opacity:0.23;fill:url(#SVGID_18_);}
	.st34{opacity:0.43;fill:url(#SVGID_19_);}
	.st35{opacity:0.43;fill:url(#SVGID_20_);}
	.st36{opacity:0.43;fill:url(#SVGID_21_);}
	.st37{opacity:0.43;fill:url(#SVGID_22_);}
	.st38{opacity:0.43;fill:url(#SVGID_23_);}
	.st39{opacity:0.43;fill:url(#SVGID_24_);}
	.st40{opacity:0.43;fill:url(#SVGID_25_);}
	.st41{opacity:0.43;fill:url(#SVGID_26_);}
	.st42{opacity:0.53;fill:url(#SVGID_27_);}
	.st43{opacity:0.43;fill:url(#SVGID_28_);}
	.st44{opacity:0.43;fill:url(#SVGID_29_);}
	.st45{opacity:0.43;fill:url(#SVGID_30_);}
	.st46{opacity:0.43;fill:url(#SVGID_31_);}
	.st47{opacity:0.43;fill:url(#SVGID_32_);}
	.st48{opacity:0.43;fill:url(#SVGID_33_);}
	.st49{opacity:0.43;fill:url(#SVGID_34_);}
	.st50{opacity:0.43;fill:url(#SVGID_35_);}
	.st51{opacity:0.53;fill:url(#SVGID_36_);}
	.st52{fill:#FFE44C;}
	.st53{fill:#DDC642;}
</style>
<rect x="-7.8" y="-4.2" class="st0" width="512.4" height="256.7"/>
<radialGradient id="SVGID_1_" cx="1653.5688" cy="-0.4716" r="27.4556" gradientTransform="matrix(9.3376 0 0 7.9252 -15195.4854 126.8291)" gradientUnits="userSpaceOnUse">
	<stop  offset="0" style="stop-color:#FFFFFF"/>
	<stop  offset="9.335684e-02" style="stop-color:#F5F3F3"/>
	<stop  offset="0.2377" style="stop-color:#D8D1D3"/>
	<stop  offset="0.4149" style="stop-color:#ADA0A2"/>
	<stop  offset="0.6181" style="stop-color:#796669"/>
	<stop  offset="0.8403" style="stop-color:#422D30"/>
	<stop  offset="1" style="stop-color:#1D090A"/>
</radialGradient>
<polygon style="opacity:0.23;fill:url(#SVGID_1_);" points="493.2,122.9 253.2,122.9 493.2,112.2 493.2,111.9 253.2,122.5 
	493.2,101.1 493.2,100.7 253.1,122.2 493.2,89.9 493.2,89.5 253.1,121.8 493.2,78.5 493.2,78.1 253,121.4 493.2,66.8 493.2,66.4 
	252.9,121.1 493.2,54.8 493.2,54.4 252.7,120.7 493.2,42.4 493.2,42 252.6,120.4 493.2,29.4 493.2,29 252.4,120 493.2,15.9 
	493.2,15.5 252.2,119.7 493.2,1.6 493.2,1.2 252,119.4 493.2,-13.6 493.2,-14 251.7,119.1 493.2,-29.8 493.2,-30.3 251.5,118.8 
	493.2,-47.4 493.2,-47.9 251.2,118.5 493.2,-66.5 493.2,-67 250.9,118.2 493.2,-87.4 493.2,-87.7 492.9,-87.7 250.6,117.9 
	468.8,-87.7 468.2,-87.7 250.3,117.7 446.3,-87.7 445.7,-87.7 249.9,117.5 425.6,-87.7 425,-87.7 249.6,117.2 406.4,-87.7 
	405.9,-87.7 249.2,117 388.5,-87.7 388,-87.7 248.8,116.9 371.7,-87.7 371.2,-87.7 248.5,116.7 355.7,-87.7 355.2,-87.7 
	248.1,116.5 340.4,-87.7 340,-87.7 247.7,116.4 325.8,-87.7 325.3,-87.7 247.2,116.3 311.6,-87.7 311.2,-87.7 246.8,116.2 
	297.9,-87.7 297.4,-87.7 246.4,116.1 284.4,-87.7 284,-87.7 246,116 271.2,-87.7 270.7,-87.7 245.5,116 258.1,-87.7 257.7,-87.7 
	245.1,116 245.1,-87.7 244.6,-87.7 244.6,116 232.1,-87.7 231.6,-87.7 244.2,116 219,-87.7 218.5,-87.7 243.8,116 205.7,-87.7 
	205.3,-87.7 243.3,116.1 192.3,-87.7 191.8,-87.7 242.9,116.2 178.5,-87.7 178.1,-87.7 242.5,116.3 164.4,-87.7 163.9,-87.7 
	242.1,116.4 149.8,-87.7 149.3,-87.7 241.7,116.5 134.5,-87.7 134,-87.7 241.2,116.7 118.6,-87.7 118.1,-87.7 240.9,116.9 
	101.7,-87.7 101.2,-87.7 240.5,117 83.8,-87.7 83.3,-87.7 240.1,117.2 64.7,-87.7 64.1,-87.7 239.8,117.5 44,-87.7 43.4,-87.7 
	239.4,117.7 21.5,-87.7 20.9,-87.7 239.1,117.9 -3.2,-87.7 -3.5,-87.7 -3.5,-87.4 238.8,118.2 -3.5,-67 -3.5,-66.5 238.5,118.5 
	-3.5,-47.9 -3.5,-47.4 238.2,118.8 -3.5,-30.3 -3.5,-29.8 238,119.1 -3.5,-14 -3.5,-13.6 237.7,119.4 -3.5,1.2 -3.5,1.6 
	237.5,119.7 -3.5,15.5 -3.5,15.9 237.3,120 -3.5,29 -3.5,29.4 237.1,120.4 -3.5,42 -3.5,42.4 237,120.7 -3.5,54.4 -3.5,54.8 
	236.8,121.1 -3.5,66.4 -3.5,66.8 236.7,121.4 -3.5,78.1 -3.5,78.5 236.6,121.8 -3.5,89.5 -3.5,89.9 236.6,122.2 -3.5,100.7 
	-3.5,101.1 236.5,122.5 -3.5,111.9 -3.5,112.2 236.5,122.9 -3.5,122.9 -3.5,123.3 236.5,123.3 -3.5,134 -3.5,134.3 236.5,123.6 
	-3.5,145.1 -3.5,145.4 236.6,124 -3.5,156.3 -3.5,156.7 236.7,124.4 -3.5,167.7 -3.5,168.1 236.7,124.7 -3.5,179.4 -3.5,179.8 
	236.8,125.1 -3.5,191.4 -3.5,191.8 237,125.5 -3.5,203.8 -3.5,204.2 237.1,125.8 -3.5,216.7 -3.5,217.2 237.3,126.1 -3.5,230.3 
	-3.5,230.7 237.5,126.5 -3.5,244.6 -3.5,245 237.7,126.8 -3.5,259.8 -3.5,260.2 238,127.1 -3.5,276 -3.5,276.5 238.2,127.4 
	-3.5,293.6 -3.5,294 238.5,127.7 -3.5,312.6 -3.5,313.1 238.8,128 -3.5,333.6 -3.5,333.9 -3.2,333.9 239.1,128.2 20.9,333.9 
	21.5,333.9 239.4,128.5 43.4,333.9 44,333.9 239.8,128.7 64.1,333.9 64.7,333.9 240.1,128.9 83.3,333.9 83.8,333.9 240.5,129.2 
	101.2,333.9 101.7,333.9 240.9,129.3 118.1,333.9 118.6,333.9 241.3,129.5 134,333.9 134.5,333.9 241.7,129.7 149.3,333.9 
	149.8,333.9 242.1,129.8 163.9,333.9 164.4,333.9 242.5,129.9 178.1,333.9 178.5,333.9 242.9,130 191.8,333.9 192.3,333.9 
	243.3,130.1 205.3,333.9 205.7,333.9 243.8,130.1 218.5,333.9 219,333.9 244.2,130.2 231.6,333.9 232.1,333.9 244.6,130.2 
	244.6,333.9 245.1,333.9 245.1,130.2 257.7,333.9 258.1,333.9 245.5,130.2 270.7,333.9 271.2,333.9 246,130.1 284,333.9 
	284.4,333.9 246.4,130.1 297.4,333.9 297.9,333.9 246.8,130 311.2,333.9 311.6,333.9 247.2,129.9 325.3,333.9 325.8,333.9 
	247.6,129.8 340,333.9 340.4,333.9 248.1,129.7 355.2,333.9 355.7,333.9 248.5,129.5 371.2,333.9 371.7,333.9 248.9,129.3 
	388,333.9 388.5,333.9 249.2,129.2 405.9,333.9 406.4,333.9 249.6,128.9 425,333.9 425.6,333.9 250,128.7 445.7,333.9 446.3,333.9 
	250.3,128.5 468.2,333.9 468.8,333.9 250.6,128.2 492.9,333.9 493.2,333.9 493.2,333.6 250.9,128 493.2,313.1 493.2,312.6 
	251.2,127.7 493.2,294 493.2,293.6 251.5,127.4 493.2,276.5 493.2,276 251.7,127.1 493.2,260.2 493.2,259.8 252,126.8 493.2,245 
	493.2,244.6 252.2,126.5 493.2,230.7 493.2,230.3 252.4,126.1 493.2,217.2 493.2,216.7 252.6,125.8 493.2,204.2 493.2,203.8 
	252.7,125.5 493.2,191.8 493.2,191.4 252.9,125.1 493.2,179.8 493.2,179.4 253,124.7 493.2,168.1 493.2,167.7 253,124.4 
	493.2,156.7 493.2,156.3 253.1,124 493.2,145.4 493.2,145.1 253.2,123.6 493.2,134.3 493.2,134 253.2,123.3 493.2,123.3 "/>
<rect x="68.3" y="175.4" class="st21" width="12.8" height="13.2"/>
</svg>
