[
    {
      "id" :1,
      "slug":"american-beauty",
      "nombre": "Amercian Beauty",
      "bio": "A cynical nightclub owner protects an old flame and her husband from Nazis in Morocco.",
      "img": "assets/img/american_beauty.jpg",
      "aparicion": "1942"
    },
    {
      "id" :2,
      "slug":"taxi.driver",
      "nombre": "Taxi driver",
      "bio": "A blade runner must pursue and terminate four replicants who stole a ship in space, and have returned to Earth to find their creator.",
      "img": "assets/img/taxi.jpg",
      "aparicion": "1982"
    },
    {
      "id" :3,
      "slug":"pequeña-miss-sunshine",
      "nombre": "Pequeña miss sunshine",
      "bio": "A rough-and-tumble trucker helps rescue his friend's fiance from an ancient sorcerer in a supernatural battle beneath Chinatown.",
      "img": "assets/img/miss.jpg",
      "aparicion": "1986"
    },
    {
      "id" :4,
      "slug":"the-artist",
      "nombre": "The artist",
      "bio": "At the end of his career, a clueless fashion model is brainwashed to kill the Prime Minister of Malaysia.",
      "img": "assets/img/artist.jpg",
      "aparicion": "2001"
    },
    {
      "id" :5,
      "slug":"los-iduas-de-marzo",
      "nombre": "Los idus de marzo",
      "bio": "The monstrous spirit of a slain janitor seeks revenge by invading the dreams of teenagers whose parents were responsible for his untimely death.",
      "img": "assets/img/march.jpg",
      "aparicion": "1986"
    },
    {
      "id" :6,
      "slug":"pequeña-miss-sunshine",
      "nombre": "Pequeña miss sunshine",
      "bio": "A rough-and-tumble trucker helps rescue his friend's fiance from an ancient sorcerer in a supernatural battle beneath Chinatown.",
      "img": "assets/img/perfume.jpg",
      "aparicion": "1986"
    },
    {
      "id" :7,
      "slug":"the-artist",
      "nombre": "The artist",
      "bio": "At the end of his career, a clueless fashion model is brainwashed to kill the Prime Minister of Malaysia.",
      "img": "assets/img/aladin.jpg",
      "aparicion": "2001"
    },
    {
      "id" :8,
      "slug":"los-iduas-de-marzo",
      "nombre": "Los idus de marzo",
      "bio": "The monstrous spirit of a slain janitor seeks revenge by invading the dreams of teenagers whose parents were responsible for his untimely death.",
      "img": "assets/img/torino.jpg",
      "aparicion": "1986"
    }
  ]