EESchema Schematic File Version 4
EELAYER 30 0
EELAYER END
$Descr A4 11693 8268
encoding utf-8
Sheet 1 1
Title ""
Date ""
Rev ""
Comp ""
Comment1 ""
Comment2 ""
Comment3 ""
Comment4 ""
$EndDescr
$Comp
L Device:D_Small D13
U 1 1 6076735F
P 6400 1650
F 0 "D13" V 6446 1580 50  0000 R CNN
F 1 "D_Small" V 6355 1580 50  0000 R CNN
F 2 "random-keyboard-parts:D_SOD-123-Pretty" V 6400 1650 50  0001 C CNN
F 3 "~" V 6400 1650 50  0001 C CNN
	1    6400 1650
	0    -1   -1   0   
$EndComp
Wire Wire Line
	6400 1550 6550 1550
$Comp
L Device:D_Small D14
U 1 1 6076A9F6
P 6400 2400
F 0 "D14" V 6446 2330 50  0000 R CNN
F 1 "D_Small" V 6355 2330 50  0000 R CNN
F 2 "random-keyboard-parts:D_SOD-123-Pretty" V 6400 2400 50  0001 C CNN
F 3 "~" V 6400 2400 50  0001 C CNN
	1    6400 2400
	0    -1   -1   0   
$EndComp
Wire Wire Line
	6400 2300 6550 2300
$Comp
L Device:D_Small D15
U 1 1 6076B93D
P 6400 3200
F 0 "D15" V 6446 3130 50  0000 R CNN
F 1 "D_Small" V 6355 3130 50  0000 R CNN
F 2 "random-keyboard-parts:D_SOD-123-Pretty" V 6400 3200 50  0001 C CNN
F 3 "~" V 6400 3200 50  0001 C CNN
	1    6400 3200
	0    -1   -1   0   
$EndComp
Wire Wire Line
	6400 3100 6550 3100
$Comp
L Device:D_Small D9
U 1 1 60771A1D
P 5850 1650
F 0 "D9" V 5896 1580 50  0000 R CNN
F 1 "D_Small" V 5805 1580 50  0000 R CNN
F 2 "random-keyboard-parts:D_SOD-123-Pretty" V 5850 1650 50  0001 C CNN
F 3 "~" V 5850 1650 50  0001 C CNN
	1    5850 1650
	0    -1   -1   0   
$EndComp
Wire Wire Line
	5850 1550 6000 1550
$Comp
L Device:D_Small D10
U 1 1 60771A2A
P 5850 2400
F 0 "D10" V 5896 2330 50  0000 R CNN
F 1 "D_Small" V 5805 2330 50  0000 R CNN
F 2 "random-keyboard-parts:D_SOD-123-Pretty" V 5850 2400 50  0001 C CNN
F 3 "~" V 5850 2400 50  0001 C CNN
	1    5850 2400
	0    -1   -1   0   
$EndComp
Wire Wire Line
	5850 2300 6000 2300
$Comp
L Device:D_Small D11
U 1 1 60771A37
P 5850 3200
F 0 "D11" V 5896 3130 50  0000 R CNN
F 1 "D_Small" V 5805 3130 50  0000 R CNN
F 2 "random-keyboard-parts:D_SOD-123-Pretty" V 5850 3200 50  0001 C CNN
F 3 "~" V 5850 3200 50  0001 C CNN
	1    5850 3200
	0    -1   -1   0   
$EndComp
Wire Wire Line
	5850 3100 6000 3100
$Comp
L MX_Alps_Hybrid:MX-NoLED MX12
U 1 1 60771A3E
P 6050 3700
F 0 "MX12" H 6083 3923 60  0000 C CNN
F 1 "MX-NoLED" H 6083 3849 20  0000 C CNN
F 2 "Button_Switch_Keyboard:SW_Cherry_MX_1.00u_PCB" H 5425 3675 60  0001 C CNN
F 3 "" H 5425 3675 60  0001 C CNN
	1    6050 3700
	1    0    0    -1  
$EndComp
$Comp
L Device:D_Small D12
U 1 1 60771A44
P 5850 3950
F 0 "D12" V 5896 3880 50  0000 R CNN
F 1 "D_Small" V 5805 3880 50  0000 R CNN
F 2 "random-keyboard-parts:D_SOD-123-Pretty" V 5850 3950 50  0001 C CNN
F 3 "~" V 5850 3950 50  0001 C CNN
	1    5850 3950
	0    -1   -1   0   
$EndComp
Wire Wire Line
	5850 3850 6000 3850
$Comp
L Device:D_Small D19
U 1 1 6077D866
P 7500 1650
F 0 "D19" V 7546 1580 50  0000 R CNN
F 1 "D_Small" V 7455 1580 50  0000 R CNN
F 2 "random-keyboard-parts:D_SOD-123-Pretty" V 7500 1650 50  0001 C CNN
F 3 "~" V 7500 1650 50  0001 C CNN
	1    7500 1650
	0    -1   -1   0   
$EndComp
Wire Wire Line
	7500 1550 7650 1550
$Comp
L Device:D_Small D20
U 1 1 6077D873
P 7500 2400
F 0 "D20" V 7546 2330 50  0000 R CNN
F 1 "D_Small" V 7455 2330 50  0000 R CNN
F 2 "random-keyboard-parts:D_SOD-123-Pretty" V 7500 2400 50  0001 C CNN
F 3 "~" V 7500 2400 50  0001 C CNN
	1    7500 2400
	0    -1   -1   0   
$EndComp
Wire Wire Line
	7500 2300 7650 2300
$Comp
L Device:D_Small D21
U 1 1 6077D880
P 7500 3200
F 0 "D21" V 7546 3130 50  0000 R CNN
F 1 "D_Small" V 7455 3130 50  0000 R CNN
F 2 "random-keyboard-parts:D_SOD-123-Pretty" V 7500 3200 50  0001 C CNN
F 3 "~" V 7500 3200 50  0001 C CNN
	1    7500 3200
	0    -1   -1   0   
$EndComp
Wire Wire Line
	7500 3100 7650 3100
$Comp
L MX_Alps_Hybrid:MX-NoLED MX22
U 1 1 6077D887
P 7700 3700
F 0 "MX22" H 7733 3923 60  0000 C CNN
F 1 "MX-NoLED" H 7733 3849 20  0000 C CNN
F 2 "Button_Switch_Keyboard:SW_Cherry_MX_6.25u_PCB" H 7075 3675 60  0001 C CNN
F 3 "" H 7075 3675 60  0001 C CNN
	1    7700 3700
	1    0    0    -1  
$EndComp
$Comp
L Device:D_Small D22
U 1 1 6077D88D
P 7500 3950
F 0 "D22" V 7546 3880 50  0000 R CNN
F 1 "D_Small" V 7455 3880 50  0000 R CNN
F 2 "random-keyboard-parts:D_SOD-123-Pretty" V 7500 3950 50  0001 C CNN
F 3 "~" V 7500 3950 50  0001 C CNN
	1    7500 3950
	0    -1   -1   0   
$EndComp
Wire Wire Line
	7500 3850 7650 3850
$Comp
L Device:D_Small D16
U 1 1 6077D89A
P 6950 1650
F 0 "D16" V 6996 1580 50  0000 R CNN
F 1 "D_Small" V 6905 1580 50  0000 R CNN
F 2 "random-keyboard-parts:D_SOD-123-Pretty" V 6950 1650 50  0001 C CNN
F 3 "~" V 6950 1650 50  0001 C CNN
	1    6950 1650
	0    -1   -1   0   
$EndComp
Wire Wire Line
	6950 1550 7100 1550
$Comp
L Device:D_Small D17
U 1 1 6077D8A7
P 6950 2400
F 0 "D17" V 6996 2330 50  0000 R CNN
F 1 "D_Small" V 6905 2330 50  0000 R CNN
F 2 "random-keyboard-parts:D_SOD-123-Pretty" V 6950 2400 50  0001 C CNN
F 3 "~" V 6950 2400 50  0001 C CNN
	1    6950 2400
	0    -1   -1   0   
$EndComp
Wire Wire Line
	6950 2300 7100 2300
$Comp
L Device:D_Small D18
U 1 1 6077D8B4
P 6950 3200
F 0 "D18" V 6996 3130 50  0000 R CNN
F 1 "D_Small" V 6905 3130 50  0000 R CNN
F 2 "random-keyboard-parts:D_SOD-123-Pretty" V 6950 3200 50  0001 C CNN
F 3 "~" V 6950 3200 50  0001 C CNN
	1    6950 3200
	0    -1   -1   0   
$EndComp
Wire Wire Line
	6950 3100 7100 3100
$Comp
L Device:D_Small D26
U 1 1 607808E9
P 8600 1650
F 0 "D26" V 8646 1580 50  0000 R CNN
F 1 "D_Small" V 8555 1580 50  0000 R CNN
F 2 "random-keyboard-parts:D_SOD-123-Pretty" V 8600 1650 50  0001 C CNN
F 3 "~" V 8600 1650 50  0001 C CNN
	1    8600 1650
	0    -1   -1   0   
$EndComp
Wire Wire Line
	8600 1550 8750 1550
$Comp
L Device:D_Small D27
U 1 1 607808F6
P 8600 2400
F 0 "D27" V 8646 2330 50  0000 R CNN
F 1 "D_Small" V 8555 2330 50  0000 R CNN
F 2 "random-keyboard-parts:D_SOD-123-Pretty" V 8600 2400 50  0001 C CNN
F 3 "~" V 8600 2400 50  0001 C CNN
	1    8600 2400
	0    -1   -1   0   
$EndComp
Wire Wire Line
	8600 2300 8750 2300
$Comp
L Device:D_Small D28
U 1 1 60780903
P 8600 3200
F 0 "D28" V 8646 3130 50  0000 R CNN
F 1 "D_Small" V 8555 3130 50  0000 R CNN
F 2 "random-keyboard-parts:D_SOD-123-Pretty" V 8600 3200 50  0001 C CNN
F 3 "~" V 8600 3200 50  0001 C CNN
	1    8600 3200
	0    -1   -1   0   
$EndComp
Wire Wire Line
	8600 3100 8750 3100
$Comp
L Device:D_Small D23
U 1 1 6078091D
P 8050 1650
F 0 "D23" V 8096 1580 50  0000 R CNN
F 1 "D_Small" V 8005 1580 50  0000 R CNN
F 2 "random-keyboard-parts:D_SOD-123-Pretty" V 8050 1650 50  0001 C CNN
F 3 "~" V 8050 1650 50  0001 C CNN
	1    8050 1650
	0    -1   -1   0   
$EndComp
Wire Wire Line
	8050 1550 8200 1550
$Comp
L Device:D_Small D24
U 1 1 6078092A
P 8050 2400
F 0 "D24" V 8096 2330 50  0000 R CNN
F 1 "D_Small" V 8005 2330 50  0000 R CNN
F 2 "random-keyboard-parts:D_SOD-123-Pretty" V 8050 2400 50  0001 C CNN
F 3 "~" V 8050 2400 50  0001 C CNN
	1    8050 2400
	0    -1   -1   0   
$EndComp
Wire Wire Line
	8050 2300 8200 2300
$Comp
L Device:D_Small D25
U 1 1 60780937
P 8050 3200
F 0 "D25" V 8096 3130 50  0000 R CNN
F 1 "D_Small" V 8005 3130 50  0000 R CNN
F 2 "random-keyboard-parts:D_SOD-123-Pretty" V 8050 3200 50  0001 C CNN
F 3 "~" V 8050 3200 50  0001 C CNN
	1    8050 3200
	0    -1   -1   0   
$EndComp
Wire Wire Line
	8050 3100 8200 3100
$Comp
L Device:D_Small D5
U 1 1 60785038
P 5300 1650
F 0 "D5" V 5346 1580 50  0000 R CNN
F 1 "D_Small" V 5255 1580 50  0000 R CNN
F 2 "random-keyboard-parts:D_SOD-123-Pretty" V 5300 1650 50  0001 C CNN
F 3 "~" V 5300 1650 50  0001 C CNN
	1    5300 1650
	0    -1   -1   0   
$EndComp
Wire Wire Line
	5300 1550 5450 1550
$Comp
L Device:D_Small D6
U 1 1 60785045
P 5300 2400
F 0 "D6" V 5346 2330 50  0000 R CNN
F 1 "D_Small" V 5255 2330 50  0000 R CNN
F 2 "random-keyboard-parts:D_SOD-123-Pretty" V 5300 2400 50  0001 C CNN
F 3 "~" V 5300 2400 50  0001 C CNN
	1    5300 2400
	0    -1   -1   0   
$EndComp
Wire Wire Line
	5300 2300 5450 2300
$Comp
L Device:D_Small D7
U 1 1 60785052
P 5300 3200
F 0 "D7" V 5346 3130 50  0000 R CNN
F 1 "D_Small" V 5255 3130 50  0000 R CNN
F 2 "random-keyboard-parts:D_SOD-123-Pretty" V 5300 3200 50  0001 C CNN
F 3 "~" V 5300 3200 50  0001 C CNN
	1    5300 3200
	0    -1   -1   0   
$EndComp
Wire Wire Line
	5300 3100 5450 3100
$Comp
L MX_Alps_Hybrid:MX-NoLED MX8
U 1 1 60785059
P 5500 3700
F 0 "MX8" H 5533 3923 60  0000 C CNN
F 1 "MX-NoLED" H 5533 3849 20  0000 C CNN
F 2 "Button_Switch_Keyboard:SW_Cherry_MX_1.00u_PCB" H 4875 3675 60  0001 C CNN
F 3 "" H 4875 3675 60  0001 C CNN
	1    5500 3700
	1    0    0    -1  
$EndComp
$Comp
L Device:D_Small D8
U 1 1 6078505F
P 5300 3950
F 0 "D8" V 5346 3880 50  0000 R CNN
F 1 "D_Small" V 5255 3880 50  0000 R CNN
F 2 "random-keyboard-parts:D_SOD-123-Pretty" V 5300 3950 50  0001 C CNN
F 3 "~" V 5300 3950 50  0001 C CNN
	1    5300 3950
	0    -1   -1   0   
$EndComp
Wire Wire Line
	5300 3850 5450 3850
$Comp
L Device:D_Small D1
U 1 1 6078506C
P 4750 1650
F 0 "D1" V 4796 1580 50  0000 R CNN
F 1 "D_Small" V 4705 1580 50  0000 R CNN
F 2 "random-keyboard-parts:D_SOD-123-Pretty" V 4750 1650 50  0001 C CNN
F 3 "~" V 4750 1650 50  0001 C CNN
	1    4750 1650
	0    -1   -1   0   
$EndComp
Wire Wire Line
	4750 1550 4900 1550
$Comp
L Device:D_Small D2
U 1 1 60785079
P 4750 2400
F 0 "D2" V 4796 2330 50  0000 R CNN
F 1 "D_Small" V 4705 2330 50  0000 R CNN
F 2 "random-keyboard-parts:D_SOD-123-Pretty" V 4750 2400 50  0001 C CNN
F 3 "~" V 4750 2400 50  0001 C CNN
	1    4750 2400
	0    -1   -1   0   
$EndComp
Wire Wire Line
	4750 2300 4900 2300
$Comp
L Device:D_Small D3
U 1 1 60785086
P 4750 3200
F 0 "D3" V 4796 3130 50  0000 R CNN
F 1 "D_Small" V 4705 3130 50  0000 R CNN
F 2 "random-keyboard-parts:D_SOD-123-Pretty" V 4750 3200 50  0001 C CNN
F 3 "~" V 4750 3200 50  0001 C CNN
	1    4750 3200
	0    -1   -1   0   
$EndComp
Wire Wire Line
	4750 3100 4900 3100
$Comp
L MX_Alps_Hybrid:MX-NoLED MX4
U 1 1 6078508D
P 4950 3700
F 0 "MX4" H 4983 3923 60  0000 C CNN
F 1 "MX-NoLED" H 4983 3849 20  0000 C CNN
F 2 "Button_Switch_Keyboard:SW_Cherry_MX_1.25u_PCB" H 4325 3675 60  0001 C CNN
F 3 "" H 4325 3675 60  0001 C CNN
	1    4950 3700
	1    0    0    -1  
$EndComp
$Comp
L Device:D_Small D4
U 1 1 60785093
P 4750 3950
F 0 "D4" V 4796 3880 50  0000 R CNN
F 1 "D_Small" V 4705 3880 50  0000 R CNN
F 2 "random-keyboard-parts:D_SOD-123-Pretty" V 4750 3950 50  0001 C CNN
F 3 "~" V 4750 3950 50  0001 C CNN
	1    4750 3950
	0    -1   -1   0   
$EndComp
Wire Wire Line
	4750 3850 4900 3850
$Comp
L Device:D_Small D32
U 1 1 6078B839
P 9650 1650
F 0 "D32" V 9696 1580 50  0000 R CNN
F 1 "D_Small" V 9605 1580 50  0000 R CNN
F 2 "random-keyboard-parts:D_SOD-123-Pretty" V 9650 1650 50  0001 C CNN
F 3 "~" V 9650 1650 50  0001 C CNN
	1    9650 1650
	0    -1   -1   0   
$EndComp
Wire Wire Line
	9650 1550 9800 1550
$Comp
L Device:D_Small D33
U 1 1 6078B846
P 9650 2400
F 0 "D33" V 9696 2330 50  0000 R CNN
F 1 "D_Small" V 9605 2330 50  0000 R CNN
F 2 "random-keyboard-parts:D_SOD-123-Pretty" V 9650 2400 50  0001 C CNN
F 3 "~" V 9650 2400 50  0001 C CNN
	1    9650 2400
	0    -1   -1   0   
$EndComp
Wire Wire Line
	9650 2300 9800 2300
$Comp
L MX_Alps_Hybrid:MX-NoLED MX34
U 1 1 6078B84D
P 9850 2950
F 0 "MX34" H 9883 3173 60  0000 C CNN
F 1 "MX-NoLED" H 9883 3099 20  0000 C CNN
F 2 "Button_Switch_Keyboard:SW_Cherry_MX_1.00u_PCB" H 9225 2925 60  0001 C CNN
F 3 "" H 9225 2925 60  0001 C CNN
	1    9850 2950
	1    0    0    -1  
$EndComp
$Comp
L Device:D_Small D34
U 1 1 6078B853
P 9650 3200
F 0 "D34" V 9696 3130 50  0000 R CNN
F 1 "D_Small" V 9605 3130 50  0000 R CNN
F 2 "random-keyboard-parts:D_SOD-123-Pretty" V 9650 3200 50  0001 C CNN
F 3 "~" V 9650 3200 50  0001 C CNN
	1    9650 3200
	0    -1   -1   0   
$EndComp
Wire Wire Line
	9650 3100 9800 3100
$Comp
L MX_Alps_Hybrid:MX-NoLED MX35
U 1 1 6078B85A
P 9850 3700
F 0 "MX35" H 9883 3923 60  0000 C CNN
F 1 "MX-NoLED" H 9883 3849 20  0000 C CNN
F 2 "Button_Switch_Keyboard:SW_Cherry_MX_1.00u_PCB" H 9225 3675 60  0001 C CNN
F 3 "" H 9225 3675 60  0001 C CNN
	1    9850 3700
	1    0    0    -1  
$EndComp
$Comp
L Device:D_Small D35
U 1 1 6078B860
P 9650 3950
F 0 "D35" V 9696 3880 50  0000 R CNN
F 1 "D_Small" V 9605 3880 50  0000 R CNN
F 2 "random-keyboard-parts:D_SOD-123-Pretty" V 9650 3950 50  0001 C CNN
F 3 "~" V 9650 3950 50  0001 C CNN
	1    9650 3950
	0    -1   -1   0   
$EndComp
Wire Wire Line
	9650 3850 9800 3850
$Comp
L Device:D_Small D29
U 1 1 6078B86D
P 9100 1650
F 0 "D29" V 9146 1580 50  0000 R CNN
F 1 "D_Small" V 9055 1580 50  0000 R CNN
F 2 "random-keyboard-parts:D_SOD-123-Pretty" V 9100 1650 50  0001 C CNN
F 3 "~" V 9100 1650 50  0001 C CNN
	1    9100 1650
	0    -1   -1   0   
$EndComp
Wire Wire Line
	9100 1550 9250 1550
$Comp
L Device:D_Small D30
U 1 1 6078B87A
P 9100 2400
F 0 "D30" V 9146 2330 50  0000 R CNN
F 1 "D_Small" V 9055 2330 50  0000 R CNN
F 2 "random-keyboard-parts:D_SOD-123-Pretty" V 9100 2400 50  0001 C CNN
F 3 "~" V 9100 2400 50  0001 C CNN
	1    9100 2400
	0    -1   -1   0   
$EndComp
Wire Wire Line
	9100 2300 9250 2300
$Comp
L MX_Alps_Hybrid:MX-NoLED MX31
U 1 1 6078B881
P 9300 2950
F 0 "MX31" H 9333 3173 60  0000 C CNN
F 1 "MX-NoLED" H 9333 3099 20  0000 C CNN
F 2 "Button_Switch_Keyboard:SW_Cherry_MX_1.00u_PCB" H 8675 2925 60  0001 C CNN
F 3 "" H 8675 2925 60  0001 C CNN
	1    9300 2950
	1    0    0    -1  
$EndComp
$Comp
L Device:D_Small D31
U 1 1 6078B887
P 9100 3200
F 0 "D31" V 9146 3130 50  0000 R CNN
F 1 "D_Small" V 9055 3130 50  0000 R CNN
F 2 "random-keyboard-parts:D_SOD-123-Pretty" V 9100 3200 50  0001 C CNN
F 3 "~" V 9100 3200 50  0001 C CNN
	1    9100 3200
	0    -1   -1   0   
$EndComp
Wire Wire Line
	9100 3100 9250 3100
$Comp
L Device:D_Small D40
U 1 1 60791364
P 10750 1650
F 0 "D40" V 10796 1580 50  0000 R CNN
F 1 "D_Small" V 10705 1580 50  0000 R CNN
F 2 "random-keyboard-parts:D_SOD-123-Pretty" V 10750 1650 50  0001 C CNN
F 3 "~" V 10750 1650 50  0001 C CNN
	1    10750 1650
	0    -1   -1   0   
$EndComp
Wire Wire Line
	10750 1550 10900 1550
$Comp
L MX_Alps_Hybrid:MX-NoLED MX41
U 1 1 60791378
P 10950 2950
F 0 "MX41" H 10983 3173 60  0000 C CNN
F 1 "MX-NoLED" H 10983 3099 20  0000 C CNN
F 2 "Button_Switch_Keyboard:SW_Cherry_MX_1.75u_PCB" H 10325 2925 60  0001 C CNN
F 3 "" H 10325 2925 60  0001 C CNN
	1    10950 2950
	1    0    0    -1  
$EndComp
$Comp
L Device:D_Small D41
U 1 1 6079137E
P 10750 3200
F 0 "D41" V 10796 3130 50  0000 R CNN
F 1 "D_Small" V 10705 3130 50  0000 R CNN
F 2 "random-keyboard-parts:D_SOD-123-Pretty" V 10750 3200 50  0001 C CNN
F 3 "~" V 10750 3200 50  0001 C CNN
	1    10750 3200
	0    -1   -1   0   
$EndComp
Wire Wire Line
	10750 3100 10900 3100
$Comp
L MX_Alps_Hybrid:MX-NoLED MX42
U 1 1 60791385
P 10950 3700
F 0 "MX42" H 10983 3923 60  0000 C CNN
F 1 "MX-NoLED" H 10983 3849 20  0000 C CNN
F 2 "Button_Switch_Keyboard:SW_Cherry_MX_1.25u_PCB" H 10325 3675 60  0001 C CNN
F 3 "" H 10325 3675 60  0001 C CNN
	1    10950 3700
	1    0    0    -1  
$EndComp
$Comp
L Device:D_Small D42
U 1 1 6079138B
P 10750 3950
F 0 "D42" V 10796 3880 50  0000 R CNN
F 1 "D_Small" V 10705 3880 50  0000 R CNN
F 2 "random-keyboard-parts:D_SOD-123-Pretty" V 10750 3950 50  0001 C CNN
F 3 "~" V 10750 3950 50  0001 C CNN
	1    10750 3950
	0    -1   -1   0   
$EndComp
Wire Wire Line
	10750 3850 10900 3850
$Comp
L Device:D_Small D36
U 1 1 60791398
P 10200 1650
F 0 "D36" V 10246 1580 50  0000 R CNN
F 1 "D_Small" V 10155 1580 50  0000 R CNN
F 2 "random-keyboard-parts:D_SOD-123-Pretty" V 10200 1650 50  0001 C CNN
F 3 "~" V 10200 1650 50  0001 C CNN
	1    10200 1650
	0    -1   -1   0   
$EndComp
Wire Wire Line
	10200 1550 10350 1550
$Comp
L Device:D_Small D37
U 1 1 607913A5
P 10200 2400
F 0 "D37" V 10246 2330 50  0000 R CNN
F 1 "D_Small" V 10155 2330 50  0000 R CNN
F 2 "random-keyboard-parts:D_SOD-123-Pretty" V 10200 2400 50  0001 C CNN
F 3 "~" V 10200 2400 50  0001 C CNN
	1    10200 2400
	0    -1   -1   0   
$EndComp
Wire Wire Line
	10200 2300 10350 2300
$Comp
L MX_Alps_Hybrid:MX-NoLED MX38
U 1 1 607913AC
P 10400 2950
F 0 "MX38" H 10433 3173 60  0000 C CNN
F 1 "MX-NoLED" H 10433 3099 20  0000 C CNN
F 2 "Button_Switch_Keyboard:SW_Cherry_MX_1.00u_PCB" H 9775 2925 60  0001 C CNN
F 3 "" H 9775 2925 60  0001 C CNN
	1    10400 2950
	1    0    0    -1  
$EndComp
$Comp
L Device:D_Small D38
U 1 1 607913B2
P 10200 3200
F 0 "D38" V 10246 3130 50  0000 R CNN
F 1 "D_Small" V 10155 3130 50  0000 R CNN
F 2 "random-keyboard-parts:D_SOD-123-Pretty" V 10200 3200 50  0001 C CNN
F 3 "~" V 10200 3200 50  0001 C CNN
	1    10200 3200
	0    -1   -1   0   
$EndComp
Wire Wire Line
	10200 3100 10350 3100
$Comp
L MX_Alps_Hybrid:MX-NoLED MX39
U 1 1 607913B9
P 10400 3700
F 0 "MX39" H 10433 3923 60  0000 C CNN
F 1 "MX-NoLED" H 10433 3849 20  0000 C CNN
F 2 "Button_Switch_Keyboard:SW_Cherry_MX_1.00u_PCB" H 9775 3675 60  0001 C CNN
F 3 "" H 9775 3675 60  0001 C CNN
	1    10400 3700
	1    0    0    -1  
$EndComp
$Comp
L Device:D_Small D39
U 1 1 607913BF
P 10200 3950
F 0 "D39" V 10246 3880 50  0000 R CNN
F 1 "D_Small" V 10155 3880 50  0000 R CNN
F 2 "random-keyboard-parts:D_SOD-123-Pretty" V 10200 3950 50  0001 C CNN
F 3 "~" V 10200 3950 50  0001 C CNN
	1    10200 3950
	0    -1   -1   0   
$EndComp
Wire Wire Line
	10200 3850 10350 3850
Wire Wire Line
	5100 1350 5100 2100
Wire Wire Line
	5100 2100 5100 2900
Connection ~ 5100 2100
Wire Wire Line
	5100 2900 5100 3650
Connection ~ 5100 2900
Wire Wire Line
	5650 1350 5650 2100
Wire Wire Line
	5650 2100 5650 2900
Connection ~ 5650 2100
Wire Wire Line
	5650 2900 5650 3650
Connection ~ 5650 2900
Wire Wire Line
	6200 1350 6200 2100
Wire Wire Line
	6200 2100 6200 2900
Connection ~ 6200 2100
Wire Wire Line
	6200 2900 6200 3650
Connection ~ 6200 2900
Wire Wire Line
	6750 1350 6750 2100
Wire Wire Line
	6750 2100 6750 2900
Connection ~ 6750 2100
Wire Wire Line
	7300 1350 7300 2100
Wire Wire Line
	7300 2100 7300 2900
Connection ~ 7300 2100
Wire Wire Line
	7850 1350 7850 2100
Wire Wire Line
	7850 2100 7850 2900
Connection ~ 7850 2100
Wire Wire Line
	7850 2900 7850 3650
Connection ~ 7850 2900
Wire Wire Line
	8400 1350 8400 2100
Wire Wire Line
	8400 2100 8400 2900
Connection ~ 8400 2100
Wire Wire Line
	8950 1350 8950 2100
Wire Wire Line
	8950 2100 8950 2900
Connection ~ 8950 2100
Wire Wire Line
	9450 1350 9450 2100
Wire Wire Line
	9450 2100 9450 2900
Connection ~ 9450 2100
Wire Wire Line
	10000 1350 10000 2100
Wire Wire Line
	10000 2100 10000 2900
Connection ~ 10000 2100
Wire Wire Line
	10000 2900 10000 3650
Connection ~ 10000 2900
Wire Wire Line
	10550 1350 10550 2100
Wire Wire Line
	10550 2100 10550 2900
Connection ~ 10550 2100
Wire Wire Line
	10550 2900 10550 3650
Connection ~ 10550 2900
Wire Wire Line
	11100 2900 11100 3650
Connection ~ 11100 2900
Wire Wire Line
	11100 1350 11100 2900
Wire Wire Line
	10750 1750 10200 1750
Wire Wire Line
	10200 1750 9650 1750
Connection ~ 10200 1750
Wire Wire Line
	9650 1750 9100 1750
Connection ~ 9650 1750
Wire Wire Line
	9100 1750 8600 1750
Connection ~ 9100 1750
Wire Wire Line
	8600 1750 8050 1750
Connection ~ 8600 1750
Wire Wire Line
	8050 1750 7500 1750
Connection ~ 8050 1750
Wire Wire Line
	7500 1750 6950 1750
Connection ~ 7500 1750
Wire Wire Line
	6950 1750 6400 1750
Connection ~ 6950 1750
Wire Wire Line
	6400 1750 5850 1750
Connection ~ 6400 1750
Wire Wire Line
	5850 1750 5300 1750
Connection ~ 5850 1750
Wire Wire Line
	5300 1750 4750 1750
Connection ~ 5300 1750
Wire Wire Line
	10200 2500 9650 2500
Wire Wire Line
	9650 2500 9100 2500
Connection ~ 9650 2500
Wire Wire Line
	9100 2500 8600 2500
Connection ~ 9100 2500
Wire Wire Line
	8600 2500 8050 2500
Connection ~ 8600 2500
Wire Wire Line
	8050 2500 7500 2500
Connection ~ 8050 2500
Wire Wire Line
	7500 2500 6950 2500
Connection ~ 7500 2500
Wire Wire Line
	6950 2500 6400 2500
Connection ~ 6950 2500
Wire Wire Line
	6400 2500 5850 2500
Connection ~ 6400 2500
Wire Wire Line
	5850 2500 5300 2500
Connection ~ 5850 2500
Wire Wire Line
	5300 2500 4750 2500
Connection ~ 5300 2500
Wire Wire Line
	10750 3300 10200 3300
Wire Wire Line
	10200 3300 9650 3300
Connection ~ 10200 3300
Wire Wire Line
	9650 3300 9100 3300
Connection ~ 9650 3300
Wire Wire Line
	9100 3300 8600 3300
Connection ~ 9100 3300
Wire Wire Line
	8600 3300 8050 3300
Connection ~ 8600 3300
Wire Wire Line
	8050 3300 7500 3300
Connection ~ 8050 3300
Wire Wire Line
	6950 3300 7500 3300
Connection ~ 7500 3300
Wire Wire Line
	6950 3300 6400 3300
Connection ~ 6950 3300
Wire Wire Line
	6400 3300 5850 3300
Connection ~ 6400 3300
Wire Wire Line
	5850 3300 5300 3300
Connection ~ 5850 3300
Wire Wire Line
	5300 3300 4750 3300
Connection ~ 5300 3300
Wire Wire Line
	10750 4050 10200 4050
Wire Wire Line
	10200 4050 9650 4050
Connection ~ 10200 4050
Wire Wire Line
	9650 4050 7500 4050
Connection ~ 9650 4050
Wire Wire Line
	7500 4050 5850 4050
Connection ~ 7500 4050
Wire Wire Line
	5850 4050 5300 4050
Connection ~ 5850 4050
Wire Wire Line
	5300 4050 4750 4050
Connection ~ 5300 4050
Text GLabel 5100 900  1    50   Input ~ 0
COL0
Wire Wire Line
	5100 900  5100 1350
Connection ~ 5100 1350
Text GLabel 5650 900  1    50   Input ~ 0
COL1
Text GLabel 6200 900  1    50   Input ~ 0
COL2
Text GLabel 6750 900  1    50   Input ~ 0
COL3
Text GLabel 7300 900  1    50   Input ~ 0
COL4
Text GLabel 7850 900  1    50   Input ~ 0
COL5
Text GLabel 8400 900  1    50   Input ~ 0
COL6
Text GLabel 8950 900  1    50   Input ~ 0
COL7
Text GLabel 9450 900  1    50   Input ~ 0
COL8
Text GLabel 10000 900  1    50   Input ~ 0
COL9
Text GLabel 10550 900  1    50   Input ~ 0
COL10
Text GLabel 11100 900  1    50   Input ~ 0
COL11
Wire Wire Line
	5650 900  5650 1350
Connection ~ 5650 1350
Wire Wire Line
	6200 900  6200 1350
Connection ~ 6200 1350
Wire Wire Line
	6750 900  6750 1350
Connection ~ 6750 1350
Wire Wire Line
	7300 900  7300 1350
Connection ~ 7300 1350
Wire Wire Line
	7850 900  7850 1350
Connection ~ 7850 1350
Wire Wire Line
	8400 900  8400 1350
Connection ~ 8400 1350
Wire Wire Line
	8950 900  8950 1350
Connection ~ 8950 1350
Wire Wire Line
	9450 900  9450 1350
Connection ~ 9450 1350
Wire Wire Line
	10000 900  10000 1350
Connection ~ 10000 1350
Wire Wire Line
	10550 900  10550 1350
Connection ~ 10550 1350
Wire Wire Line
	11100 900  11100 1350
Connection ~ 11100 1350
Text GLabel 4150 2500 0    50   Input ~ 0
ROW1
Text GLabel 4150 3300 0    50   Input ~ 0
ROW2
Text GLabel 4150 4050 0    50   Input ~ 0
ROW3
Wire Wire Line
	4150 1750 4750 1750
Connection ~ 4750 1750
Wire Wire Line
	4150 2500 4750 2500
Connection ~ 4750 2500
Wire Wire Line
	4150 3300 4750 3300
Connection ~ 4750 3300
Wire Wire Line
	4150 4050 4750 4050
Connection ~ 4750 4050
Text GLabel 2600 4150 2    50   Input ~ 0
COL0
Text GLabel 2600 4250 2    50   Input ~ 0
COL1
Text GLabel 2600 4350 2    50   Input ~ 0
COL2
Text GLabel 2600 4650 2    50   Input ~ 0
COL3
Text GLabel 2600 4750 2    50   Input ~ 0
COL4
Text GLabel 2600 6550 2    50   Input ~ 0
COL5
Text GLabel 2600 6650 2    50   Input ~ 0
COL6
Text GLabel 2600 3750 2    50   Input ~ 0
COL7
Text GLabel 2600 5050 2    50   Input ~ 0
COL8
Text GLabel 2600 5150 2    50   Input ~ 0
COL9
Text GLabel 2600 5250 2    50   Input ~ 0
COL10
Text GLabel 2600 5350 2    50   Input ~ 0
COL11
Text GLabel 2600 5950 2    50   Input ~ 0
ROW0
Text GLabel 2600 6450 2    50   Input ~ 0
ROW1
Text GLabel 2600 6150 2    50   Input ~ 0
ROW2
Text GLabel 2600 6250 2    50   Input ~ 0
ROW3
$Comp
L MX_Alps_Hybrid:MX-NoLED MX28
U 1 1 607808FD
P 8800 2950
F 0 "MX28" H 8833 3173 60  0000 C CNN
F 1 "MX-NoLED" H 8833 3099 20  0000 C CNN
F 2 "Button_Switch_Keyboard:SW_Cherry_MX_1.00u_PCB" H 8175 2925 60  0001 C CNN
F 3 "" H 8175 2925 60  0001 C CNN
	1    8800 2950
	1    0    0    -1  
$EndComp
$Comp
L MX_Alps_Hybrid:MX-NoLED MX25
U 1 1 60780931
P 8250 2950
F 0 "MX25" H 8283 3173 60  0000 C CNN
F 1 "MX-NoLED" H 8283 3099 20  0000 C CNN
F 2 "Button_Switch_Keyboard:SW_Cherry_MX_1.00u_PCB" H 7625 2925 60  0001 C CNN
F 3 "" H 7625 2925 60  0001 C CNN
	1    8250 2950
	1    0    0    -1  
$EndComp
$Comp
L MX_Alps_Hybrid:MX-NoLED MX21
U 1 1 6077D87A
P 7700 2950
F 0 "MX21" H 7733 3173 60  0000 C CNN
F 1 "MX-NoLED" H 7733 3099 20  0000 C CNN
F 2 "Button_Switch_Keyboard:SW_Cherry_MX_1.00u_PCB" H 7075 2925 60  0001 C CNN
F 3 "" H 7075 2925 60  0001 C CNN
	1    7700 2950
	1    0    0    -1  
$EndComp
$Comp
L MX_Alps_Hybrid:MX-NoLED MX18
U 1 1 6077D8AE
P 7150 2950
F 0 "MX18" H 7183 3173 60  0000 C CNN
F 1 "MX-NoLED" H 7183 3099 20  0000 C CNN
F 2 "Button_Switch_Keyboard:SW_Cherry_MX_1.00u_PCB" H 6525 2925 60  0001 C CNN
F 3 "" H 6525 2925 60  0001 C CNN
	1    7150 2950
	1    0    0    -1  
$EndComp
$Comp
L MX_Alps_Hybrid:MX-NoLED MX15
U 1 1 6076B937
P 6600 2950
F 0 "MX15" H 6633 3173 60  0000 C CNN
F 1 "MX-NoLED" H 6633 3099 20  0000 C CNN
F 2 "Button_Switch_Keyboard:SW_Cherry_MX_1.00u_PCB" H 5975 2925 60  0001 C CNN
F 3 "" H 5975 2925 60  0001 C CNN
	1    6600 2950
	1    0    0    -1  
$EndComp
$Comp
L MX_Alps_Hybrid:MX-NoLED MX11
U 1 1 60771A31
P 6050 2950
F 0 "MX11" H 6083 3173 60  0000 C CNN
F 1 "MX-NoLED" H 6083 3099 20  0000 C CNN
F 2 "Button_Switch_Keyboard:SW_Cherry_MX_1.00u_PCB" H 5425 2925 60  0001 C CNN
F 3 "" H 5425 2925 60  0001 C CNN
	1    6050 2950
	1    0    0    -1  
$EndComp
$Comp
L MX_Alps_Hybrid:MX-NoLED MX7
U 1 1 6078504C
P 5500 2950
F 0 "MX7" H 5533 3173 60  0000 C CNN
F 1 "MX-NoLED" H 5533 3099 20  0000 C CNN
F 2 "Button_Switch_Keyboard:SW_Cherry_MX_1.00u_PCB" H 4875 2925 60  0001 C CNN
F 3 "" H 4875 2925 60  0001 C CNN
	1    5500 2950
	1    0    0    -1  
$EndComp
$Comp
L MX_Alps_Hybrid:MX-NoLED MX3
U 1 1 60785080
P 4950 2950
F 0 "MX3" H 4983 3173 60  0000 C CNN
F 1 "MX-NoLED" H 4983 3099 20  0000 C CNN
F 2 "Button_Switch_Keyboard:SW_Cherry_MX_1.00u_PCB" H 4325 2925 60  0001 C CNN
F 3 "" H 4325 2925 60  0001 C CNN
	1    4950 2950
	1    0    0    -1  
$EndComp
$Comp
L MX_Alps_Hybrid:MX-NoLED MX37
U 1 1 6079139F
P 10400 2150
F 0 "MX37" H 10433 2373 60  0000 C CNN
F 1 "MX-NoLED" H 10433 2299 20  0000 C CNN
F 2 "Button_Switch_Keyboard:SW_Cherry_MX_1.00u_PCB" H 9775 2125 60  0001 C CNN
F 3 "" H 9775 2125 60  0001 C CNN
	1    10400 2150
	1    0    0    -1  
$EndComp
$Comp
L MX_Alps_Hybrid:MX-NoLED MX33
U 1 1 6078B840
P 9850 2150
F 0 "MX33" H 9883 2373 60  0000 C CNN
F 1 "MX-NoLED" H 9883 2299 20  0000 C CNN
F 2 "Button_Switch_Keyboard:SW_Cherry_MX_1.00u_PCB" H 9225 2125 60  0001 C CNN
F 3 "" H 9225 2125 60  0001 C CNN
	1    9850 2150
	1    0    0    -1  
$EndComp
$Comp
L MX_Alps_Hybrid:MX-NoLED MX30
U 1 1 6078B874
P 9300 2150
F 0 "MX30" H 9333 2373 60  0000 C CNN
F 1 "MX-NoLED" H 9333 2299 20  0000 C CNN
F 2 "Button_Switch_Keyboard:SW_Cherry_MX_1.00u_PCB" H 8675 2125 60  0001 C CNN
F 3 "" H 8675 2125 60  0001 C CNN
	1    9300 2150
	1    0    0    -1  
$EndComp
$Comp
L MX_Alps_Hybrid:MX-NoLED MX27
U 1 1 607808F0
P 8800 2150
F 0 "MX27" H 8833 2373 60  0000 C CNN
F 1 "MX-NoLED" H 8833 2299 20  0000 C CNN
F 2 "Button_Switch_Keyboard:SW_Cherry_MX_1.00u_PCB" H 8175 2125 60  0001 C CNN
F 3 "" H 8175 2125 60  0001 C CNN
	1    8800 2150
	1    0    0    -1  
$EndComp
$Comp
L MX_Alps_Hybrid:MX-NoLED MX24
U 1 1 60780924
P 8250 2150
F 0 "MX24" H 8283 2373 60  0000 C CNN
F 1 "MX-NoLED" H 8283 2299 20  0000 C CNN
F 2 "Button_Switch_Keyboard:SW_Cherry_MX_1.00u_PCB" H 7625 2125 60  0001 C CNN
F 3 "" H 7625 2125 60  0001 C CNN
	1    8250 2150
	1    0    0    -1  
$EndComp
$Comp
L MX_Alps_Hybrid:MX-NoLED MX20
U 1 1 6077D86D
P 7700 2150
F 0 "MX20" H 7733 2373 60  0000 C CNN
F 1 "MX-NoLED" H 7733 2299 20  0000 C CNN
F 2 "Button_Switch_Keyboard:SW_Cherry_MX_1.00u_PCB" H 7075 2125 60  0001 C CNN
F 3 "" H 7075 2125 60  0001 C CNN
	1    7700 2150
	1    0    0    -1  
$EndComp
$Comp
L MX_Alps_Hybrid:MX-NoLED MX17
U 1 1 6077D8A1
P 7150 2150
F 0 "MX17" H 7183 2373 60  0000 C CNN
F 1 "MX-NoLED" H 7183 2299 20  0000 C CNN
F 2 "Button_Switch_Keyboard:SW_Cherry_MX_1.00u_PCB" H 6525 2125 60  0001 C CNN
F 3 "" H 6525 2125 60  0001 C CNN
	1    7150 2150
	1    0    0    -1  
$EndComp
$Comp
L MX_Alps_Hybrid:MX-NoLED MX14
U 1 1 6076A9F0
P 6600 2150
F 0 "MX14" H 6633 2373 60  0000 C CNN
F 1 "MX-NoLED" H 6633 2299 20  0000 C CNN
F 2 "Button_Switch_Keyboard:SW_Cherry_MX_1.00u_PCB" H 5975 2125 60  0001 C CNN
F 3 "" H 5975 2125 60  0001 C CNN
	1    6600 2150
	1    0    0    -1  
$EndComp
$Comp
L MX_Alps_Hybrid:MX-NoLED MX10
U 1 1 60771A24
P 6050 2150
F 0 "MX10" H 6083 2373 60  0000 C CNN
F 1 "MX-NoLED" H 6083 2299 20  0000 C CNN
F 2 "Button_Switch_Keyboard:SW_Cherry_MX_1.00u_PCB" H 5425 2125 60  0001 C CNN
F 3 "" H 5425 2125 60  0001 C CNN
	1    6050 2150
	1    0    0    -1  
$EndComp
$Comp
L MX_Alps_Hybrid:MX-NoLED MX6
U 1 1 6078503F
P 5500 2150
F 0 "MX6" H 5533 2373 60  0000 C CNN
F 1 "MX-NoLED" H 5533 2299 20  0000 C CNN
F 2 "Button_Switch_Keyboard:SW_Cherry_MX_1.00u_PCB" H 4875 2125 60  0001 C CNN
F 3 "" H 4875 2125 60  0001 C CNN
	1    5500 2150
	1    0    0    -1  
$EndComp
$Comp
L MX_Alps_Hybrid:MX-NoLED MX2
U 1 1 60785073
P 4950 2150
F 0 "MX2" H 4983 2373 60  0000 C CNN
F 1 "MX-NoLED" H 4983 2299 20  0000 C CNN
F 2 "Button_Switch_Keyboard:SW_Cherry_MX_1.50u_PCB" H 4325 2125 60  0001 C CNN
F 3 "" H 4325 2125 60  0001 C CNN
	1    4950 2150
	1    0    0    -1  
$EndComp
$Comp
L MX_Alps_Hybrid:MX-NoLED MX40
U 1 1 6079135E
P 10950 1400
F 0 "MX40" H 10983 1623 60  0000 C CNN
F 1 "MX-NoLED" H 10983 1549 20  0000 C CNN
F 2 "Button_Switch_Keyboard:SW_Cherry_MX_ISOEnter_PCB" H 10325 1375 60  0001 C CNN
F 3 "" H 10325 1375 60  0001 C CNN
	1    10950 1400
	1    0    0    -1  
$EndComp
$Comp
L MX_Alps_Hybrid:MX-NoLED MX36
U 1 1 60791392
P 10400 1400
F 0 "MX36" H 10433 1623 60  0000 C CNN
F 1 "MX-NoLED" H 10433 1549 20  0000 C CNN
F 2 "Button_Switch_Keyboard:SW_Cherry_MX_1.00u_PCB" H 9775 1375 60  0001 C CNN
F 3 "" H 9775 1375 60  0001 C CNN
	1    10400 1400
	1    0    0    -1  
$EndComp
$Comp
L MX_Alps_Hybrid:MX-NoLED MX32
U 1 1 6078B833
P 9850 1400
F 0 "MX32" H 9883 1623 60  0000 C CNN
F 1 "MX-NoLED" H 9883 1549 20  0000 C CNN
F 2 "Button_Switch_Keyboard:SW_Cherry_MX_1.00u_PCB" H 9225 1375 60  0001 C CNN
F 3 "" H 9225 1375 60  0001 C CNN
	1    9850 1400
	1    0    0    -1  
$EndComp
$Comp
L MX_Alps_Hybrid:MX-NoLED MX29
U 1 1 6078B867
P 9300 1400
F 0 "MX29" H 9333 1623 60  0000 C CNN
F 1 "MX-NoLED" H 9333 1549 20  0000 C CNN
F 2 "Button_Switch_Keyboard:SW_Cherry_MX_1.00u_PCB" H 8675 1375 60  0001 C CNN
F 3 "" H 8675 1375 60  0001 C CNN
	1    9300 1400
	1    0    0    -1  
$EndComp
$Comp
L MX_Alps_Hybrid:MX-NoLED MX26
U 1 1 607808E3
P 8800 1400
F 0 "MX26" H 8833 1623 60  0000 C CNN
F 1 "MX-NoLED" H 8833 1549 20  0000 C CNN
F 2 "Button_Switch_Keyboard:SW_Cherry_MX_1.00u_PCB" H 8175 1375 60  0001 C CNN
F 3 "" H 8175 1375 60  0001 C CNN
	1    8800 1400
	1    0    0    -1  
$EndComp
$Comp
L MX_Alps_Hybrid:MX-NoLED MX23
U 1 1 60780917
P 8250 1400
F 0 "MX23" H 8283 1623 60  0000 C CNN
F 1 "MX-NoLED" H 8283 1549 20  0000 C CNN
F 2 "Button_Switch_Keyboard:SW_Cherry_MX_1.00u_PCB" H 7625 1375 60  0001 C CNN
F 3 "" H 7625 1375 60  0001 C CNN
	1    8250 1400
	1    0    0    -1  
$EndComp
$Comp
L MX_Alps_Hybrid:MX-NoLED MX19
U 1 1 6077D860
P 7700 1400
F 0 "MX19" H 7733 1623 60  0000 C CNN
F 1 "MX-NoLED" H 7733 1549 20  0000 C CNN
F 2 "Button_Switch_Keyboard:SW_Cherry_MX_1.00u_PCB" H 7075 1375 60  0001 C CNN
F 3 "" H 7075 1375 60  0001 C CNN
	1    7700 1400
	1    0    0    -1  
$EndComp
$Comp
L MX_Alps_Hybrid:MX-NoLED MX16
U 1 1 6077D894
P 7150 1400
F 0 "MX16" H 7183 1623 60  0000 C CNN
F 1 "MX-NoLED" H 7183 1549 20  0000 C CNN
F 2 "Button_Switch_Keyboard:SW_Cherry_MX_1.00u_PCB" H 6525 1375 60  0001 C CNN
F 3 "" H 6525 1375 60  0001 C CNN
	1    7150 1400
	1    0    0    -1  
$EndComp
$Comp
L MX_Alps_Hybrid:MX-NoLED MX13
U 1 1 607669DC
P 6600 1400
F 0 "MX13" H 6633 1623 60  0000 C CNN
F 1 "MX-NoLED" H 6633 1549 20  0000 C CNN
F 2 "Button_Switch_Keyboard:SW_Cherry_MX_1.00u_PCB" H 5975 1375 60  0001 C CNN
F 3 "" H 5975 1375 60  0001 C CNN
	1    6600 1400
	1    0    0    -1  
$EndComp
$Comp
L MX_Alps_Hybrid:MX-NoLED MX9
U 1 1 60771A17
P 6050 1400
F 0 "MX9" H 6083 1623 60  0000 C CNN
F 1 "MX-NoLED" H 6083 1549 20  0000 C CNN
F 2 "Button_Switch_Keyboard:SW_Cherry_MX_1.00u_PCB" H 5425 1375 60  0001 C CNN
F 3 "" H 5425 1375 60  0001 C CNN
	1    6050 1400
	1    0    0    -1  
$EndComp
$Comp
L MX_Alps_Hybrid:MX-NoLED MX5
U 1 1 60785032
P 5500 1400
F 0 "MX5" H 5533 1623 60  0000 C CNN
F 1 "MX-NoLED" H 5533 1549 20  0000 C CNN
F 2 "Button_Switch_Keyboard:SW_Cherry_MX_1.00u_PCB" H 4875 1375 60  0001 C CNN
F 3 "" H 4875 1375 60  0001 C CNN
	1    5500 1400
	1    0    0    -1  
$EndComp
$Comp
L MX_Alps_Hybrid:MX-NoLED MX1
U 1 1 60785066
P 4950 1400
F 0 "MX1" H 4983 1623 60  0000 C CNN
F 1 "MX-NoLED" H 4983 1549 20  0000 C CNN
F 2 "Button_Switch_Keyboard:SW_Cherry_MX_1.25u_PCB" H 4325 1375 60  0001 C CNN
F 3 "" H 4325 1375 60  0001 C CNN
	1    4950 1400
	1    0    0    -1  
$EndComp
Text GLabel 4150 1750 0    50   Input ~ 0
ROW0
$Comp
L Device:Polyfuse_Small F1
U 1 1 609F437A
P 9200 4850
F 0 "F1" V 8995 4850 50  0000 C CNN
F 1 "500mA" V 9086 4850 50  0000 C CNN
F 2 "Fuse:Fuse_1206_3216Metric_Pad1.42x1.75mm_HandSolder" H 9250 4650 50  0001 L CNN
F 3 "~" H 9200 4850 50  0001 C CNN
	1    9200 4850
	0    1    1    0   
$EndComp
Wire Wire Line
	8400 4850 8550 4850
$Comp
L power:+5V #PWR0108
U 1 1 60A01C2E
P 9650 4850
F 0 "#PWR0108" H 9650 4700 50  0001 C CNN
F 1 "+5V" H 9665 5023 50  0000 C CNN
F 2 "" H 9650 4850 50  0001 C CNN
F 3 "" H 9650 4850 50  0001 C CNN
	1    9650 4850
	0    1    1    0   
$EndComp
Wire Wire Line
	9650 4850 9550 4850
$Comp
L power:VCC #PWR0109
U 1 1 60A10FB3
P 8800 4850
F 0 "#PWR0109" H 8800 4700 50  0001 C CNN
F 1 "VCC" H 8815 5023 50  0000 C CNN
F 2 "" H 8800 4850 50  0001 C CNN
F 3 "" H 8800 4850 50  0001 C CNN
	1    8800 4850
	1    0    0    -1  
$EndComp
Connection ~ 8800 4850
Wire Wire Line
	8800 4850 9100 4850
Wire Wire Line
	3500 5850 3050 5850
$Comp
L power:GND #PWR0101
U 1 1 607EE58F
P 3500 5850
F 0 "#PWR0101" H 3500 5600 50  0001 C CNN
F 1 "GND" H 3505 5677 50  0000 C CNN
F 2 "" H 3500 5850 50  0001 C CNN
F 3 "" H 3500 5850 50  0001 C CNN
	1    3500 5850
	1    0    0    -1  
$EndComp
$Comp
L Device:R_Small R4
U 1 1 607DE2A5
P 2950 5850
F 0 "R4" V 3146 5850 50  0000 C CNN
F 1 "10k" V 3055 5850 50  0000 C CNN
F 2 "Resistor_SMD:R_0805_2012Metric_Pad1.20x1.40mm_HandSolder" H 2950 5850 50  0001 C CNN
F 3 "~" H 2950 5850 50  0001 C CNN
	1    2950 5850
	0    -1   -1   0   
$EndComp
$Comp
L power:+5V #PWR0113
U 1 1 60A51CB3
P 200 5950
F 0 "#PWR0113" H 200 5800 50  0001 C CNN
F 1 "+5V" H 215 6123 50  0000 C CNN
F 2 "" H 200 5950 50  0001 C CNN
F 3 "" H 200 5950 50  0001 C CNN
	1    200  5950
	1    0    0    -1  
$EndComp
$Comp
L power:+5V #PWR0112
U 1 1 60A51973
P 6100 5500
F 0 "#PWR0112" H 6100 5350 50  0001 C CNN
F 1 "+5V" H 6115 5673 50  0000 C CNN
F 2 "" H 6100 5500 50  0001 C CNN
F 3 "" H 6100 5500 50  0001 C CNN
	1    6100 5500
	1    0    0    -1  
$EndComp
$Comp
L power:+5V #PWR0111
U 1 1 60A50FB6
P 1900 3200
F 0 "#PWR0111" H 1900 3050 50  0001 C CNN
F 1 "+5V" H 1915 3373 50  0000 C CNN
F 2 "" H 1900 3200 50  0001 C CNN
F 3 "" H 1900 3200 50  0001 C CNN
	1    1900 3200
	1    0    0    -1  
$EndComp
Wire Wire Line
	-100 4850 550  4850
Wire Wire Line
	-100 4750 850  4750
Text GLabel -100 4850 0    50   Input ~ 0
D-
Text GLabel -100 4750 0    50   Input ~ 0
D+
Wire Wire Line
	6100 5500 6100 5650
$Comp
L Device:R_Small R3
U 1 1 609BA8DD
P 6100 5750
F 0 "R3" H 6159 5796 50  0000 L CNN
F 1 "10k" H 6159 5705 50  0000 L CNN
F 2 "Resistor_SMD:R_0805_2012Metric_Pad1.20x1.40mm_HandSolder" H 6100 5750 50  0001 C CNN
F 3 "~" H 6100 5750 50  0001 C CNN
	1    6100 5750
	1    0    0    -1  
$EndComp
Wire Wire Line
	5200 6050 5200 6150
Wire Wire Line
	5400 6050 5200 6050
$Comp
L power:GND #PWR0107
U 1 1 6091B378
P 1000 2250
F 0 "#PWR0107" H 1000 2000 50  0001 C CNN
F 1 "GND" H 1005 2077 50  0000 C CNN
F 2 "" H 1000 2250 50  0001 C CNN
F 3 "" H 1000 2250 50  0001 C CNN
	1    1000 2250
	1    0    0    -1  
$EndComp
$Comp
L Device:C_Small C5
U 1 1 608FB5C6
P 1300 2050
F 0 "C5" V 1071 2050 50  0000 C CNN
F 1 "22pF" V 1162 2050 50  0000 C CNN
F 2 "Capacitor_SMD:C_0805_2012Metric_Pad1.18x1.45mm_HandSolder" H 1300 2050 50  0001 C CNN
F 3 "~" H 1300 2050 50  0001 C CNN
	1    1300 2050
	-1   0    0    1   
$EndComp
$Comp
L Device:C_Small C4
U 1 1 608FAE00
P 700 2050
F 0 "C4" V 471 2050 50  0000 C CNN
F 1 "22pF" V 562 2050 50  0000 C CNN
F 2 "Capacitor_SMD:C_0805_2012Metric_Pad1.18x1.45mm_HandSolder" H 700 2050 50  0001 C CNN
F 3 "~" H 700 2050 50  0001 C CNN
	1    700  2050
	1    0    0    -1  
$EndComp
Wire Wire Line
	200  4550 1400 4550
Wire Wire Line
	200  4550 200  4450
$Comp
L Device:Crystal_GND24_Small Y1
U 1 1 608D20D0
P 1000 1800
F 0 "Y1" V 954 1944 50  0000 L CNN
F 1 "16MHz" V 1045 1944 50  0000 L CNN
F 2 "Crystal:Crystal_SMD_3225-4Pin_3.2x2.5mm_HandSoldering" H 1000 1800 50  0001 C CNN
F 3 "~" H 1000 1800 50  0001 C CNN
	1    1000 1800
	1    0    0    -1  
$EndComp
$Comp
L MCU_Microchip_ATmega:ATmega32U4-AU U1
U 1 1 60783E27
P 2000 5250
F 0 "U1" H 2000 3361 50  0000 C CNN
F 1 "ATmega32U4-AU" H 2000 3270 50  0000 C CNN
F 2 "Package_QFP:TQFP-44_10x10mm_P0.8mm" H 2000 5250 50  0001 C CIN
F 3 "http://ww1.microchip.com/downloads/en/DeviceDoc/Atmel-7766-8-bit-AVR-ATmega16U4-32U4_Datasheet.pdf" H 2000 5250 50  0001 C CNN
	1    2000 5250
	1    0    0    -1  
$EndComp
Wire Wire Line
	200  6800 200  6650
Connection ~ 200  6650
Wire Wire Line
	-50  6650 200  6650
Wire Wire Line
	200  5950 200  6050
Wire Wire Line
	850  6450 850  6650
Wire Wire Line
	200  6650 400  6650
Wire Wire Line
	850  6650 400  6650
Connection ~ 400  6650
Wire Wire Line
	400  6450 400  6650
Wire Wire Line
	-50  6450 -50  6650
Connection ~ -50  6650
Wire Wire Line
	-500 6650 -50  6650
Wire Wire Line
	-500 6450 -500 6650
Wire Wire Line
	850  6250 850  6050
Wire Wire Line
	850  6050 400  6050
Wire Wire Line
	400  6050 200  6050
Connection ~ 400  6050
Wire Wire Line
	400  6250 400  6050
Connection ~ 200  6050
Wire Wire Line
	-50  6050 200  6050
Wire Wire Line
	-50  6250 -50  6050
Connection ~ -50  6050
Wire Wire Line
	-500 6050 -50  6050
Wire Wire Line
	-500 6250 -500 6050
$Comp
L power:GND #PWR0104
U 1 1 60864F13
P 200 6800
F 0 "#PWR0104" H 200 6550 50  0001 C CNN
F 1 "GND" H 205 6627 50  0000 C CNN
F 2 "" H 200 6800 50  0001 C CNN
F 3 "" H 200 6800 50  0001 C CNN
	1    200  6800
	1    0    0    -1  
$EndComp
$Comp
L Device:C_Small C6
U 1 1 608649BC
P 850 6350
F 0 "C6" H 942 6396 50  0000 L CNN
F 1 "10uF" H 942 6305 50  0000 L CNN
F 2 "Capacitor_SMD:C_0805_2012Metric_Pad1.18x1.45mm_HandSolder" H 850 6350 50  0001 C CNN
F 3 "~" H 850 6350 50  0001 C CNN
	1    850  6350
	1    0    0    -1  
$EndComp
$Comp
L Device:C_Small C3
U 1 1 608645D4
P 400 6350
F 0 "C3" H 492 6396 50  0000 L CNN
F 1 "0.1uF" H 492 6305 50  0000 L CNN
F 2 "Capacitor_SMD:C_0805_2012Metric_Pad1.18x1.45mm_HandSolder" H 400 6350 50  0001 C CNN
F 3 "~" H 400 6350 50  0001 C CNN
	1    400  6350
	1    0    0    -1  
$EndComp
$Comp
L Device:C_Small C2
U 1 1 60863FCF
P -50 6350
F 0 "C2" H 42  6396 50  0000 L CNN
F 1 "0.1uF" H 42  6305 50  0000 L CNN
F 2 "Capacitor_SMD:C_0805_2012Metric_Pad1.18x1.45mm_HandSolder" H -50 6350 50  0001 C CNN
F 3 "~" H -50 6350 50  0001 C CNN
	1    -50  6350
	1    0    0    -1  
$EndComp
$Comp
L Device:C_Small C1
U 1 1 60863C7B
P -500 6350
F 0 "C1" H -408 6396 50  0000 L CNN
F 1 "0.1uF" H -408 6305 50  0000 L CNN
F 2 "Capacitor_SMD:C_0805_2012Metric_Pad1.18x1.45mm_HandSolder" H -500 6350 50  0001 C CNN
F 3 "~" H -500 6350 50  0001 C CNN
	1    -500 6350
	1    0    0    -1  
$EndComp
Wire Wire Line
	900  5250 900  5350
Wire Wire Line
	1400 5050 900  5050
$Comp
L power:GND #PWR0103
U 1 1 6084D53E
P 900 5350
F 0 "#PWR0103" H 900 5100 50  0001 C CNN
F 1 "GND" H 905 5177 50  0000 C CNN
F 2 "" H 900 5350 50  0001 C CNN
F 3 "" H 900 5350 50  0001 C CNN
	1    900  5350
	1    0    0    -1  
$EndComp
$Comp
L Device:C_Small C7
U 1 1 6084C896
P 900 5150
F 0 "C7" H 992 5196 50  0000 L CNN
F 1 "1uF" H 992 5105 50  0000 L CNN
F 2 "Capacitor_SMD:C_0805_2012Metric_Pad1.18x1.45mm_HandSolder" H 900 5150 50  0001 C CNN
F 3 "~" H 900 5150 50  0001 C CNN
	1    900  5150
	1    0    0    -1  
$EndComp
Wire Wire Line
	1400 4850 750  4850
Wire Wire Line
	1050 4750 1400 4750
$Comp
L Device:R_Small R1
U 1 1 60826516
P 650 4850
F 0 "R1" V 454 4850 50  0000 C CNN
F 1 "22" V 545 4850 50  0000 C CNN
F 2 "Resistor_SMD:R_0805_2012Metric_Pad1.20x1.40mm_HandSolder" H 650 4850 50  0001 C CNN
F 3 "~" H 650 4850 50  0001 C CNN
	1    650  4850
	0    1    1    0   
$EndComp
$Comp
L Device:R_Small R2
U 1 1 60825F32
P 950 4750
F 0 "R2" V 754 4750 50  0000 C CNN
F 1 "22" V 845 4750 50  0000 C CNN
F 2 "Resistor_SMD:R_0805_2012Metric_Pad1.20x1.40mm_HandSolder" H 950 4750 50  0001 C CNN
F 3 "~" H 950 4750 50  0001 C CNN
	1    950  4750
	0    1    1    0   
$EndComp
Wire Wire Line
	2850 5850 2600 5850
Wire Wire Line
	1900 7150 1400 7150
Wire Wire Line
	1900 7050 1900 7150
Connection ~ 1900 7150
Wire Wire Line
	2000 7150 1900 7150
Wire Wire Line
	2000 7050 2000 7150
Wire Wire Line
	2100 3450 2100 3350
Wire Wire Line
	1900 3350 1900 3450
Wire Wire Line
	2100 3350 2000 3350
Wire Wire Line
	2000 3350 1900 3350
Connection ~ 2000 3350
Wire Wire Line
	2000 3450 2000 3350
Connection ~ 1900 3350
Wire Wire Line
	1900 3200 1900 3350
$Comp
L power:GND #PWR0105
U 1 1 60761A29
P 1400 7150
F 0 "#PWR0105" H 1400 6900 50  0001 C CNN
F 1 "GND" H 1405 6977 50  0000 C CNN
F 2 "" H 1400 7150 50  0001 C CNN
F 3 "" H 1400 7150 50  0001 C CNN
	1    1400 7150
	1    0    0    -1  
$EndComp
$Comp
L power:GND #PWR0102
U 1 1 607594E5
P 5200 6150
F 0 "#PWR0102" H 5200 5900 50  0001 C CNN
F 1 "GND" H 5205 5977 50  0000 C CNN
F 2 "" H 5200 6150 50  0001 C CNN
F 3 "" H 5200 6150 50  0001 C CNN
	1    5200 6150
	1    0    0    -1  
$EndComp
$Comp
L Switch:SW_Push SW1
U 1 1 60758741
P 5600 6050
F 0 "SW1" H 5600 6335 50  0000 C CNN
F 1 "SW_Push" H 5600 6244 50  0000 C CNN
F 2 "Button_Switch_SMD:SW_SPST_SKQG_WithStem" H 5600 6250 50  0001 C CNN
F 3 "~" H 5600 6250 50  0001 C CNN
	1    5600 6050
	1    0    0    -1  
$EndComp
$Comp
L power:+5V #PWR0106
U 1 1 6082E64C
P 200 4450
F 0 "#PWR0106" H 200 4300 50  0001 C CNN
F 1 "+5V" H 215 4623 50  0000 C CNN
F 2 "" H 200 4450 50  0001 C CNN
F 3 "" H 200 4450 50  0001 C CNN
	1    200  4450
	1    0    0    -1  
$EndComp
Text GLabel 1400 3950 0    50   Input ~ 0
XTAL1
Text GLabel 1400 4150 0    50   Input ~ 0
XTAL2
Text GLabel 700  1450 1    50   Input ~ 0
XTAL1
Text GLabel 1300 1450 1    50   Input ~ 0
XTAL2
Wire Wire Line
	700  1450 700  1800
Wire Wire Line
	1300 1450 1300 1800
Wire Wire Line
	700  2150 1000 2150
Wire Wire Line
	1000 2250 1000 2150
Connection ~ 1000 2150
Wire Wire Line
	1000 2150 1300 2150
Wire Wire Line
	1000 1900 1000 2000
Wire Wire Line
	1100 1800 1300 1800
Connection ~ 1300 1800
Wire Wire Line
	1300 1800 1300 1950
Wire Wire Line
	900  1800 700  1800
Connection ~ 700  1800
Wire Wire Line
	700  1800 700  1950
Wire Wire Line
	1000 1700 1000 1650
Wire Wire Line
	1000 1650 1150 1650
Wire Wire Line
	1150 1650 1150 2000
Wire Wire Line
	1150 2000 1000 2000
Connection ~ 1000 2000
Wire Wire Line
	1000 2000 1000 2150
$Comp
L Device:C_Small C8
U 1 1 609A3CBC
P -800 6350
F 0 "C8" H -708 6396 50  0000 L CNN
F 1 "0.1uF" H -708 6305 50  0000 L CNN
F 2 "Capacitor_SMD:C_0805_2012Metric_Pad1.18x1.45mm_HandSolder" H -800 6350 50  0001 C CNN
F 3 "~" H -800 6350 50  0001 C CNN
	1    -800 6350
	1    0    0    -1  
$EndComp
Wire Wire Line
	-500 6050 -800 6050
Wire Wire Line
	-800 6050 -800 6250
Connection ~ -500 6050
Wire Wire Line
	-800 6450 -800 6650
Wire Wire Line
	-800 6650 -500 6650
Connection ~ -500 6650
$Comp
L power:+5V #PWR0110
U 1 1 609C6534
P 4450 6400
F 0 "#PWR0110" H 4450 6250 50  0001 C CNN
F 1 "+5V" H 4465 6573 50  0000 C CNN
F 2 "" H 4450 6400 50  0001 C CNN
F 3 "" H 4450 6400 50  0001 C CNN
	1    4450 6400
	1    0    0    -1  
$EndComp
$Comp
L power:GND #PWR0114
U 1 1 609C6A62
P 4450 7550
F 0 "#PWR0114" H 4450 7300 50  0001 C CNN
F 1 "GND" H 4455 7377 50  0000 C CNN
F 2 "" H 4450 7550 50  0001 C CNN
F 3 "" H 4450 7550 50  0001 C CNN
	1    4450 7550
	1    0    0    -1  
$EndComp
Wire Wire Line
	4450 7550 4450 7450
Wire Wire Line
	4450 6550 4450 6400
Text GLabel 4950 7150 2    50   Input ~ 0
RESET
Text GLabel 4950 7050 2    50   Input ~ 0
SCK
Text GLabel 4950 6950 2    50   Input ~ 0
MOSI
Text GLabel 4950 6850 2    50   Input ~ 0
MISO
$Comp
L Connector:AVR-ISP-6 J1
U 1 1 609C5B6A
P 4550 7050
F 0 "J1" H 4221 7146 50  0000 R CNN
F 1 "AVR-ISP-6" H 4221 7055 50  0000 R CNN
F 2 "random-keyboard-parts:Reset_Pretty-Mask" V 4300 7100 50  0001 C CNN
F 3 " ~" H 3275 6500 50  0001 C CNN
	1    4550 7050
	1    0    0    -1  
$EndComp
Text GLabel 3000 3850 2    50   Input ~ 0
SCK
Text GLabel 3000 3950 2    50   Input ~ 0
MOSI
Text GLabel 3000 4050 2    50   Input ~ 0
MISO
Text GLabel 6450 6050 2    50   Input ~ 0
RESET
Wire Wire Line
	6450 6050 6100 6050
Wire Wire Line
	6100 5850 6100 6050
Connection ~ 6100 6050
Wire Wire Line
	6100 6050 5800 6050
Text GLabel 1400 3750 0    50   Input ~ 0
RESET
$Comp
L Type-C:HRO-TYPE-C-31-M-12 USB1
U 1 1 60A7AADF
P 8300 5300
F 0 "USB1" H 8133 6097 60  0000 C CNN
F 1 "HRO-TYPE-C-31-M-12" H 8133 5991 60  0000 C CNN
F 2 "Type-C:HRO-TYPE-C-31-M-12-HandSoldering" H 8300 5300 60  0001 C CNN
F 3 "" H 8300 5300 60  0001 C CNN
	1    8300 5300
	1    0    0    -1  
$EndComp
Text GLabel 10300 5350 2    50   Input ~ 0
D-
Text GLabel 10300 5450 2    50   Input ~ 0
D+
Wire Wire Line
	8400 5450 8650 5450
Wire Wire Line
	8400 5150 8750 5150
Wire Wire Line
	8750 5150 8750 5350
Wire Wire Line
	8750 5350 8400 5350
Wire Wire Line
	8400 5250 8650 5250
Wire Wire Line
	8650 5250 8650 5450
Wire Wire Line
	8400 4750 8500 4750
Wire Wire Line
	8500 4750 8500 5850
Wire Wire Line
	8400 5850 8500 5850
Connection ~ 8500 5850
Wire Wire Line
	8550 4850 8550 5750
Wire Wire Line
	8550 5750 8400 5750
Connection ~ 8550 4850
Wire Wire Line
	8550 4850 8650 4850
NoConn ~ 8400 5550
NoConn ~ 8400 4950
$Comp
L Device:R_Small R5
U 1 1 60B691B9
P 8900 5700
F 0 "R5" H 8959 5746 50  0000 L CNN
F 1 "5.1k" H 8959 5655 50  0000 L CNN
F 2 "Resistor_SMD:R_0805_2012Metric_Pad1.20x1.40mm_HandSolder" H 8900 5700 50  0001 C CNN
F 3 "~" H 8900 5700 50  0001 C CNN
	1    8900 5700
	1    0    0    -1  
$EndComp
$Comp
L Device:R_Small R6
U 1 1 60B6A6CB
P 9250 5700
F 0 "R6" H 9309 5746 50  0000 L CNN
F 1 "5.1k" H 9309 5655 50  0000 L CNN
F 2 "Resistor_SMD:R_0805_2012Metric_Pad1.20x1.40mm_HandSolder" H 9250 5700 50  0001 C CNN
F 3 "~" H 9250 5700 50  0001 C CNN
	1    9250 5700
	1    0    0    -1  
$EndComp
Wire Wire Line
	8750 5350 9550 5350
Connection ~ 8750 5350
Wire Wire Line
	8650 5450 10150 5450
Connection ~ 8650 5450
Wire Wire Line
	9250 5800 9250 5850
Wire Wire Line
	9250 5850 8900 5850
Wire Wire Line
	8900 5800 8900 5850
Connection ~ 8900 5850
Wire Wire Line
	8900 5850 8750 5850
Wire Wire Line
	8900 5600 8750 5600
Wire Wire Line
	8750 5600 8750 5650
Wire Wire Line
	8750 5650 8400 5650
Wire Wire Line
	9250 5600 9250 5050
Wire Wire Line
	9250 5050 8400 5050
$Comp
L random-keyboard-parts:PRTR5V0U2X U2
U 1 1 60BE1DAA
P 10100 6000
F 0 "U2" H 10100 5713 60  0000 C CNN
F 1 "PRTR5V0U2X" H 10100 5819 60  0000 C CNN
F 2 "random-keyboard-parts:SOT143B" H 10100 6000 60  0001 C CNN
F 3 "" H 10100 6000 60  0001 C CNN
	1    10100 6000
	-1   0    0    1   
$EndComp
Wire Wire Line
	9800 5950 9550 5950
Wire Wire Line
	9550 5950 9550 5350
Connection ~ 9550 5350
Wire Wire Line
	9550 5350 10300 5350
Wire Wire Line
	10400 5950 10500 5950
Wire Wire Line
	10500 5950 10500 5650
Wire Wire Line
	10500 5650 10150 5650
Wire Wire Line
	10150 5650 10150 5450
Connection ~ 10150 5450
Wire Wire Line
	10150 5450 10300 5450
Connection ~ 8750 5850
Wire Wire Line
	8750 5850 8500 5850
Wire Wire Line
	10400 6050 10500 6050
Wire Wire Line
	10500 6050 10500 6150
Wire Wire Line
	10500 6150 8750 6150
Connection ~ 8750 6150
Wire Wire Line
	8750 6150 8750 5850
$Comp
L power:VCC #PWR0116
U 1 1 60C6053B
P 9700 6050
F 0 "#PWR0116" H 9700 5900 50  0001 C CNN
F 1 "VCC" H 9715 6223 50  0000 C CNN
F 2 "" H 9700 6050 50  0001 C CNN
F 3 "" H 9700 6050 50  0001 C CNN
	1    9700 6050
	0    -1   -1   0   
$EndComp
Wire Wire Line
	9800 6050 9700 6050
Wire Wire Line
	3000 3850 2600 3850
Wire Wire Line
	2600 3950 3000 3950
Wire Wire Line
	3000 4050 2600 4050
NoConn ~ 2600 4450
NoConn ~ 2600 4950
NoConn ~ 1400 4350
NoConn ~ 2600 6350
NoConn ~ 2600 5450
NoConn ~ 2600 5550
NoConn ~ 2600 5650
$Comp
L power:PWR_FLAG #FLG0101
U 1 1 60D94F01
P 8650 4800
F 0 "#FLG0101" H 8650 4875 50  0001 C CNN
F 1 "PWR_FLAG" H 8650 4973 50  0000 C CNN
F 2 "" H 8650 4800 50  0001 C CNN
F 3 "~" H 8650 4800 50  0001 C CNN
	1    8650 4800
	1    0    0    -1  
$EndComp
Wire Wire Line
	8650 4800 8650 4850
Connection ~ 8650 4850
Wire Wire Line
	8650 4850 8800 4850
Wire Wire Line
	8450 6150 8450 5950
Wire Wire Line
	8450 5950 8400 5950
$Comp
L power:PWR_FLAG #FLG0103
U 1 1 60DB833C
P 9550 4800
F 0 "#FLG0103" H 9550 4875 50  0001 C CNN
F 1 "PWR_FLAG" H 9550 4973 50  0000 C CNN
F 2 "" H 9550 4800 50  0001 C CNN
F 3 "~" H 9550 4800 50  0001 C CNN
	1    9550 4800
	1    0    0    -1  
$EndComp
Wire Wire Line
	9550 4800 9550 4850
Connection ~ 9550 4850
Wire Wire Line
	9550 4850 9300 4850
Text GLabel 9350 5350 1    50   Input ~ 0
DN
Text GLabel 9350 5450 3    50   Input ~ 0
DP
$Comp
L Device:Ferrite_Bead_Small FB1
U 1 1 61268415
P 2500 1200
F 0 "FB1" V 2263 1200 50  0000 C CNN
F 1 "Ferrite_Bead_Small" V 2354 1200 50  0000 C CNN
F 2 "Inductor_SMD:L_0805_2012Metric_Pad1.15x1.40mm_HandSolder" V 2430 1200 50  0001 C CNN
F 3 "~" H 2500 1200 50  0001 C CNN
	1    2500 1200
	0    1    1    0   
$EndComp
$Comp
L power:Earth #PWR0117
U 1 1 612689B6
P 2200 1400
F 0 "#PWR0117" H 2200 1150 50  0001 C CNN
F 1 "Earth" H 2200 1250 50  0001 C CNN
F 2 "" H 2200 1400 50  0001 C CNN
F 3 "~" H 2200 1400 50  0001 C CNN
	1    2200 1400
	1    0    0    -1  
$EndComp
$Comp
L power:GND #PWR0118
U 1 1 6126A180
P 2800 1400
F 0 "#PWR0118" H 2800 1150 50  0001 C CNN
F 1 "GND" H 2805 1227 50  0000 C CNN
F 2 "" H 2800 1400 50  0001 C CNN
F 3 "" H 2800 1400 50  0001 C CNN
	1    2800 1400
	1    0    0    -1  
$EndComp
Wire Wire Line
	2400 1200 2200 1200
Wire Wire Line
	2200 1200 2200 1400
Wire Wire Line
	2600 1200 2800 1200
Wire Wire Line
	2800 1200 2800 1400
$Comp
L power:PWR_FLAG #FLG0104
U 1 1 6128F4A9
P 2200 1200
F 0 "#FLG0104" H 2200 1275 50  0001 C CNN
F 1 "PWR_FLAG" V 2200 1327 50  0000 L CNN
F 2 "" H 2200 1200 50  0001 C CNN
F 3 "~" H 2200 1200 50  0001 C CNN
	1    2200 1200
	0    -1   -1   0   
$EndComp
Connection ~ 2200 1200
$Comp
L power:PWR_FLAG #FLG0105
U 1 1 6128FFD9
P 2800 1200
F 0 "#FLG0105" H 2800 1275 50  0001 C CNN
F 1 "PWR_FLAG" V 2800 1328 50  0000 L CNN
F 2 "" H 2800 1200 50  0001 C CNN
F 3 "~" H 2800 1200 50  0001 C CNN
	1    2800 1200
	0    1    1    0   
$EndComp
Connection ~ 2800 1200
Wire Wire Line
	8750 6150 8750 6300
$Comp
L power:GND #PWR0115
U 1 1 612CE638
P 8750 6300
F 0 "#PWR0115" H 8750 6050 50  0001 C CNN
F 1 "GND" H 8755 6127 50  0000 C CNN
F 2 "" H 8750 6300 50  0001 C CNN
F 3 "" H 8750 6300 50  0001 C CNN
	1    8750 6300
	1    0    0    -1  
$EndComp
$Comp
L power:Earth #PWR0119
U 1 1 612CF5C5
P 8450 6150
F 0 "#PWR0119" H 8450 5900 50  0001 C CNN
F 1 "Earth" H 8450 6000 50  0001 C CNN
F 2 "" H 8450 6150 50  0001 C CNN
F 3 "~" H 8450 6150 50  0001 C CNN
	1    8450 6150
	1    0    0    -1  
$EndComp
$EndSCHEMATC
