/home/sid/Desktop/spam-code/txtFiles/protein-folding-txtFiles/1CKK.txt
1406 -17857.8 -11218.9
2812 -17145.7 -11583.6
4218 -16580.4 -11817.6
5624 -16118.3 -12052.1
7030 -15749.3 -12053.5
8436 -15452.4 -12167.6
9842 -15210.6 -12203.8
11248 -15007.4 -12324.2
12654 -14845.3 -12436.3
14060 -14705.9 -12436.3
15466 -14589.2 -12436.3
16872 -14482.8 -12445.1
18278 -14382.6 -12447.4
19684 -14290.3 -12447.5
21090 -14204.8 -12447.5
22496 -14125.2 -12447.5
23902 -14051 -12468
25308 -13981.3 -12468
26714 -13916.1 -12489.8
28120 -13854.8 -12489.8
29526 -13798.5 -12489.8
30932 -13748.5 -12505.4
32338 -13702.8 -12506.7
33744 -13660.8 -12507.2
35150 -13624.7 -12507.2
36556 -13592 -12507.2
37962 -13564.2 -12507.2
39368 -13538 -12507.2
40774 -13512.9 -12507.2
42180 -13488.9 -12507.2
43586 -13466.1 -12507.2
44992 -13444.6 -12522.6
46398 -13425.1 -12534.2
47804 -13407.5 -12534.2
49210 -13390.9 -12534.3
50616 -13375.2 -12546.1
52022 -13360.6 -12546.1
53428 -13347 -12546.2
54834 -13334 -12546.2
56240 -13321.5 -12546.2
57646 -13310.5 -12546.2
59052 -13300.5 -12546.1
60458 -13290.9 -12546.1
61864 -13281.8 -12546.2
63270 -13272.9 -12546.2
64676 -13264.4 -12546.1
66082 -13256.2 -12546.2
67488 -13248.8 -12546.2
68894 -13241.7 -12546.1
70300 -13234.9 -12546.2
71706 -13228.8 -12546.1
73112 -13222.9 -12546.2
74518 -13217.1 -12546.2
75924 -13211.5 -12546.2
77330 -13206.1 -12546.2
78736 -13200.8 -12546.2
80142 -13196.2 -12546.2
81548 -13191.8 -12546.2
82954 -13187.8 -12546.1
84360 -13183.8 -12546.1
85766 -13180 -12546.2
87172 -13176.3 -12546.2
88578 -13172.6 -12546.2
89984 -13169 -12546.1
91390 -13165.4 -12546.2
92796 -13162 -12546.1
94202 -13158.6 -12546.2
95608 -13155.2 -12546.2
97014 -13151.9 -12546.1
98420 -13148.7 -12550.4
99826 -13145.5 -12550.4
101232 -13142.4 -12550.4
102638 -13139.3 -12550.4
104044 -13136.3 -12550.4
105450 -13133.4 -12550.4
106856 -13130.5 -12550.4
108262 -13127.6 -12550.4
109668 -13124.8 -12550.4
111074 -13122.1 -12550.4
112480 -13119.4 -12550.4
113886 -13116.7 -12550.4
115292 -13114.1 -12550.4
116698 -13111.7 -12550.4
118104 -13109.3 -12550.4
119510 -13106.9 -12550.4
120916 -13104.7 -12550.4
122322 -13102.4 -12550.4
123728 -13100.3 -12550.4
125134 -13098.2 -12550.4
126540 -13096.4 -12550.4
127946 -13094.8 -12550.4
129352 -13093.2 -12550.4
130758 -13091.7 -12550.4
132164 -13090.2 -12550.4
133570 -13088.7 -12550.4
134976 -13087.3 -12550.4
136382 -13085.8 -12550.4
137788 -13084.4 -12550.4
139194 -13083 -12550.4
140600 -13081.6 -12550.4
142006 -13080.3 -12550.4
143412 -13078.9 -12550.4
144818 -13077.6 -12550.4
146224 -13076.2 -12550.4
147630 -13074.9 -12550.4
149036 -13073.6 -12550.5
150442 -13072.4 -12550.4
151848 -13071.1 -12550.4
153254 -13069.9 -12550.4
154660 -13068.6 -12550.4
156066 -13067.4 -12550.4
157472 -13066.3 -12550.4
158878 -13065.1 -12550.4
160284 -13064 -12550.4
161690 -13062.9 -12550.5
163096 -13061.9 -12550.4
164502 -13060.8 -12550.4
165908 -13059.8 -12550.4
167314 -13058.8 -12550.4
168720 -13057.8 -12550.4
170126 -13056.8 -12550.4
171532 -13055.8 -12550.5
172938 -13054.8 -12550.4
174344 -13053.9 -12550.5
175750 -13052.9 -12550.4
177156 -13052 -12550.4
178562 -13051 -12550.4
179968 -13050.1 -12550.4
181374 -13049.2 -12550.4
182780 -13048.3 -12550.4
184186 -13047.4 -12550.4
185592 -13046.5 -12550.4
186998 -13045.7 -12550.4
188404 -13044.8 -12550.4
189810 -13043.9 -12550.4
191216 -13043.1 -12550.4
192622 -13042.2 -12550.4
194028 -13041.4 -12550.4
195434 -13040.6 -12550.4
196840 -13039.8 -12550.4
198246 -13038.9 -12550.4
199652 -13038.1 -12550.4
201058 -13037.3 -12550.4
202464 -13036.5 -12550.4
203870 -13035.7 -12550.4
205276 -13034.9 -12550.4
206682 -13034.2 -12550.5
208088 -13033.4 -12550.4
209494 -13032.6 -12550.4
210900 -13031.8 -12550.4
212306 -13031.1 -12550.4
213712 -13030.3 -12550.4
215118 -13029.6 -12550.4
216524 -13028.8 -12550.4
217930 -13028.1 -12550.4
219336 -13027.4 -12550.4
220742 -13026.6 -12628.7
222148 -13025.9 -12631.6
223554 -13025.2 -12631.6
224960 -13024.5 -12631.6
226366 -13023.8 -12631.6
227772 -13023 -12631.6
229178 -13022.4 -12631.6
230584 -13021.7 -12631.6
231990 -13021 -12631.6
233396 -13020.3 -12631.6
234802 -13019.6 -12631.6
236208 -13018.9 -12631.6
237614 -13018.2 -12631.6
239020 -13017.6 -12631.6
240426 -13016.9 -12631.6
241832 -13016.2 -12631.6
243238 -13015.6 -12631.6
244644 -13015 -12631.6
246050 -13014.4 -12631.6
247456 -13013.8 -12631.6
248862 -13013.2 -12631.6
250268 -13012.6 -12631.6
251674 -13012 -12631.6
253080 -13011.4 -12631.6
254486 -13010.8 -12631.6
255892 -13010.2 -12631.6
257298 -13009.6 -12631.7
258704 -13009 -12631.6
260110 -13008.4 -12631.6
261516 -13007.8 -12631.6
262922 -13007.2 -12631.6
264328 -13006.6 -12631.6
265734 -13006 -12631.6
267140 -13005.4 -12631.6
268546 -13004.9 -12631.6
269952 -13004.3 -12631.6
271358 -13003.7 -12631.6
272764 -13003.1 -12631.6
274170 -13002.5 -12631.6
275576 -13002 -12631.7
276982 -13001.4 -12631.6
278388 -13000.8 -12631.6
279794 -13000.2 -12631.6
281200 -12999.7 -12631.6
282606 -12999.1 -12631.7
284012 -12998.5 -12631.7
285418 -12998 -12631.6
286824 -12997.4 -12631.6
288230 -12996.8 -12631.7
289636 -12996.3 -12631.6
291042 -12995.7 -12631.6
292448 -12995.1 -12631.6
293854 -12994.6 -12631.6
295260 -12994 -12631.6
296666 -12993.5 -12631.6
298072 -12992.9 -12631.6
299478 -12992.3 -12631.6
300884 -12991.8 -12631.6
302290 -12991.2 -12631.6
303696 -12990.7 -12631.6
305102 -12990.1 -12631.7
306508 -12989.6 -12631.6
307914 -12989 -12631.6
309320 -12988.5 -12631.6
310726 -12987.9 -12631.6
312132 -12987.4 -12631.6
313538 -12986.9 -12631.6
314944 -12986.3 -12631.6
316350 -12985.8 -12631.6
317756 -12985.2 -12631.6
319162 -12984.7 -12631.6
320568 -12984.1 -12631.6
321974 -12983.6 -12631.6
323380 -12983.1 -12631.6
324786 -12982.5 -12631.6
326192 -12982 -12631.6
327598 -12981.5 -12631.6
329004 -12980.9 -12631.6
330410 -12980.4 -12631.6
331816 -12979.9 -12631.6
333222 -12979.4 -12631.6
334628 -12978.8 -12631.6
336034 -12978.3 -12631.6
337440 -12977.8 -12631.6
338846 -12977.3 -12631.6
340252 -12976.7 -12631.6
341658 -12976.2 -12631.6
343064 -12975.7 -12631.6
344470 -12975.2 -12631.6
345876 -12974.7 -12631.6
347282 -12974.1 -12631.6
348688 -12973.6 -12631.6
350094 -12973.1 -12631.6
351500 -12972.6 -12631.6
352906 -12972.1 -12631.6
354312 -12971.6 -12631.6
355718 -12971.1 -12631.6
357124 -12970.5 -12631.6
358530 -12970 -12631.6
359936 -12969.5 -12631.6
361342 -12969 -12631.6
362748 -12968.5 -12631.6
364154 -12968 -12631.6
365560 -12967.5 -12631.6
366966 -12967 -12631.6
368372 -12966.6 -12631.6
369778 -12966.1 -12631.6
371184 -12965.6 -12631.6
372590 -12965.1 -12631.6
373996 -12964.6 -12631.6
375402 -12964.2 -12631.6
376808 -12963.7 -12631.6
378214 -12963.2 -12631.6
379620 -12962.7 -12631.6
381026 -12962.3 -12631.6
382432 -12961.8 -12631.6
383838 -12961.4 -12631.6
385244 -12960.9 -12631.6
386650 -12960.5 -12631.6
388056 -12960 -12631.6
389462 -12959.6 -12631.6
390868 -12959.1 -12631.6
392274 -12958.7 -12631.6
393680 -12958.2 -12631.6
395086 -12957.8 -12631.6
396492 -12957.4 -12631.6
397898 -12956.9 -12631.6
399304 -12956.5 -12631.6
400710 -12956.1 -12631.6
402116 -12955.6 -12631.6
403522 -12955.2 -12631.6
404928 -12954.8 -12631.6
406334 -12954.4 -12631.6
407740 -12954 -12631.6
409146 -12953.6 -12631.6
410552 -12953.1 -12631.6
411958 -12952.7 -12631.6
413364 -12952.3 -12631.6
414770 -12951.9 -12631.6
416176 -12951.5 -12631.6
417582 -12951.1 -12631.6
418988 -12950.8 -12631.6
420394 -12950.4 -12631.6
421800 -12950 -12631.6
/home/sid/Desktop/spam-code/txtFiles/protein-folding-txtFiles/1CM1.txt
1332 -17757.3 -11054.4
2664 -17064.1 -11698
3996 -16525.9 -12076.9
5328 -16069.7 -12244.4
6660 -15692.7 -12244.4
7992 -15375.5 -12399
9324 -15110.9 -12399
10656 -14888.3 -12399
11988 -14706.3 -12399
13320 -14545 -12399
14652 -14402 -12399
15984 -14276.3 -12399
17316 -14172.3 -12399
18648 -14080.8 -12399
19980 -14001.4 -12399
21312 -13928.3 -12400
22644 -13865.2 -12400
23976 -13808.4 -12400
25308 -13754.6 -12400
26640 -13704.6 -12399.9
27972 -13658.9 -12400
29304 -13615.4 -12400
30636 -13574.1 -12400
31968 -13534.7 -12400
33300 -13497.1 -12400
34632 -13463.2 -12453
35964 -13432.6 -12457.7
37296 -13405 -12457.7
38628 -13379.9 -12457.8
39960 -13355.6 -12465.4
41292 -13332.1 -12465.5
42624 -13309.5 -12465.5
43956 -13287.7 -12465.5
45288 -13266.9 -12465.5
46620 -13247.1 -12465.4
47952 -13229 -12465.5
49284 -13211.4 -12465.4
50616 -13194.2 -12465.4
51948 -13177.4 -12465.5
53280 -13161.1 -12465.5
54612 -13145.2 -12465.4
55944 -13130 -12465.4
57276 -13115.6 -12465.5
58608 -13102.4 -12465.4
59940 -13089.4 -12465.5
61272 -13076.8 -12465.5
62604 -13064.6 -12465.5
63936 -13052.8 -12465.4
65268 -13041.4 -12465.4
66600 -13030.3 -12465.4
67932 -13019.6 -12465.4
69264 -13009.1 -12465.4
70596 -12999 -12467.5
71928 -12989.2 -12467.6
73260 -12979.6 -12467.5
74592 -12970.5 -12467.6
75924 -12961.6 -12467.5
77256 -12952.9 -12467.6
78588 -12944.5 -12467.5
79920 -12936.7 -12467.6
81252 -12929.1 -12467.5
82584 -12921.8 -12467.6
83916 -12914.5 -12467.6
85248 -12907.3 -12467.6
86580 -12900.1 -12467.5
87912 -12893.3 -12467.6
89244 -12886.7 -12467.6
90576 -12880.1 -12467.6
91908 -12873.6 -12467.6
93240 -12867.2 -12467.6
94572 -12860.9 -12467.6
95904 -12854.7 -12467.5
97236 -12848.6 -12467.6
98568 -12842.7 -12467.6
99900 -12836.8 -12467.6
101232 -12831.1 -12467.6
102564 -12825.4 -12467.6
103896 -12819.9 -12467.6
105228 -12814.6 -12467.6
106560 -12810.3 -12467.6
107892 -12806.1 -12467.6
109224 -12801.9 -12467.6
110556 -12797.8 -12467.6
111888 -12793.7 -12467.6
113220 -12789.7 -12467.6
114552 -12785.7 -12467.6
115884 -12781.8 -12467.5
117216 -12777.9 -12467.6
118548 -12774.1 -12467.6
119880 -12770.3 -12467.5
121212 -12766.6 -12467.6
122544 -12762.8 -12467.6
123876 -12759.2 -12467.6
125208 -12755.7 -12467.6
126540 -12752.1 -12467.6
127872 -12748.6 -12467.6
129204 -12745.2 -12467.6
130536 -12741.8 -12467.6
131868 -12738.4 -12467.6
133200 -12735.1 -12467.6
134532 -12731.8 -12467.6
135864 -12728.5 -12467.6
137196 -12725.3 -12467.6
138528 -12722.2 -12467.6
139860 -12719 -12467.6
141192 -12715.9 -12467.5
142524 -12712.9 -12467.6
143856 -12709.9 -12467.5
145188 -12706.9 -12467.6
146520 -12704 -12467.6
147852 -12701.1 -12467.6
149184 -12698.2 -12467.6
150516 -12695.4 -12467.6
151848 -12692.7 -12467.6
153180 -12689.9 -12467.6
154512 -12687.3 -12467.6
155844 -12684.8 -12467.6
157176 -12682.4 -12467.6
158508 -12680.2 -12467.6
159840 -12678.1 -12467.6
161172 -12675.9 -12467.6
162504 -12673.7 -12467.6
163836 -12671.6 -12467.6
165168 -12669.4 -12467.6
166500 -12667.3 -12467.6
167832 -12665.2 -12467.6
169164 -12663.1 -12467.6
170496 -12661.1 -12467.6
171828 -12659 -12467.6
173160 -12657 -12467.6
174492 -12655 -12467.6
175824 -12653 -12467.6
177156 -12651.1 -12467.6
178488 -12649.2 -12467.6
179820 -12647.3 -12467.6
181152 -12645.5 -12467.6
182484 -12643.7 -12467.6
183816 -12641.9 -12467.6
185148 -12640.1 -12467.6
186480 -12638.4 -12467.6
187812 -12636.7 -12467.6
189144 -12635 -12467.6
190476 -12633.4 -12467.6
191808 -12631.8 -12467.6
193140 -12630.2 -12467.6
194472 -12628.6 -12467.6
195804 -12627.1 -12467.6
197136 -12625.6 -12467.6
198468 -12624.1 -12467.6
199800 -12622.7 -12467.6
201132 -12621.2 -12467.6
202464 -12619.8 -12467.6
203796 -12618.4 -12467.6
205128 -12617.1 -12467.6
206460 -12615.7 -12467.6
207792 -12614.4 -12467.6
209124 -12613.1 -12467.6
210456 -12611.9 -12467.6
211788 -12610.8 -12467.6
213120 -12609.8 -12467.6
214452 -12608.7 -12467.6
215784 -12607.7 -12467.6
217116 -12606.6 -12467.6
218448 -12605.6 -12467.6
219780 -12604.6 -12467.6
221112 -12603.6 -12467.6
222444 -12602.7 -12467.6
223776 -12601.7 -12467.6
225108 -12600.8 -12467.6
226440 -12599.9 -12467.6
227772 -12599 -12467.6
229104 -12598.2 -12467.6
230436 -12597.3 -12467.6
231768 -12596.5 -12467.6
233100 -12595.7 -12467.6
234432 -12594.8 -12467.6
235764 -12594 -12467.6
237096 -12593.2 -12467.6
238428 -12592.5 -12467.6
239760 -12591.7 -12467.6
241092 -12591 -12467.6
242424 -12590.2 -12467.6
243756 -12589.5 -12467.6
245088 -12588.8 -12467.6
246420 -12588.1 -12467.6
247752 -12587.5 -12467.6
249084 -12586.8 -12467.6
250416 -12586.1 -12467.6
251748 -12585.5 -12467.6
253080 -12584.8 -12467.6
254412 -12584.2 -12467.6
255744 -12583.5 -12467.6
257076 -12582.9 -12467.6
258408 -12582.3 -12467.6
259740 -12581.6 -12467.6
261072 -12581 -12467.6
262404 -12580.4 -12467.6
263736 -12579.8 -12467.6
265068 -12579.2 -12467.6
266400 -12578.6 -12467.6
267732 -12578 -12467.6
269064 -12577.5 -12467.6
270396 -12576.9 -12467.6
271728 -12576.3 -12467.6
273060 -12575.8 -12467.6
274392 -12575.2 -12467.6
275724 -12574.7 -12467.6
277056 -12574.1 -12467.6
278388 -12573.6 -12467.6
279720 -12573 -12467.6
281052 -12572.5 -12467.6
282384 -12572 -12467.6
283716 -12571.4 -12467.6
285048 -12570.9 -12467.6
286380 -12570.4 -12467.6
287712 -12569.9 -12467.6
289044 -12569.4 -12467.6
290376 -12568.8 -12467.6
291708 -12568.3 -12467.6
293040 -12567.8 -12467.6
294372 -12567.3 -12467.6
295704 -12566.8 -12467.6
297036 -12566.4 -12467.6
298368 -12565.9 -12467.6
299700 -12565.4 -12467.6
301032 -12564.9 -12467.6
302364 -12564.4 -12467.6
303696 -12564 -12467.6
305028 -12563.5 -12467.6
306360 -12563 -12467.6
307692 -12562.6 -12467.6
309024 -12562.1 -12467.6
310356 -12561.7 -12467.6
311688 -12561.2 -12467.6
313020 -12560.7 -12467.6
314352 -12560.3 -12467.6
315684 -12559.8 -12467.6
317016 -12559.4 -12467.6
318348 -12559 -12467.6
319680 -12558.5 -12467.6
321012 -12558.1 -12467.6
322344 -12557.7 -12467.6
323676 -12557.2 -12467.6
325008 -12556.8 -12467.6
326340 -12556.4 -12467.6
327672 -12556 -12467.6
329004 -12555.5 -12467.6
330336 -12555.1 -12467.6
331668 -12554.7 -12467.6
333000 -12554.3 -12467.6
334332 -12553.9 -12467.6
335664 -12553.5 -12467.6
336996 -12553.1 -12467.6
338328 -12552.7 -12467.6
339660 -12552.4 -12467.6
340992 -12552 -12467.6
342324 -12551.6 -12467.6
343656 -12551.3 -12467.6
344988 -12550.9 -12467.6
346320 -12550.6 -12467.6
347652 -12550.2 -12467.6
348984 -12549.9 -12467.6
350316 -12549.5 -12467.6
351648 -12549.2 -12467.6
352980 -12548.8 -12467.6
354312 -12548.5 -12467.6
355644 -12548.1 -12467.6
356976 -12547.8 -12467.6
358308 -12547.4 -12467.6
359640 -12547.1 -12467.6
360972 -12546.7 -12467.6
362304 -12546.4 -12467.6
363636 -12546.1 -12467.6
364968 -12545.7 -12467.6
366300 -12545.4 -12467.6
367632 -12545.1 -12467.6
368964 -12544.7 -12467.6
370296 -12544.4 -12467.6
371628 -12544.1 -12467.6
372960 -12543.8 -12467.6
374292 -12543.5 -12467.6
375624 -12543.1 -12467.6
376956 -12542.8 -12467.6
378288 -12542.5 -12467.6
379620 -12542.2 -12467.6
380952 -12541.9 -12467.6
382284 -12541.6 -12467.6
383616 -12541.3 -12467.6
384948 -12541 -12467.6
386280 -12540.7 -12467.6
387612 -12540.5 -12467.6
388944 -12540.2 -12467.6
390276 -12539.9 -12467.6
391608 -12539.6 -12467.6
392940 -12539.3 -12467.6
394272 -12539 -12467.6
395604 -12538.7 -12467.6
396936 -12538.5 -12467.6
398268 -12538.2 -12467.6
399600 -12537.9 -12467.6
/home/sid/Desktop/spam-code/txtFiles/protein-folding-txtFiles/1SY9.txt
1056 -12475.7 -8625.26
2112 -12026.9 -8625.26
3168 -11675.3 -8625.26
4224 -11387.4 -8810
5280 -11143.3 -8934.47
6336 -10939.5 -8934.45
7392 -10767.5 -9137.32
8448 -10627.2 -9137.32
9504 -10506.2 -9149.52
10560 -10403 -9149.5
11616 -10313.1 -9149.51
12672 -10233.2 -9149.51
13728 -10164.4 -9149.5
14784 -10102.3 -9149.51
15840 -10045.6 -9149.49
16896 -9992.47 -9149.48
17952 -9943.82 -9149.5
19008 -9899.8 -9149.51
20064 -9859.13 -9149.51
21120 -9822.34 -9149.51
22176 -9790.01 -9149.5
23232 -9762.25 -9149.49
24288 -9736.3 -9149.48
25344 -9712.19 -9149.5
26400 -9689.96 -9149.49
27456 -9668.86 -9149.52
28512 -9650.18 -9149.49
29568 -9632.68 -9149.52
30624 -9616.1 -9149.52
31680 -9600.39 -9149.53
32736 -9588.16 -9149.54
33792 -9576.47 -9149.48
34848 -9565.53 -9149.51
35904 -9555.08 -9149.49
36960 -9544.96 -9149.52
38016 -9535.13 -9149.49
39072 -9526.27 -9149.51
40128 -9517.84 -9149.51
41184 -9509.62 -9149.5
42240 -9501.66 -9149.49
43296 -9494.25 -9149.47
44352 -9487.6 -9149.47
45408 -9481.08 -9149.49
46464 -9474.67 -9149.49
47520 -9468.39 -9149.5
48576 -9462.23 -9149.5
49632 -9456.21 -9149.51
50688 -9450.36 -9149.49
51744 -9444.83 -9149.5
52800 -9439.62 -9149.48
53856 -9434.53 -9149.47
54912 -9429.54 -9149.5
55968 -9425.08 -9149.47
57024 -9420.78 -9149.47
58080 -9416.7 -9149.5
59136 -9412.74 -9149.48
60192 -9408.78 -9149.49
61248 -9404.84 -9149.47
62304 -9400.91 -9149.49
63360 -9397.27 -9149.46
64416 -9393.75 -9149.49
65472 -9390.23 -9149.5
66528 -9386.75 -9149.49
67584 -9383.33 -9149.49
68640 -9379.93 -9149.48
69696 -9376.56 -9149.49
70752 -9373.22 -9149.49
71808 -9369.91 -9149.49
72864 -9366.63 -9149.48
73920 -9363.43 -9149.49
74976 -9360.39 -9149.47
76032 -9357.45 -9149.5
77088 -9354.53 -9149.5
78144 -9351.62 -9149.48
79200 -9348.74 -9149.51
80256 -9345.89 -9149.48
81312 -9343.27 -9149.51
82368 -9341.04 -9149.5
83424 -9338.87 -9149.49
84480 -9336.76 -9149.48
85536 -9334.66 -9149.51
86592 -9332.59 -9149.47
87648 -9330.57 -9149.48
88704 -9329.1 -9149.48
89760 -9327.85 -9149.5
90816 -9326.62 -9149.48
91872 -9325.43 -9149.49
92928 -9324.32 -9149.47
93984 -9323.21 -9149.48
95040 -9322.1 -9149.5
96096 -9321 -9149.49
97152 -9319.91 -9149.48
98208 -9318.83 -9149.44
99264 -9317.75 -9149.49
100320 -9316.69 -9149.46
101376 -9315.64 -9149.46
102432 -9314.6 -9149.49
103488 -9313.63 -9149.46
104544 -9312.69 -9149.46
105600 -9311.77 -9149.48
106656 -9310.86 -9149.45
107712 -9309.97 -9149.47
108768 -9309.09 -9149.52
109824 -9308.21 -9149.5
110880 -9307.35 -9149.49
111936 -9306.53 -9149.51
112992 -9305.76 -9149.51
114048 -9304.99 -9149.49
115104 -9304.23 -9149.49
116160 -9303.47 -9149.5
117216 -9302.73 -9149.5
118272 -9302 -9149.51
119328 -9301.27 -9175.95
120384 -9300.58 -9175.95
121440 -9299.93 -9175.98
122496 -9299.27 -9175.97
123552 -9298.61 -9175.94
124608 -9298 -9175.98
125664 -9297.38 -9175.96
126720 -9296.77 -9175.96
127776 -9296.17 -9175.98
128832 -9295.56 -9175.96
129888 -9294.95 -9175.98
130944 -9294.36 -9175.95
132000 -9293.76 -9175.96
133056 -9293.17 -9175.96
134112 -9292.57 -9175.99
135168 -9291.99 -9175.97
136224 -9291.41 -9175.99
137280 -9290.83 -9175.95
138336 -9290.25 -9175.96
139392 -9289.68 -9175.98
140448 -9289.11 -9175.97
141504 -9288.57 -9175.96
142560 -9288.05 -9175.98
143616 -9287.53 -9175.97
144672 -9287.02 -9175.99
145728 -9286.5 -9175.98
146784 -9285.97 -9175.99
147840 -9285.49 -9175.99
148896 -9285.01 -9176
149952 -9284.54 -9176
151008 -9284.06 -9175.98
152064 -9283.58 -9175.95
153120 -9283.11 -9176
154176 -9282.68 -9175.99
155232 -9282.24 -9175.99
156288 -9281.8 -9175.97
157344 -9281.37 -9175.96
158400 -9280.94 -9175.98
159456 -9280.5 -9175.97
160512 -9280.07 -9175.97
161568 -9279.64 -9175.98
162624 -9279.21 -9175.99
163680 -9278.78 -9175.99
164736 -9278.35 -9175.99
165792 -9277.92 -9175.99
166848 -9277.5 -9176
167904 -9277.08 -9175.99
168960 -9276.65 -9175.99
170016 -9276.22 -9175.98
171072 -9275.8 -9175.98
172128 -9275.38 -9175.97
173184 -9274.96 -9175.96
174240 -9274.54 -9175.99
175296 -9274.13 -9176
176352 -9273.71 -9176
177408 -9273.3 -9176
178464 -9272.89 -9175.98
179520 -9272.48 -9175.99
180576 -9272.07 -9176.02
181632 -9271.65 -9175.99
182688 -9271.24 -9175.98
183744 -9270.84 -9176
184800 -9270.43 -9176
185856 -9270.03 -9176
186912 -9269.63 -9175.97
187968 -9269.23 -9176
189024 -9268.83 -9176
190080 -9268.43 -9175.97
191136 -9268.05 -9175.96
192192 -9267.67 -9175.95
193248 -9267.28 -9175.96
194304 -9266.91 -9175.97
195360 -9266.52 -9176.01
196416 -9266.15 -9175.96
197472 -9265.77 -9175.96
198528 -9265.4 -9175.97
199584 -9265.02 -9175.99
200640 -9264.65 -9175.96
201696 -9264.28 -9175.98
202752 -9263.91 -9175.98
203808 -9263.54 -9175.99
204864 -9263.17 -9175.95
205920 -9262.81 -9175.99
206976 -9262.45 -9175.95
208032 -9262.08 -9175.97
209088 -9261.72 -9176
210144 -9261.37 -9175.97
211200 -9261 -9175.98
212256 -9260.65 -9175.95
213312 -9260.29 -9175.97
214368 -9259.94 -9175.95
215424 -9259.59 -9175.97
216480 -9259.24 -9175.95
217536 -9258.89 -9175.97
218592 -9258.54 -9175.97
219648 -9258.19 -9175.95
220704 -9257.85 -9175.98
221760 -9257.5 -9175.98
222816 -9257.16 -9175.99
223872 -9256.82 -9175.97
224928 -9256.48 -9175.97
225984 -9256.14 -9175.97
227040 -9255.79 -9175.97
228096 -9255.46 -9175.97
229152 -9255.12 -9175.96
230208 -9254.79 -9175.97
231264 -9254.46 -9175.98
232320 -9254.12 -9175.98
233376 -9253.79 -9175.96
234432 -9253.46 -9175.98
235488 -9253.13 -9175.99
236544 -9252.8 -9175.99
237600 -9252.47 -9175.95
238656 -9252.15 -9175.98
239712 -9251.83 -9175.96
240768 -9251.5 -9175.94
241824 -9251.18 -9175.97
242880 -9250.87 -9175.98
243936 -9250.55 -9175.98
244992 -9250.24 -9175.97
246048 -9249.92 -9175.99
247104 -9249.61 -9175.99
248160 -9249.3 -9175.99
249216 -9248.99 -9175.98
250272 -9248.68 -9175.98
251328 -9248.37 -9175.98
252384 -9248.06 -9175.99
253440 -9247.76 -9175.98
254496 -9247.46 -9175.99
255552 -9247.16 -9175.98
256608 -9246.86 -9176
257664 -9246.56 -9175.98
258720 -9246.27 -9175.98
259776 -9245.97 -9175.98
260832 -9245.67 -9175.99
261888 -9245.37 -9175.98
262944 -9245.07 -9175.98
264000 -9244.78 -9176
265056 -9244.48 -9175.99
266112 -9244.19 -9175.99
267168 -9243.89 -9176.01
268224 -9243.6 -9176
269280 -9243.3 -9176
270336 -9243.01 -9175.99
271392 -9242.72 -9175.99
272448 -9242.43 -9175.99
273504 -9242.14 -9176
274560 -9241.86 -9176.02
275616 -9241.57 -9176.01
276672 -9241.28 -9176
277728 -9241 -9176
278784 -9240.72 -9176
279840 -9240.43 -9175.99
280896 -9240.15 -9175.99
281952 -9239.87 -9175.99
283008 -9239.58 -9176
284064 -9239.3 -9175.99
285120 -9239.03 -9176
286176 -9238.75 -9175.98
287232 -9238.47 -9175.99
288288 -9238.2 -9175.98
289344 -9237.93 -9176
290400 -9237.67 -9175.99
291456 -9237.41 -9176.02
292512 -9237.17 -9175.99
293568 -9236.93 -9176.01
294624 -9236.71 -9176
295680 -9236.49 -9175.98
296736 -9236.26 -9175.99
297792 -9236.05 -9175.98
298848 -9235.83 -9175.99
299904 -9235.62 -9175.99
300960 -9235.42 -9175.98
302016 -9235.21 -9176
303072 -9235.01 -9176.01
304128 -9234.82 -9176.01
305184 -9234.62 -9176
306240 -9234.42 -9175.99
307296 -9234.24 -9176.01
308352 -9234.06 -9176.01
309408 -9233.87 -9176.01
310464 -9233.69 -9176
311520 -9233.52 -9176.02
312576 -9233.34 -9175.98
313632 -9233.17 -9175.99
314688 -9233 -9176
315744 -9232.83 -9176
316800 -9232.67 -9175.99
/home/sid/Desktop/spam-code/txtFiles/protein-folding-txtFiles/2BBN.txt
1332 -17262.1 -10625.5
2664 -16578.1 -11065.5
3996 -16104.7 -11405.7
5328 -15718.8 -11573
6660 -15404.8 -11906.8
7992 -15137.6 -11964.5
9324 -14898.5 -12103.1
10656 -14685.2 -12103.2
11988 -14494 -12106.4
13320 -14323 -12129.5
14652 -14175.7 -12142
15984 -14051.3 -12142
17316 -13942.3 -12142
18648 -13844.3 -12142
19980 -13763.4 -12142
21312 -13689.5 -12142
22644 -13626.3 -12142
23976 -13573.2 -12142.4
25308 -13525.4 -12142.4
26640 -13484 -12142.4
27972 -13446.7 -12143.2
29304 -13413.1 -12143.2
30636 -13381 -12143.2
31968 -13351.5 -12143.2
33300 -13323.4 -12143.2
34632 -13296.4 -12143.2
35964 -13270.7 -12268.7
37296 -13247.2 -12268.7
38628 -13225.7 -12268.7
39960 -13205.4 -12268.7
41292 -13186.2 -12268.7
42624 -13167.8 -12268.7
43956 -13149.7 -12268.7
45288 -13132.1 -12268.7
46620 -13115 -12268.7
47952 -13098.4 -12268.7
49284 -13082.5 -12268.7
50616 -13067.2 -12268.7
51948 -13052.6 -12268.7
53280 -13038.5 -12268.7
54612 -13025 -12268.7
55944 -13012 -12268.7
57276 -12999.3 -12268.7
58608 -12987.1 -12268.7
59940 -12975.3 -12268.7
61272 -12963.7 -12268.7
62604 -12952.8 -12268.7
63936 -12942.3 -12268.7
65268 -12932.3 -12268.7
66600 -12922.4 -12268.7
67932 -12912.9 -12268.7
69264 -12904.4 -12268.7
70596 -12896.3 -12268.7
71928 -12888.3 -12268.7
73260 -12880.4 -12268.7
74592 -12872.7 -12268.7
75924 -12865.1 -12268.7
77256 -12857.7 -12268.7
78588 -12850.3 -12268.7
79920 -12843 -12268.7
81252 -12836.1 -12268.7
82584 -12829.2 -12268.7
83916 -12822.5 -12268.7
85248 -12815.8 -12268.8
86580 -12809.8 -12268.7
87912 -12804 -12268.7
89244 -12798.3 -12268.7
90576 -12792.6 -12268.7
91908 -12787 -12268.7
93240 -12781.5 -12268.7
94572 -12776.1 -12268.7
95904 -12770.8 -12268.7
97236 -12765.7 -12268.7
98568 -12760.5 -12268.7
99900 -12755.5 -12268.7
101232 -12750.5 -12268.7
102564 -12745.6 -12268.7
103896 -12741.1 -12268.7
105228 -12737 -12268.7
106560 -12732.9 -12268.7
107892 -12728.8 -12268.7
109224 -12724.7 -12268.7
110556 -12720.7 -12268.7
111888 -12716.8 -12268.7
113220 -12712.9 -12268.7
114552 -12709 -12268.7
115884 -12705.2 -12268.7
117216 -12701.4 -12268.7
118548 -12697.7 -12268.7
119880 -12694 -12268.7
121212 -12690.3 -12268.7
122544 -12686.6 -12269.6
123876 -12683 -12269.5
125208 -12679.5 -12269.5
126540 -12676 -12269.5
127872 -12672.5 -12269.6
129204 -12669.3 -12269.5
130536 -12666.2 -12269.6
131868 -12663.1 -12269.5
133200 -12660 -12269.5
134532 -12657 -12269.6
135864 -12654 -12269.6
137196 -12651 -12269.6
138528 -12648 -12269.5
139860 -12645.1 -12269.6
141192 -12642.1 -12269.6
142524 -12639.2 -12269.5
143856 -12636.4 -12269.5
145188 -12633.5 -12269.5
146520 -12630.7 -12269.6
147852 -12627.9 -12269.5
149184 -12625.1 -12269.5
150516 -12622.4 -12269.5
151848 -12619.7 -12269.5
153180 -12617 -12269.5
154512 -12614.4 -12269.5
155844 -12611.8 -12269.6
157176 -12609.2 -12269.6
158508 -12606.6 -12269.5
159840 -12604 -12269.5
161172 -12601.5 -12269.5
162504 -12599 -12269.5
163836 -12596.5 -12269.6
165168 -12594 -12269.6
166500 -12591.6 -12269.6
167832 -12589.1 -12269.6
169164 -12586.7 -12269.5
170496 -12584.3 -12269.6
171828 -12582 -12269.6
173160 -12579.6 -12269.6
174492 -12577.6 -12269.6
175824 -12575.9 -12269.6
177156 -12574.2 -12269.6
178488 -12572.6 -12269.6
179820 -12570.9 -12269.5
181152 -12569.3 -12269.5
182484 -12567.7 -12269.5
183816 -12566.1 -12269.6
185148 -12564.5 -12269.6
186480 -12563 -12269.5
187812 -12561.4 -12269.6
189144 -12559.9 -12269.6
190476 -12558.4 -12269.6
191808 -12556.9 -12269.6
193140 -12555.4 -12269.6
194472 -12554 -12269.6
195804 -12552.5 -12269.5
197136 -12551.1 -12269.5
198468 -12549.7 -12269.5
199800 -12548.4 -12269.5
201132 -12547.1 -12269.6
202464 -12545.8 -12269.5
203796 -12544.6 -12269.5
205128 -12543.3 -12269.5
206460 -12542.1 -12269.5
207792 -12540.9 -12269.6
209124 -12539.8 -12269.5
210456 -12538.7 -12269.5
211788 -12537.6 -12269.6
213120 -12536.5 -12269.6
214452 -12535.5 -12269.6
215784 -12534.7 -12269.6
217116 -12533.9 -12269.5
218448 -12533 -12269.5
219780 -12532.2 -12269.6
221112 -12531.4 -12269.6
222444 -12530.6 -12269.5
223776 -12529.9 -12269.6
225108 -12529.1 -12269.6
226440 -12528.3 -12269.6
227772 -12527.6 -12269.6
229104 -12526.8 -12269.6
230436 -12526 -12269.6
231768 -12525.3 -12269.5
233100 -12524.6 -12269.5
234432 -12523.9 -12269.6
235764 -12523.3 -12269.6
237096 -12522.6 -12269.6
238428 -12522 -12269.6
239760 -12521.4 -12269.6
241092 -12520.7 -12269.6
242424 -12520.1 -12269.6
243756 -12519.5 -12269.6
245088 -12518.9 -12269.6
246420 -12518.3 -12269.5
247752 -12517.7 -12269.6
249084 -12517.1 -12269.5
250416 -12516.5 -12269.6
251748 -12515.9 -12269.6
253080 -12515.4 -12269.5
254412 -12514.8 -12269.6
255744 -12514.2 -12269.6
257076 -12513.7 -12269.6
258408 -12513.2 -12269.5
259740 -12512.7 -12269.6
261072 -12512.2 -12269.6
262404 -12511.7 -12269.5
263736 -12511.3 -12269.6
265068 -12510.8 -12269.5
266400 -12510.3 -12269.5
267732 -12509.8 -12269.6
269064 -12509.4 -12269.6
270396 -12509 -12269.6
271728 -12508.5 -12269.6
273060 -12508 -12269.6
274392 -12507.6 -12269.6
275724 -12507.1 -12269.5
277056 -12506.7 -12269.6
278388 -12506.2 -12269.6
279720 -12505.8 -12269.6
281052 -12505.3 -12269.6
282384 -12504.9 -12269.5
283716 -12504.4 -12269.6
285048 -12504 -12269.5
286380 -12503.5 -12269.6
287712 -12503.1 -12269.6
289044 -12502.6 -12269.6
290376 -12502.2 -12269.6
291708 -12501.8 -12269.5
293040 -12501.3 -12269.6
294372 -12500.9 -12269.5
295704 -12500.5 -12269.6
297036 -12500.1 -12269.5
298368 -12499.7 -12269.6
299700 -12499.3 -12269.5
301032 -12498.9 -12269.5
302364 -12498.6 -12269.5
303696 -12498.2 -12269.5
305028 -12497.9 -12269.6
306360 -12497.6 -12269.5
307692 -12497.3 -12269.6
309024 -12497 -12269.6
310356 -12496.7 -12269.5
311688 -12496.4 -12269.5
313020 -12496.1 -12269.5
314352 -12495.8 -12269.5
315684 -12495.6 -12269.5
317016 -12495.3 -12269.5
318348 -12495 -12269.5
319680 -12494.7 -12269.6
321012 -12494.5 -12269.5
322344 -12494.2 -12269.5
323676 -12493.9 -12269.5
325008 -12493.6 -12269.6
326340 -12493.4 -12269.6
327672 -12493.1 -12269.6
329004 -12492.8 -12269.6
330336 -12492.6 -12269.5
331668 -12492.3 -12269.6
333000 -12492 -12269.5
334332 -12491.8 -12269.6
335664 -12491.5 -12269.5
336996 -12491.2 -12269.6
338328 -12491 -12269.5
339660 -12490.7 -12269.6
340992 -12490.5 -12269.6
342324 -12490.3 -12269.6
343656 -12490 -12269.6
344988 -12489.8 -12269.6
346320 -12489.5 -12269.6
347652 -12489.3 -12269.5
348984 -12489 -12269.5
350316 -12488.8 -12269.5
351648 -12488.5 -12269.5
352980 -12488.3 -12269.5
354312 -12488 -12269.5
355644 -12487.8 -12269.5
356976 -12487.5 -12269.5
358308 -12487.3 -12269.6
359640 -12487.1 -12269.5
360972 -12486.8 -12269.5
362304 -12486.6 -12269.5
363636 -12486.4 -12269.6
364968 -12486.1 -12269.5
366300 -12485.9 -12269.6
367632 -12485.6 -12269.5
368964 -12485.4 -12269.5
370296 -12485.2 -12269.5
371628 -12485 -12269.5
372960 -12484.7 -12269.6
374292 -12484.5 -12269.6
375624 -12484.3 -12269.6
376956 -12484 -12269.5
378288 -12483.8 -12269.6
379620 -12483.6 -12269.5
380952 -12483.3 -12269.5
382284 -12483.1 -12269.5
383616 -12482.9 -12269.6
384948 -12482.7 -12269.5
386280 -12482.4 -12269.5
387612 -12482.2 -12269.5
388944 -12482 -12269.5
390276 -12481.8 -12269.5
391608 -12481.5 -12269.5
392940 -12481.3 -12269.5
394272 -12481.1 -12269.5
395604 -12480.9 -12269.5
396936 -12480.7 -12269.5
398268 -12480.5 -12269.6
399600 -12480.3 -12269.5
/home/sid/Desktop/spam-code/txtFiles/protein-folding-txtFiles/2BCX.txt
1482 -19773.1 -11749.6
2964 -19013.1 -12472.1
4446 -18455 -12807.8
5928 -18027.2 -13259.5
7410 -17664.5 -13384
8892 -17349.7 -13453.9
10374 -17077.4 -13589.3
11856 -16839.5 -13598.2
13338 -16632.1 -13623.3
14820 -16455.4 -13623.2
16302 -16306.6 -13623.2
17784 -16174.5 -13623.2
19266 -16053.8 -13623.3
20748 -15945.9 -13623.3
22230 -15849.3 -13623.3
23712 -15758.1 -13623.2
25194 -15672.4 -13623.3
26676 -15593.1 -13623.3
28158 -15523.3 -13623.3
29640 -15461.3 -13623.5
31122 -15403.7 -13623.5
32604 -15349.1 -13623.6
34086 -15296.8 -13635.3
35568 -15249.1 -13635.8
37050 -15206.6 -13642.5
38532 -15167.7 -13642.5
40014 -15130.7 -13644.9
41496 -15095.8 -13644.9
42978 -15062 -13644.9
44460 -15029.2 -13645.9
45942 -14998.8 -13645.8
47424 -14969.6 -13645.8
48906 -14942.7 -13645.9
50388 -14918.5 -13645.8
51870 -14895.9 -13645.8
53352 -14875.6 -13645.9
54834 -14856 -13645.8
56316 -14837 -13645.9
57798 -14818.5 -13645.9
59280 -14800.9 -13645.8
60762 -14784 -13645.9
62244 -14767.5 -13645.9
63726 -14751.9 -13645.9
65208 -14738.7 -13645.8
66690 -14726.5 -13645.9
68172 -14714.5 -13645.9
69654 -14702.8 -13645.9
71136 -14691.6 -13645.8
72618 -14681.1 -13645.8
74100 -14671.1 -13645.9
75582 -14661.4 -13645.9
77064 -14651.8 -13645.8
78546 -14642.3 -13645.9
80028 -14633.3 -13645.9
81510 -14624.5 -13645.8
82992 -14616.3 -13645.9
84474 -14608.3 -13645.9
85956 -14600.6 -13645.8
87438 -14593.1 -13645.8
88920 -14585.7 -13645.9
90402 -14578.4 -13645.8
91884 -14571.5 -13645.8
93366 -14564.7 -13645.8
94848 -14557.9 -13645.8
96330 -14551.6 -13645.8
97812 -14545.3 -13645.8
99294 -14539.5 -13645.8
100776 -14533.7 -13645.9
102258 -14528.1 -13645.8
103740 -14522.5 -13645.8
105222 -14517.2 -13695.8
106704 -14512.1 -13702
108186 -14507 -13702
109668 -14502.2 -13702
111150 -14497.6 -13702
112632 -14493.1 -13702
114114 -14488.6 -13702
115596 -14484.1 -13702
117078 -14479.8 -13701.9
118560 -14475.4 -13702.3
120042 -14471.1 -13702.3
121524 -14466.9 -13702.3
123006 -14462.7 -13702.3
124488 -14458.6 -13702.3
125970 -14454.5 -13702.3
127452 -14450.4 -13702.3
128934 -14446.3 -13702.3
130416 -14442.4 -13702.3
131898 -14438.4 -13702.3
133380 -14434.5 -13702.3
134862 -14430.9 -13800.2
136344 -14427.5 -13800.2
137826 -14424.2 -13800.2
139308 -14421 -13800.2
140790 -14417.8 -13800.2
142272 -14414.7 -13800.2
143754 -14411.7 -13815.9
145236 -14408.7 -13818.1
146718 -14405.9 -13818.1
148200 -14403.1 -13818
149682 -14400.3 -13818.1
151164 -14397.6 -13818
152646 -14394.9 -13820.6
154128 -14392.4 -13820.6
155610 -14389.9 -13820.6
157092 -14387.4 -13820.6
158574 -14384.9 -13820.6
160056 -14382.5 -13820.6
161538 -14380.1 -13820.6
163020 -14377.7 -13820.6
164502 -14375.4 -13820.6
165984 -14373.2 -13820.6
167466 -14371.1 -13820.6
168948 -14368.9 -13820.6
170430 -14366.8 -13820.6
171912 -14364.8 -13820.6
173394 -14362.7 -13820.6
174876 -14360.7 -13820.6
176358 -14358.7 -13820.6
177840 -14356.8 -13820.6
179322 -14354.9 -13820.6
180804 -14353.1 -13820.6
182286 -14351.2 -13820.6
183768 -14349.4 -13820.6
185250 -14347.5 -13820.6
186732 -14345.7 -13820.6
188214 -14343.9 -13820.6
189696 -14342.1 -13820.6
191178 -14340.3 -13820.6
192660 -14338.5 -13820.6
194142 -14336.8 -13820.6
195624 -14335 -13820.6
197106 -14333.3 -13820.6
198588 -14331.5 -13820.6
200070 -14329.8 -13820.6
201552 -14328.1 -13820.6
203034 -14326.4 -13820.6
204516 -14324.8 -13820.6
205998 -14323.2 -13820.6
207480 -14321.6 -13820.6
208962 -14320 -13820.6
210444 -14318.5 -13820.6
211926 -14316.9 -13820.6
213408 -14315.3 -13820.6
214890 -14313.8 -13820.6
216372 -14312.2 -13820.6
217854 -14310.7 -13820.6
219336 -14309.2 -13820.6
220818 -14307.8 -13820.6
222300 -14306.4 -13820.6
223782 -14305.1 -13820.6
225264 -14303.8 -13820.6
226746 -14302.4 -13820.6
228228 -14301.1 -13820.6
229710 -14299.8 -13820.6
231192 -14298.5 -13820.6
232674 -14297.3 -13820.6
234156 -14296.1 -13820.6
235638 -14294.8 -13820.6
237120 -14293.6 -13820.6
238602 -14292.4 -13820.6
240084 -14291.3 -13820.6
241566 -14290.1 -13820.6
243048 -14288.9 -13820.6
244530 -14287.9 -13820.6
246012 -14286.8 -13820.6
247494 -14285.8 -13820.6
248976 -14284.8 -13820.6
250458 -14283.9 -13820.6
251940 -14283 -13820.6
253422 -14282.1 -13820.6
254904 -14281.3 -13820.6
256386 -14280.4 -13820.6
257868 -14279.6 -13820.6
259350 -14278.8 -13820.6
260832 -14277.9 -13820.6
262314 -14277.1 -13820.6
263796 -14276.3 -13820.6
265278 -14275.5 -13820.6
266760 -14274.7 -13820.6
268242 -14273.9 -13820.6
269724 -14273.1 -13820.6
271206 -14272.3 -13820.6
272688 -14271.5 -13820.6
274170 -14270.7 -13820.6
275652 -14269.9 -13820.6
277134 -14269.1 -13820.6
278616 -14268.4 -13820.6
280098 -14267.6 -13820.6
281580 -14266.9 -13820.6
283062 -14266.2 -13820.6
284544 -14265.5 -13820.6
286026 -14264.8 -13820.6
287508 -14264.1 -13820.6
288990 -14263.4 -13820.6
290472 -14262.7 -13820.6
291954 -14262 -13820.6
293436 -14261.4 -13820.6
294918 -14260.7 -13820.6
296400 -14260 -13820.6
297882 -14259.3 -13820.6
299364 -14258.7 -13820.6
300846 -14258 -13820.6
302328 -14257.4 -13820.6
303810 -14256.8 -13820.6
305292 -14256.2 -13820.6
306774 -14255.5 -13820.6
308256 -14254.9 -13820.6
309738 -14254.3 -13820.6
311220 -14253.6 -13820.6
312702 -14253 -13820.6
314184 -14252.4 -13820.6
315666 -14251.8 -13820.6
317148 -14251.2 -13820.6
318630 -14250.6 -13820.6
320112 -14250 -13820.6
321594 -14249.4 -13820.6
323076 -14248.8 -13820.6
324558 -14248.2 -13820.6
326040 -14247.7 -13820.6
327522 -14247.1 -13820.6
329004 -14246.5 -13820.6
330486 -14245.9 -13820.6
331968 -14245.3 -13820.6
333450 -14244.8 -13820.6
334932 -14244.2 -13820.6
336414 -14243.6 -13820.6
337896 -14243 -13820.6
339378 -14242.5 -13820.6
340860 -14241.9 -13820.6
342342 -14241.3 -13820.6
343824 -14240.7 -13820.6
345306 -14240.2 -13820.6
346788 -14239.6 -13820.6
348270 -14239 -13820.6
349752 -14238.4 -13820.7
351234 -14237.9 -13820.6
352716 -14237.3 -13820.6
354198 -14236.8 -13820.6
355680 -14236.2 -13820.6
357162 -14235.6 -13820.6
358644 -14235.1 -13820.6
360126 -14234.5 -13820.6
361608 -14234 -13820.6
363090 -14233.4 -13820.6
364572 -14232.9 -13820.6
366054 -14232.3 -13820.7
367536 -14231.8 -13820.7
369018 -14231.2 -13820.6
370500 -14230.7 -13820.6
371982 -14230.2 -13820.6
373464 -14229.6 -13820.6
374946 -14229.1 -13820.6
376428 -14228.6 -13820.6
377910 -14228 -13820.6
379392 -14227.5 -13820.6
380874 -14227 -13820.6
382356 -14226.5 -13820.6
383838 -14226 -13820.6
385320 -14225.5 -13820.7
386802 -14224.9 -13820.6
388284 -14224.4 -13820.6
389766 -14223.9 -13820.6
391248 -14223.4 -13820.6
392730 -14222.9 -13820.6
394212 -14222.4 -13820.6
395694 -14221.9 -13820.6
397176 -14221.4 -13820.6
398658 -14220.9 -13820.6
400140 -14220.5 -13820.6
401622 -14220 -13820.6
403104 -14219.5 -13820.6
404586 -14219.1 -13820.6
406068 -14218.6 -13820.6
407550 -14218.2 -13820.7
409032 -14217.8 -13820.6
410514 -14217.3 -13820.6
411996 -14216.9 -13820.6
413478 -14216.4 -13820.7
414960 -14216 -13820.6
416442 -14215.6 -13820.6
417924 -14215.1 -13820.6
419406 -14214.7 -13820.6
420888 -14214.3 -13820.6
422370 -14213.9 -13820.6
423852 -14213.4 -13820.6
425334 -14213 -13820.6
426816 -14212.6 -13820.6
428298 -14212.2 -13820.6
429780 -14211.8 -13820.6
431262 -14211.4 -13820.6
432744 -14211 -13820.6
434226 -14210.6 -13820.6
435708 -14210.2 -13820.6
437190 -14209.8 -13820.6
438672 -14209.4 -13820.6
440154 -14209 -13820.6
441636 -14208.6 -13820.6
443118 -14208.2 -13820.6
444600 -14207.8 -13820.6
/home/sid/Desktop/spam-code/txtFiles/protein-folding-txtFiles/2BE6.txt
1560 -17944.3 -11448
3120 -17378.5 -11990.2
4680 -16921.5 -12388.8
6240 -16528.1 -12532.1
7800 -16192 -12871.7
9360 -15921.4 -12871.7
10920 -15687.8 -12871.7
12480 -15479.2 -12926.7
14040 -15292.6 -13055.8
15600 -15134.4 -13055.8
17160 -15000.1 -13055.8
18720 -14883 -13055.8
20280 -14780.1 -13145.9
21840 -14691.7 -13157.2
23400 -14616.8 -13157.2
24960 -14551.6 -13157.2
26520 -14496.6 -13157.2
28080 -14446.8 -13157.4
29640 -14400.2 -13157.4
31200 -14358.5 -13167.1
32760 -14322.9 -13167.1
34320 -14289.3 -13167.1
35880 -14257.9 -13167.1
37440 -14229.3 -13167
39000 -14202.1 -13223.6
40560 -14176.6 -13226.7
42120 -14152.2 -13226.7
43680 -14129.1 -13226.7
45240 -14107.1 -13226.7
46800 -14086.2 -13226.7
48360 -14066.2 -13226.7
49920 -14048.2 -13226.7
51480 -14031.3 -13234.2
53040 -14015 -13234.3
54600 -13999.5 -13234.2
56160 -13984.4 -13234.2
57720 -13969.9 -13234.3
59280 -13956.9 -13236.9
60840 -13944.2 -13236.9
62400 -13931.7 -13236.9
63960 -13919.5 -13236.9
65520 -13907.6 -13236.9
67080 -13896 -13236.9
68640 -13886.5 -13236.8
70200 -13877.6 -13236.9
71760 -13868.9 -13236.9
73320 -13861 -13236.8
74880 -13853.7 -13236.9
76440 -13846.6 -13236.8
78000 -13839.6 -13236.9
79560 -13832.9 -13236.9
81120 -13826.4 -13236.9
82680 -13820 -13236.9
84240 -13813.9 -13236.9
85800 -13807.9 -13236.9
87360 -13802.1 -13236.9
88920 -13796.6 -13236.9
90480 -13791.4 -13236.9
92040 -13786.3 -13236.9
93600 -13781.4 -13236.9
95160 -13776.6 -13236.9
96720 -13771.9 -13236.9
98280 -13767.3 -13236.9
99840 -13762.9 -13236.9
101400 -13758.5 -13236.9
102960 -13754.2 -13236.9
104520 -13750.3 -13236.9
106080 -13746.5 -13236.9
107640 -13742.7 -13236.9
109200 -13739 -13236.9
110760 -13735.3 -13236.9
112320 -13731.6 -13236.9
113880 -13728 -13236.9
115440 -13724.4 -13236.9
117000 -13720.9 -13236.9
118560 -13717.4 -13236.9
120120 -13714.1 -13236.9
121680 -13710.9 -13236.9
123240 -13707.8 -13236.9
124800 -13704.7 -13236.9
126360 -13701.7 -13236.9
127920 -13698.7 -13236.9
129480 -13695.8 -13236.9
131040 -13692.9 -13236.9
132600 -13690.1 -13236.9
134160 -13687.3 -13236.9
135720 -13684.5 -13236.9
137280 -13681.8 -13236.9
138840 -13679.1 -13236.9
140400 -13676.5 -13236.9
141960 -13673.9 -13236.9
143520 -13671.4 -13236.9
145080 -13668.8 -13236.9
146640 -13666.3 -13236.9
148200 -13663.9 -13236.9
149760 -13661.5 -13236.9
151320 -13659 -13236.9
152880 -13656.7 -13236.9
154440 -13654.4 -13236.9
156000 -13652.1 -13236.9
157560 -13649.8 -13236.9
159120 -13647.5 -13236.9
160680 -13645.3 -13236.9
162240 -13643.1 -13236.9
163800 -13641 -13236.9
165360 -13638.9 -13236.9
166920 -13636.8 -13236.9
168480 -13634.7 -13236.9
170040 -13632.7 -13236.9
171600 -13630.7 -13236.9
173160 -13628.8 -13236.9
174720 -13626.8 -13236.9
176280 -13624.9 -13236.9
177840 -13623 -13236.9
179400 -13621.1 -13236.9
180960 -13619.3 -13236.9
182520 -13617.4 -13236.9
184080 -13615.6 -13236.9
185640 -13613.8 -13236.9
187200 -13612 -13236.9
188760 -13610.3 -13236.9
190320 -13608.5 -13236.9
191880 -13606.8 -13236.9
193440 -13605.1 -13236.9
195000 -13603.4 -13236.9
196560 -13601.7 -13236.9
198120 -13600.1 -13236.9
199680 -13598.4 -13236.9
201240 -13596.8 -13236.9
202800 -13595.2 -13236.9
204360 -13593.6 -13236.9
205920 -13592.1 -13236.9
207480 -13590.6 -13236.9
209040 -13589.1 -13236.9
210600 -13587.6 -13236.9
212160 -13586.1 -13236.9
213720 -13584.6 -13236.9
215280 -13583.2 -13236.9
216840 -13581.8 -13236.9
218400 -13580.4 -13236.9
219960 -13579 -13236.9
221520 -13577.6 -13236.9
223080 -13576.2 -13236.9
224640 -13574.9 -13236.9
226200 -13573.6 -13236.9
227760 -13572.4 -13236.9
229320 -13571.3 -13236.9
230880 -13570.2 -13236.9
232440 -13569.1 -13236.9
234000 -13568 -13236.9
235560 -13566.9 -13236.9
237120 -13565.9 -13236.9
238680 -13564.8 -13236.9
240240 -13563.8 -13236.9
241800 -13562.7 -13236.9
243360 -13561.7 -13236.9
244920 -13560.7 -13236.8
246480 -13559.7 -13236.9
248040 -13558.6 -13236.8
249600 -13557.6 -13236.9
251160 -13556.6 -13236.9
252720 -13555.7 -13236.9
254280 -13554.7 -13236.8
255840 -13553.7 -13236.9
257400 -13552.8 -13236.9
258960 -13551.8 -13236.9
260520 -13550.8 -13236.9
262080 -13549.9 -13236.9
263640 -13549 -13236.9
265200 -13548 -13236.9
266760 -13547.1 -13236.9
268320 -13546.2 -13236.9
269880 -13545.3 -13236.9
271440 -13544.4 -13236.9
273000 -13543.5 -13236.9
274560 -13542.6 -13236.9
276120 -13541.8 -13236.8
277680 -13540.9 -13236.9
279240 -13540.1 -13236.9
280800 -13539.2 -13236.9
282360 -13538.4 -13236.8
283920 -13537.6 -13236.9
285480 -13536.8 -13236.9
287040 -13536 -13236.9
288600 -13535.2 -13236.9
290160 -13534.4 -13236.9
291720 -13533.7 -13236.9
293280 -13532.9 -13236.9
294840 -13532.1 -13236.9
296400 -13531.4 -13236.9
297960 -13530.6 -13236.9
299520 -13529.9 -13236.9
301080 -13529.1 -13236.9
302640 -13528.4 -13236.9
304200 -13527.7 -13236.9
305760 -13527 -13236.9
307320 -13526.3 -13236.9
308880 -13525.6 -13236.9
310440 -13524.9 -13236.9
312000 -13524.2 -13236.9
313560 -13523.5 -13236.9
315120 -13522.8 -13236.9
316680 -13522.2 -13236.9
318240 -13521.5 -13236.9
319800 -13520.9 -13236.9
321360 -13520.2 -13236.9
322920 -13519.6 -13236.9
324480 -13519 -13236.9
326040 -13518.3 -13236.9
327600 -13517.7 -13236.9
329160 -13517.1 -13236.9
330720 -13516.5 -13236.9
332280 -13515.9 -13236.9
333840 -13515.3 -13236.9
335400 -13514.7 -13236.9
336960 -13514.1 -13236.9
338520 -13513.5 -13236.9
340080 -13512.9 -13236.9
341640 -13512.3 -13236.9
343200 -13511.8 -13236.9
344760 -13511.2 -13236.9
346320 -13510.7 -13236.9
347880 -13510.1 -13236.9
349440 -13509.5 -13236.9
351000 -13509 -13236.9
352560 -13508.4 -13236.9
354120 -13507.9 -13236.9
355680 -13507.4 -13236.9
357240 -13506.8 -13236.9
358800 -13506.3 -13236.9
360360 -13505.8 -13236.9
361920 -13505.3 -13236.9
363480 -13504.8 -13236.9
365040 -13504.2 -13236.9
366600 -13503.7 -13236.9
368160 -13503.2 -13236.9
369720 -13502.7 -13236.9
371280 -13502.2 -13236.9
372840 -13501.8 -13236.9
374400 -13501.3 -13236.9
375960 -13500.8 -13236.9
377520 -13500.3 -13236.9
379080 -13499.8 -13236.9
380640 -13499.4 -13236.9
382200 -13498.9 -13236.9
383760 -13498.4 -13236.9
385320 -13498 -13236.9
386880 -13497.5 -13236.9
388440 -13497.1 -13236.9
390000 -13496.6 -13236.9
391560 -13496.2 -13236.9
393120 -13495.7 -13236.9
394680 -13495.3 -13236.9
396240 -13494.9 -13236.9
397800 -13494.4 -13236.9
399360 -13494 -13236.9
400920 -13493.6 -13236.9
402480 -13493.1 -13236.9
404040 -13492.7 -13236.9
405600 -13492.3 -13236.9
407160 -13491.9 -13236.9
408720 -13491.5 -13236.9
410280 -13491.1 -13236.9
411840 -13490.7 -13236.9
413400 -13490.3 -13236.9
414960 -13489.9 -13236.9
416520 -13489.5 -13236.9
418080 -13489.1 -13236.9
419640 -13488.7 -13236.9
421200 -13488.3 -13236.9
422760 -13488 -13236.9
424320 -13487.6 -13236.9
425880 -13487.2 -13236.9
427440 -13486.9 -13236.9
429000 -13486.5 -13236.9
430560 -13486.1 -13236.9
432120 -13485.8 -13236.9
433680 -13485.4 -13236.9
435240 -13485.1 -13236.9
436800 -13484.7 -13236.9
438360 -13484.4 -13236.9
439920 -13484 -13236.9
441480 -13483.7 -13236.9
443040 -13483.4 -13236.9
444600 -13483 -13236.9
446160 -13482.7 -13236.9
447720 -13482.4 -13236.9
449280 -13482 -13236.9
450840 -13481.7 -13236.9
452400 -13481.4 -13236.9
453960 -13481.1 -13236.9
455520 -13480.7 -13236.9
457080 -13480.4 -13236.9
458640 -13480.1 -13236.9
460200 -13479.8 -13236.9
461760 -13479.5 -13236.9
463320 -13479.2 -13236.9
464880 -13478.9 -13236.9
466440 -13478.6 -13236.9
468000 -13478.3 -13236.9
/home/sid/Desktop/spam-code/txtFiles/protein-folding-txtFiles/2F3Y.txt
1190 -19136.1 -13076.5
2380 -18468.7 -13683.2
3570 -17989.8 -13690.2
4760 -17617 -13837.7
5950 -17314.3 -14044.7
7140 -17067 -14044.7
8330 -16868.3 -14044.7
9520 -16694 -14120
10710 -16540.2 -14120.2
11900 -16403.4 -14326.5
13090 -16288.2 -14326.5
14280 -16186.8 -14326.5
15470 -16097.9 -14326.5
16660 -16017.9 -14326.5
17850 -15945.9 -14326.5
19040 -15880.7 -14326.5
20230 -15826.8 -14326.5
21420 -15777.3 -14326.5
22610 -15730.3 -14326.5
23800 -15691.4 -14329.8
24990 -15654.4 -14329.8
26180 -15619.7 -14329.8
27370 -15587.1 -14329.8
28560 -15556.3 -14329.9
29750 -15528.5 -14329.9
30940 -15502.6 -14329.9
32130 -15477.8 -14329.9
33320 -15453.8 -14329.9
34510 -15430.5 -14329.9
35700 -15408 -14329.9
36890 -15386.8 -14329.9
38080 -15366.6 -14329.9
39270 -15347.1 -14329.9
40460 -15328.6 -14330.3
41650 -15310.9 -14330.3
42840 -15294.7 -14330.3
44030 -15279.1 -14330.3
45220 -15264.8 -14330.3
46410 -15250.8 -14330.3
47600 -15237.2 -14330.3
48790 -15223.8 -14330.3
49980 -15210.7 -14330.3
51170 -15197.9 -14330.3
52360 -15185.4 -14330.3
53550 -15173.2 -14330.3
54740 -15161.6 -14330.3
55930 -15150.3 -14330.3
57120 -15139.2 -14330.3
58310 -15128.6 -14330.4
59500 -15118.1 -14330.4
60690 -15107.9 -14330.3
61880 -15097.8 -14330.3
63070 -15088 -14330.3
64260 -15078.5 -14330.3
65450 -15069.3 -14330.4
66640 -15060.3 -14330.4
67830 -15051.6 -14330.3
69020 -15043.2 -14330.4
70210 -15035.2 -14330.3
71400 -15027.5 -14330.4
72590 -15020 -14330.3
73780 -15012.7 -14330.3
74970 -15005.5 -14330.4
76160 -14998.6 -14330.3
77350 -14991.9 -14330.4
78540 -14985.3 -14330.3
79730 -14978.9 -14330.4
80920 -14973.1 -14330.3
82110 -14967.6 -14330.3
83300 -14962.2 -14330.4
84490 -14956.9 -14330.4
85680 -14951.7 -14330.3
86870 -14946.8 -14330.3
88060 -14941.9 -14330.3
89250 -14937.1 -14330.3
90440 -14932.5 -14330.3
91630 -14927.9 -14330.3
92820 -14923.4 -14330.3
94010 -14919.1 -14330.3
95200 -14915.2 -14330.3
96390 -14911.4 -14330.3
97580 -14907.7 -14330.3
98770 -14904.1 -14330.3
99960 -14900.7 -14330.3
101150 -14897.4 -14330.3
102340 -14894.1 -14330.3
103530 -14890.9 -14330.4
104720 -14887.7 -14330.3
105910 -14884.5 -14330.3
107100 -14881.4 -14330.4
108290 -14878.3 -14330.3
109480 -14875.3 -14330.3
110670 -14872.3 -14330.4
111860 -14869.4 -14330.4
113050 -14866.5 -14330.4
114240 -14863.7 -14330.3
115430 -14860.9 -14330.4
116620 -14858.1 -14330.3
117810 -14855.4 -14330.3
119000 -14852.7 -14330.3
120190 -14850.1 -14330.4
121380 -14847.5 -14330.3
122570 -14844.9 -14330.4
123760 -14842.4 -14330.3
124950 -14840 -14330.3
126140 -14837.6 -14330.3
127330 -14835.3 -14330.3
128520 -14833 -14330.4
129710 -14830.8 -14330.3
130900 -14828.6 -14330.3
132090 -14826.5 -14330.4
133280 -14824.3 -14330.3
134470 -14822.3 -14330.3
135660 -14820.3 -14330.4
136850 -14818.3 -14330.4
138040 -14816.4 -14330.4
139230 -14814.5 -14330.3
140420 -14812.7 -14330.4
141610 -14810.9 -14330.3
142800 -14809.1 -14330.4
143990 -14807.4 -14330.4
145180 -14805.7 -14330.3
146370 -14804.1 -14330.3
147560 -14802.4 -14330.3
148750 -14800.9 -14330.3
149940 -14799.4 -14330.3
151130 -14798 -14330.4
152320 -14796.7 -14330.4
153510 -14795.3 -14330.3
154700 -14794 -14330.3
155890 -14792.7 -14330.4
157080 -14791.4 -14330.3
158270 -14790.1 -14330.3
159460 -14788.8 -14330.4
160650 -14787.6 -14330.3
161840 -14786.4 -14330.3
163030 -14785.2 -14330.3
164220 -14784 -14330.3
165410 -14782.8 -14330.3
166600 -14781.7 -14330.4
167790 -14780.5 -14330.3
168980 -14779.4 -14330.3
170170 -14778.3 -14330.3
171360 -14777.2 -14330.3
172550 -14776.1 -14330.3
173740 -14775 -14330.4
174930 -14773.9 -14330.3
176120 -14772.8 -14330.4
177310 -14771.7 -14330.3
178500 -14770.7 -14330.3
179690 -14769.7 -14330.3
180880 -14768.7 -14330.4
182070 -14767.6 -14330.3
183260 -14766.7 -14330.4
184450 -14765.7 -14330.3
185640 -14764.7 -14330.3
186830 -14763.7 -14330.3
188020 -14762.8 -14330.4
189210 -14761.8 -14330.3
190400 -14760.9 -14330.3
191590 -14760 -14330.3
192780 -14759.1 -14330.3
193970 -14758.2 -14330.3
195160 -14757.3 -14330.4
196350 -14756.4 -14330.3
197540 -14755.5 -14330.4
198730 -14754.7 -14330.3
199920 -14753.8 -14330.3
201110 -14752.9 -14330.4
202300 -14752.1 -14330.4
203490 -14751.3 -14330.3
204680 -14750.4 -14330.4
205870 -14749.6 -14330.4
207060 -14748.8 -14330.4
208250 -14748 -14330.4
209440 -14747.2 -14330.3
210630 -14746.4 -14330.4
211820 -14745.6 -14330.3
213010 -14744.9 -14330.4
214200 -14744.1 -14330.4
215390 -14743.3 -14330.4
216580 -14742.5 -14330.4
217770 -14741.8 -14330.4
218960 -14741 -14330.3
220150 -14740.3 -14330.3
221340 -14739.5 -14330.3
222530 -14738.8 -14330.4
223720 -14738.1 -14330.3
224910 -14737.4 -14330.3
226100 -14736.6 -14330.3
227290 -14735.9 -14330.3
228480 -14735.2 -14330.3
229670 -14734.5 -14330.3
230860 -14733.8 -14330.3
232050 -14733.2 -14330.3
233240 -14732.5 -14330.3
234430 -14731.8 -14330.3
235620 -14731.1 -14330.3
236810 -14730.5 -14330.3
238000 -14729.8 -14330.3
239190 -14729.2 -14330.3
240380 -14728.5 -14330.3
241570 -14727.9 -14330.3
242760 -14727.3 -14330.3
243950 -14726.6 -14330.3
245140 -14726 -14330.3
246330 -14725.4 -14330.4
247520 -14724.8 -14330.4
248710 -14724.2 -14330.3
249900 -14723.6 -14330.4
251090 -14723 -14330.4
252280 -14722.4 -14330.3
253470 -14721.8 -14330.3
254660 -14721.2 -14330.4
255850 -14720.7 -14330.3
257040 -14720.1 -14330.3
258230 -14719.5 -14330.3
259420 -14719 -14330.3
260610 -14718.4 -14330.3
261800 -14717.9 -14330.3
262990 -14717.3 -14330.3
264180 -14716.8 -14330.3
265370 -14716.2 -14330.3
266560 -14715.7 -14330.3
267750 -14715.2 -14330.3
268940 -14714.7 -14330.3
270130 -14714.2 -14330.3
271320 -14713.6 -14330.3
272510 -14713.2 -14330.3
273700 -14712.7 -14330.3
274890 -14712.2 -14330.3
276080 -14711.7 -14330.3
277270 -14711.2 -14330.3
278460 -14710.7 -14330.3
279650 -14710.3 -14330.3
280840 -14709.8 -14330.3
282030 -14709.3 -14330.3
283220 -14708.9 -14330.3
284410 -14708.4 -14330.3
285600 -14708 -14330.3
286790 -14707.5 -14330.3
287980 -14707.1 -14330.3
289170 -14706.7 -14330.3
290360 -14706.2 -14330.3
291550 -14705.8 -14330.3
292740 -14705.4 -14330.3
293930 -14705 -14330.3
295120 -14704.6 -14330.3
296310 -14704.2 -14330.3
297500 -14703.8 -14330.3
298690 -14703.4 -14330.3
299880 -14703 -14330.3
301070 -14702.6 -14330.3
302260 -14702.2 -14330.3
303450 -14701.8 -14330.3
304640 -14701.4 -14330.3
305830 -14701.1 -14330.3
307020 -14700.7 -14330.3
308210 -14700.3 -14330.3
309400 -14699.9 -14330.3
310590 -14699.6 -14330.3
311780 -14699.2 -14330.4
312970 -14698.9 -14330.3
314160 -14698.5 -14330.3
315350 -14698.1 -14330.3
316540 -14697.8 -14330.3
317730 -14697.4 -14330.3
318920 -14697.1 -14330.3
320110 -14696.7 -14330.3
321300 -14696.4 -14330.3
322490 -14696.1 -14330.3
323680 -14695.7 -14330.3
324870 -14695.4 -14330.3
326060 -14695.1 -14330.3
327250 -14694.7 -14330.3
328440 -14694.4 -14330.3
329630 -14694.1 -14330.3
330820 -14693.8 -14330.3
332010 -14693.5 -14330.3
333200 -14693.2 -14330.3
334390 -14692.9 -14330.3
335580 -14692.6 -14330.3
336770 -14692.3 -14330.3
337960 -14692 -14330.3
339150 -14691.8 -14330.3
340340 -14691.5 -14330.3
341530 -14691.2 -14330.3
342720 -14691 -14330.3
343910 -14690.7 -14330.3
345100 -14690.5 -14330.3
346290 -14690.2 -14330.3
347480 -14689.9 -14330.3
348670 -14689.7 -14330.3
349860 -14689.4 -14330.3
351050 -14689.2 -14330.3
352240 -14689 -14330.3
353430 -14688.7 -14330.3
354620 -14688.5 -14330.3
355810 -14688.2 -14330.3
357000 -14688 -14330.3
/home/sid/Desktop/spam-code/txtFiles/protein-folding-txtFiles/2FOT.txt
1190 -17759.1 -10578.2
2380 -17081.3 -11238.9
3570 -16525.1 -11297.6
4760 -16040.4 -11524.6
5950 -15614.8 -11541.9
7140 -15243.7 -11549
8330 -14911.4 -11557.5
9520 -14625.7 -11557.5
10710 -14380.1 -11557.4
11900 -14189.4 -11557.5
13090 -14046.8 -11558.8
14280 -13917.7 -11572.7
15470 -13800.4 -11572.7
16660 -13700.2 -11581.9
17850 -13617.4 -11585.1
19040 -13541.9 -11585
20230 -13471.2 -11585
21420 -13408 -11585.2
22610 -13349.8 -11617.8
23800 -13294.5 -11723.2
24990 -13241.8 -11871.1
26180 -13192.6 -11871.1
27370 -13148.1 -11877.3
28560 -13105.5 -11883.1
29750 -13064.6 -11883
30940 -13028.6 -11883
32130 -12995.5 -11883
33320 -12963.5 -11883
34510 -12934.2 -11883
35700 -12906.2 -11883
36890 -12879.8 -11883
38080 -12854.8 -11883
39270 -12831 -11887.8
40460 -12809.1 -11907
41650 -12788.3 -11907
42840 -12768.2 -11907
44030 -12748.6 -11907
45220 -12729.6 -11908.7
46410 -12711.2 -11908.8
47600 -12693.4 -11918.8
48790 -12676 -11918.8
49980 -12659.2 -11918.8
51170 -12642.9 -11918.8
52360 -12627 -11918.8
53550 -12611.8 -11918.8
54740 -12597.3 -11918.8
55930 -12583.3 -11918.8
57120 -12569.7 -11918.8
58310 -12556.5 -11918.8
59500 -12543.7 -11918.8
60690 -12531.7 -11918.8
61880 -12520.3 -11918.8
63070 -12509.3 -11918.8
64260 -12498.4 -11918.8
65450 -12487.9 -11918.8
66640 -12477.6 -11918.8
67830 -12467.6 -11918.8
69020 -12457.9 -11918.8
70210 -12448.6 -11918.8
71400 -12439.8 -11918.7
72590 -12431.6 -11918.8
73780 -12423.5 -11918.7
74970 -12415.6 -11918.7
76160 -12407.9 -11918.7
77350 -12400.4 -11918.8
78540 -12393.1 -11918.7
79730 -12386 -11918.7
80920 -12379.4 -11918.8
82110 -12373.2 -11918.8
83300 -12367.2 -11918.8
84490 -12361.2 -11918.8
85680 -12355.4 -11918.8
86870 -12349.8 -11918.8
88060 -12344.2 -11918.8
89250 -12338.8 -11918.8
90440 -12333.5 -11918.8
91630 -12328.4 -11918.8
92820 -12323.4 -11918.8
94010 -12318.6 -11918.8
95200 -12313.9 -11918.7
96390 -12309.3 -11918.8
97580 -12304.9 -11918.8
98770 -12300.5 -11918.8
99960 -12296.5 -11918.8
101150 -12292.6 -11918.8
102340 -12288.8 -11918.8
103530 -12285.2 -11918.8
104720 -12281.7 -11918.8
105910 -12278.3 -11918.7
107100 -12275 -11918.8
108290 -12271.8 -11918.7
109480 -12268.7 -11918.8
110670 -12265.7 -11918.7
111860 -12262.8 -11918.7
113050 -12260 -11918.7
114240 -12257.4 -11918.8
115430 -12254.9 -11918.7
116620 -12252.4 -11918.7
117810 -12250 -11918.7
119000 -12247.7 -11918.8
120190 -12245.3 -11918.8
121380 -12243 -11918.8
122570 -12240.7 -11918.7
123760 -12238.5 -11918.8
124950 -12236.4 -11918.8
126140 -12234.3 -11918.8
127330 -12232.2 -11918.8
128520 -12230.3 -11918.8
129710 -12228.5 -11918.8
130900 -12226.8 -11918.8
132090 -12225.2 -11918.8
133280 -12223.5 -11918.7
134470 -12221.9 -11918.8
135660 -12220.3 -11918.7
136850 -12218.7 -11918.7
138040 -12217.2 -11918.8
139230 -12215.6 -11918.8
140420 -12214.1 -11918.8
141610 -12212.6 -11918.8
142800 -12211.1 -11918.8
143990 -12209.7 -11918.8
145180 -12208.2 -11918.7
146370 -12206.9 -11918.7
147560 -12205.5 -11918.7
148750 -12204.2 -11918.8
149940 -12202.9 -11918.8
151130 -12201.6 -11918.7
152320 -12200.3 -11918.8
153510 -12199.1 -11918.8
154700 -12197.8 -11918.7
155890 -12196.6 -11918.7
157080 -12195.4 -11918.8
158270 -12194.2 -11918.7
159460 -12193.1 -11918.7
160650 -12192 -11918.7
161840 -12190.9 -11918.7
163030 -12189.8 -11918.8
164220 -12188.7 -11918.8
165410 -12187.7 -11918.7
166600 -12186.6 -11918.8
167790 -12185.5 -11918.8
168980 -12184.5 -11918.8
170170 -12183.5 -11918.8
171360 -12182.5 -11918.8
172550 -12181.5 -11918.7
173740 -12180.6 -11918.8
174930 -12179.7 -11918.7
176120 -12178.8 -11918.8
177310 -12177.9 -11918.8
178500 -12177 -11918.8
179690 -12176.4 -11918.8
180880 -12175.8 -11918.8
182070 -12175.2 -11918.8
183260 -12174.6 -11918.8
184450 -12174 -11918.7
185640 -12173.5 -11918.8
186830 -12172.9 -11918.8
188020 -12172.3 -11918.8
189210 -12171.8 -11918.8
190400 -12171.3 -11918.7
191590 -12170.7 -11918.8
192780 -12170.2 -11918.8
193970 -12169.7 -11918.8
195160 -12169.2 -11918.8
196350 -12168.7 -11918.8
197540 -12168.2 -11918.8
198730 -12167.7 -11918.8
199920 -12167.3 -11918.8
201110 -12166.8 -11918.8
202300 -12166.4 -11918.8
203490 -12165.9 -11918.8
204680 -12165.5 -11918.8
205870 -12165.1 -11918.8
207060 -12164.7 -11918.8
208250 -12164.3 -11918.8
209440 -12163.8 -11918.8
210630 -12163.4 -11918.8
211820 -12163 -11918.8
213010 -12162.6 -11918.8
214200 -12162.2 -11918.8
215390 -12161.8 -11918.8
216580 -12161.4 -11919.1
217770 -12161 -11919.1
218960 -12160.7 -11919.1
220150 -12160.3 -11919.1
221340 -12159.9 -11919.1
222530 -12159.6 -11919.1
223720 -12159.2 -11919.1
224910 -12158.9 -11919.1
226100 -12158.5 -11919.1
227290 -12158.2 -11919.1
228480 -12157.8 -11919.1
229670 -12157.5 -11919.1
230860 -12157.1 -11919.1
232050 -12156.8 -11919.1
233240 -12156.5 -11919.1
234430 -12156.2 -11919.1
235620 -12155.9 -11919.1
236810 -12155.6 -11919.1
238000 -12155.3 -11919.1
239190 -12155 -11919.1
240380 -12154.7 -11919.1
241570 -12154.4 -11919.1
242760 -12154.1 -11919.1
243950 -12153.8 -11919.1
245140 -12153.5 -11919.1
246330 -12153.3 -11919.1
247520 -12153 -11919.1
248710 -12152.7 -11919.1
249900 -12152.4 -11919.1
251090 -12152.2 -11919.1
252280 -12151.9 -11919.1
253470 -12151.6 -11919.1
254660 -12151.4 -11919.1
255850 -12151.1 -11919.1
257040 -12150.8 -11919.1
258230 -12150.6 -11919.1
259420 -12150.3 -11919.1
260610 -12150 -11919.1
261800 -12149.8 -11919.1
262990 -12149.5 -11919.1
264180 -12149.3 -11919.1
265370 -12149 -11919.1
266560 -12148.7 -11919.1
267750 -12148.5 -11919.1
268940 -12148.2 -11919.1
270130 -12147.9 -11919.1
271320 -12147.7 -11919.1
272510 -12147.4 -11919.1
273700 -12147.2 -11919.1
274890 -12146.9 -11919.1
276080 -12146.6 -11919.1
277270 -12146.4 -11919.1
278460 -12146.1 -11919.1
279650 -12145.9 -11919.1
280840 -12145.6 -11919.1
282030 -12145.4 -11919.1
283220 -12145.1 -11919.1
284410 -12144.8 -11919.1
285600 -12144.6 -11919.1
286790 -12144.3 -11919.1
287980 -12144.1 -11919.1
289170 -12143.8 -11919.1
290360 -12143.6 -11919.1
291550 -12143.3 -11919.1
292740 -12143.1 -11919.1
293930 -12142.8 -11919.1
295120 -12142.6 -11919.1
296310 -12142.3 -11919.1
297500 -12142.1 -11919.1
298690 -12141.8 -11919.1
299880 -12141.6 -11919.1
301070 -12141.4 -11919.1
302260 -12141.1 -11919.1
303450 -12140.9 -11919.1
304640 -12140.6 -11919.1
305830 -12140.4 -11919.1
307020 -12140.1 -11919.1
308210 -12139.9 -11919.1
309400 -12139.7 -11919.1
310590 -12139.4 -11919.1
311780 -12139.2 -11919.1
312970 -12138.9 -11919.1
314160 -12138.7 -11919.1
315350 -12138.5 -11919.1
316540 -12138.2 -11919.1
317730 -12138 -11919.1
318920 -12137.8 -11919.1
320110 -12137.5 -11919.1
321300 -12137.3 -11919.1
322490 -12137.1 -11919.1
323680 -12136.8 -11919.1
324870 -12136.6 -11919.1
326060 -12136.4 -11919.1
327250 -12136.2 -11919.1
328440 -12135.9 -11919.1
329630 -12135.7 -11919.1
330820 -12135.5 -11919.1
332010 -12135.3 -11919.1
333200 -12135 -11919.1
334390 -12134.8 -11919.1
335580 -12134.6 -11919.1
336770 -12134.4 -11919.1
337960 -12134.1 -11919.1
339150 -12133.9 -11919.1
340340 -12133.7 -11919.1
341530 -12133.5 -11919.1
342720 -12133.2 -11919.1
343910 -12133 -11919.1
345100 -12132.8 -11919.1
346290 -12132.6 -11919.1
347480 -12132.4 -11919.1
348670 -12132.2 -11919.1
349860 -12132 -11919.1
351050 -12131.8 -11919.1
352240 -12131.6 -11919.1
353430 -12131.3 -11919.1
354620 -12131.1 -11919.1
355810 -12130.9 -11919.1
357000 -12130.7 -11919.1
/home/sid/Desktop/spam-code/txtFiles/protein-folding-txtFiles/2HQW.txt
1260 -18928.6 -12635.1
2520 -18228.2 -12635.9
3780 -17707.8 -12904.7
5040 -17276.1 -13009.1
6300 -16896.4 -13194.9
7560 -16565.5 -13194.9
8820 -16284 -13208
10080 -16042.7 -13208
11340 -15834.8 -13209
12600 -15666.4 -13209.5
13860 -15540.5 -13209.5
15120 -15428.1 -13209.5
16380 -15327.4 -13209.5
17640 -15244.3 -13209.5
18900 -15166.7 -13209.5
20160 -15093.6 -13209.5
21420 -15026.9 -13209.5
22680 -14967.6 -13220.3
23940 -14915 -13224.8
25200 -14867.3 -13224.8
26460 -14822.5 -13299.8
27720 -14784.4 -13299.8
28980 -14748.8 -13299.8
30240 -14716 -13319.4
31500 -14685 -13364.7
32760 -14655.4 -13364.7
34020 -14627.1 -13364.7
35280 -14600.9 -13364.7
36540 -14575.7 -13364.7
37800 -14551.3 -13364.7
39060 -14527.6 -13364.7
40320 -14504.8 -13364.7
41580 -14482.8 -13364.7
42840 -14461.5 -13364.7
44100 -14441 -13364.7
45360 -14421.8 -13364.7
46620 -14404.2 -13364.7
47880 -14387.3 -13374.6
49140 -14371.5 -13374.6
50400 -14356.2 -13374.6
51660 -14341.9 -13374.6
52920 -14327.9 -13374.6
54180 -14314.1 -13374.5
55440 -14300.7 -13374.5
56700 -14287.8 -13374.5
57960 -14275 -13374.5
59220 -14262.2 -13374.6
60480 -14249.7 -13374.6
61740 -14237.4 -13374.5
63000 -14225.2 -13374.5
64260 -14213.3 -13374.6
65520 -14201.7 -13374.6
66780 -14190.4 -13374.6
68040 -14179.5 -13374.6
69300 -14168.9 -13374.5
70560 -14158.4 -13374.6
71820 -14148.1 -13374.6
73080 -14138 -13374.6
74340 -14128.1 -13374.5
75600 -14118.5 -13374.6
76860 -14109.7 -13374.6
78120 -14101.1 -13374.6
79380 -14092.6 -13374.5
80640 -14084.5 -13501.7
81900 -14077.1 -13501.7
83160 -14069.8 -13501.7
84420 -14062.6 -13501.7
85680 -14055.5 -13501.8
86940 -14048.4 -13501.7
88200 -14041.5 -13501.7
89460 -14034.6 -13501.7
90720 -14027.8 -13501.8
91980 -14021.1 -13501.9
93240 -14014.5 -13501.9
94500 -14008.2 -13501.9
95760 -14001.9 -13501.9
97020 -13995.8 -13501.9
98280 -13989.9 -13501.9
99540 -13984 -13501.9
100800 -13978.3 -13501.9
102060 -13972.7 -13501.9
103320 -13967.3 -13501.9
104580 -13962.3 -13501.9
105840 -13957.3 -13501.9
107100 -13952.5 -13501.9
108360 -13947.8 -13501.9
109620 -13943.1 -13501.9
110880 -13938.4 -13501.9
112140 -13933.9 -13501.9
113400 -13929.4 -13501.9
114660 -13925 -13501.9
115920 -13920.6 -13501.9
117180 -13916.4 -13501.9
118440 -13912.3 -13501.9
119700 -13908.3 -13501.9
120960 -13904.4 -13501.9
122220 -13900.5 -13501.9
123480 -13896.6 -13501.9
124740 -13892.7 -13501.9
126000 -13888.9 -13501.9
127260 -13885.1 -13501.9
128520 -13881.3 -13501.9
129780 -13877.6 -13501.9
131040 -13874 -13501.9
132300 -13870.3 -13501.9
133560 -13866.7 -13501.9
134820 -13863.1 -13501.9
136080 -13859.6 -13501.9
137340 -13856.1 -13501.9
138600 -13852.7 -13501.9
139860 -13849.3 -13501.9
141120 -13846 -13501.9
142380 -13842.7 -13501.9
143640 -13839.5 -13501.9
144900 -13836.4 -13501.9
146160 -13833.3 -13501.9
147420 -13830.2 -13501.9
148680 -13827.2 -13501.9
149940 -13824.3 -13501.9
151200 -13821.3 -13501.9
152460 -13818.5 -13501.9
153720 -13815.6 -13501.9
154980 -13812.8 -13501.9
156240 -13810 -13501.9
157500 -13807.4 -13501.9
158760 -13805 -13501.9
160020 -13802.6 -13501.9
161280 -13800.1 -13501.9
162540 -13797.7 -13501.9
163800 -13795.4 -13501.9
165060 -13793 -13501.9
166320 -13790.6 -13501.9
167580 -13788.3 -13501.9
168840 -13786 -13501.9
170100 -13783.7 -13501.9
171360 -13781.4 -13501.9
172620 -13779.2 -13501.9
173880 -13777.1 -13501.9
175140 -13775 -13501.9
176400 -13772.9 -13501.9
177660 -13770.8 -13501.9
178920 -13768.8 -13501.9
180180 -13766.8 -13501.9
181440 -13764.8 -13501.9
182700 -13762.9 -13501.9
183960 -13761 -13501.9
185220 -13759.1 -13501.9
186480 -13757.2 -13501.9
187740 -13755.4 -13501.9
189000 -13753.5 -13501.9
190260 -13751.7 -13501.9
191520 -13749.9 -13501.9
192780 -13748.2 -13501.9
194040 -13746.4 -13501.9
195300 -13744.7 -13501.9
196560 -13743 -13501.9
197820 -13741.3 -13501.9
199080 -13739.6 -13501.9
200340 -13737.9 -13501.9
201600 -13736.3 -13501.9
202860 -13734.7 -13501.9
204120 -13733.1 -13501.9
205380 -13731.5 -13501.9
206640 -13729.9 -13501.9
207900 -13728.4 -13501.9
209160 -13726.9 -13501.9
210420 -13725.4 -13501.9
211680 -13724 -13501.9
212940 -13722.5 -13501.9
214200 -13721.1 -13501.9
215460 -13719.7 -13501.9
216720 -13718.3 -13501.9
217980 -13716.9 -13501.9
219240 -13715.6 -13501.9
220500 -13714.2 -13501.9
221760 -13712.9 -13501.9
223020 -13711.6 -13501.9
224280 -13710.3 -13501.9
225540 -13709.1 -13501.9
226800 -13707.8 -13501.9
228060 -13706.6 -13501.9
229320 -13705.3 -13501.9
230580 -13704.1 -13501.9
231840 -13702.9 -13501.9
233100 -13701.8 -13501.9
234360 -13700.6 -13501.9
235620 -13699.5 -13501.9
236880 -13698.4 -13501.9
238140 -13697.3 -13501.9
239400 -13696.2 -13501.9
240660 -13695.1 -13501.9
241920 -13694 -13501.9
243180 -13693 -13501.9
244440 -13691.9 -13501.9
245700 -13690.9 -13501.9
246960 -13690 -13501.9
248220 -13689.1 -13501.9
249480 -13688.1 -13501.9
250740 -13687.3 -13501.9
252000 -13686.4 -13501.9
253260 -13685.6 -13501.9
254520 -13684.7 -13501.9
255780 -13683.9 -13501.9
257040 -13683.1 -13501.9
258300 -13682.3 -13501.9
259560 -13681.5 -13501.9
260820 -13680.8 -13501.9
262080 -13680 -13501.9
263340 -13679.3 -13501.9
264600 -13678.5 -13501.9
265860 -13677.8 -13501.9
267120 -13677.1 -13501.9
268380 -13676.4 -13501.9
269640 -13675.7 -13501.9
270900 -13675 -13501.9
272160 -13674.4 -13501.9
273420 -13673.8 -13501.9
274680 -13673.2 -13501.9
275940 -13672.6 -13501.9
277200 -13672 -13501.9
278460 -13671.5 -13501.9
279720 -13670.9 -13501.9
280980 -13670.3 -13501.9
282240 -13669.8 -13501.9
283500 -13669.2 -13501.9
284760 -13668.7 -13501.9
286020 -13668.3 -13501.9
287280 -13667.8 -13501.9
288540 -13667.3 -13501.9
289800 -13666.9 -13501.9
291060 -13666.5 -13501.9
292320 -13666.1 -13501.8
293580 -13665.6 -13501.9
294840 -13665.2 -13501.9
296100 -13664.8 -13501.9
297360 -13664.4 -13501.9
298620 -13664 -13501.9
299880 -13663.6 -13501.9
301140 -13663.3 -13501.9
302400 -13662.8 -13501.9
303660 -13662.5 -13501.8
304920 -13662.1 -13501.8
306180 -13661.7 -13501.8
307440 -13661.3 -13501.9
308700 -13660.9 -13501.8
309960 -13660.6 -13501.8
311220 -13660.2 -13501.9
312480 -13659.8 -13501.8
313740 -13659.5 -13501.9
315000 -13659.1 -13501.9
316260 -13658.7 -13501.8
317520 -13658.4 -13501.8
318780 -13658 -13501.8
320040 -13657.6 -13501.8
321300 -13657.3 -13501.9
322560 -13656.9 -13501.9
323820 -13656.6 -13501.9
325080 -13656.2 -13501.9
326340 -13655.9 -13501.9
327600 -13655.5 -13501.9
328860 -13655.2 -13501.9
330120 -13654.9 -13501.8
331380 -13654.5 -13501.8
332640 -13654.2 -13501.8
333900 -13653.9 -13501.9
335160 -13653.6 -13501.9
336420 -13653.2 -13501.9
337680 -13652.9 -13501.9
338940 -13652.6 -13501.9
340200 -13652.3 -13501.9
341460 -13652 -13501.9
342720 -13651.7 -13501.8
343980 -13651.3 -13501.8
345240 -13651 -13501.8
346500 -13650.7 -13501.8
347760 -13650.4 -13501.8
349020 -13650.1 -13501.8
350280 -13649.8 -13501.8
351540 -13649.5 -13501.8
352800 -13649.2 -13501.8
354060 -13648.9 -13501.8
355320 -13648.6 -13501.8
356580 -13648.3 -13501.8
357840 -13648 -13501.8
359100 -13647.7 -13501.8
360360 -13647.4 -13501.8
361620 -13647.2 -13501.9
362880 -13646.9 -13501.8
364140 -13646.6 -13501.9
365400 -13646.3 -13501.9
366660 -13646 -13501.9
367920 -13645.8 -13501.9
369180 -13645.5 -13501.9
370440 -13645.2 -13501.9
371700 -13644.9 -13501.9
372960 -13644.7 -13501.9
374220 -13644.4 -13501.9
375480 -13644.1 -13501.9
376740 -13643.8 -13501.9
378000 -13643.6 -13501.8
/home/sid/Desktop/spam-code/txtFiles/protein-folding-txtFiles/2O60.txt
1406 -19624.9 -11185.1
2812 -18712 -11854.6
4218 -17987.6 -12602.3
5624 -17393.1 -12609.3
7030 -16908.8 -12817.3
8436 -16504.7 -12835.4
9842 -16182.7 -13066.3
11248 -15919.1 -13088
12654 -15692 -13088
14060 -15501.6 -13088
15466 -15348.2 -13088
16872 -15208.5 -13088
18278 -15082.9 -13088
19684 -14973.5 -13088
21090 -14880.2 -13088
22496 -14806.7 -13092.9
23902 -14744.1 -13092.9
25308 -14689.2 -13092.9
26714 -14638.6 -13209.2
28120 -14597.1 -13209.2
29526 -14560.2 -13345.4
30932 -14525 -13345.3
32338 -14491 -13345.3
33744 -14459.6 -13345.3
35150 -14432.5 -13472.4
36556 -14408.4 -13472.4
37962 -14386 -13472.4
39368 -14364.9 -13472.4
40774 -14344.3 -13472.4
42180 -14324.3 -13472.4
43586 -14306 -13472.4
44992 -14288.2 -13472.4
46398 -14271.4 -13472.4
47804 -14255.9 -13472.4
49210 -14241.1 -13472.4
50616 -14227 -13472.4
52022 -14213.5 -13472.4
53428 -14201.3 -13472.4
54834 -14189.7 -13472.4
56240 -14178.2 -13472.4
57646 -14167 -13472.4
59052 -14155.8 -13472.4
60458 -14144.7 -13472.4
61864 -14133.7 -13472.4
63270 -14122.8 -13472.4
64676 -14112.2 -13472.4
66082 -14101.6 -13472.4
67488 -14091.1 -13472.4
68894 -14080.8 -13472.4
70300 -14070.5 -13472.4
71706 -14060.4 -13472.4
73112 -14050.6 -13472.4
74518 -14040.8 -13472.4
75924 -14031.2 -13472.4
77330 -14021.8 -13472.4
78736 -14012.6 -13472.4
80142 -14003.5 -13472.4
81548 -13994.7 -13472.4
82954 -13986 -13472.4
84360 -13977.4 -13472.4
85766 -13969.4 -13472.4
87172 -13961.6 -13472.4
88578 -13953.9 -13472.4
89984 -13946.4 -13472.4
91390 -13939.1 -13472.4
92796 -13932 -13472.4
94202 -13925.1 -13472.4
95608 -13918.4 -13472.4
97014 -13911.9 -13472.4
98420 -13905.6 -13472.4
99826 -13899.6 -13472.4
101232 -13893.8 -13472.4
102638 -13888.1 -13472.4
104044 -13883.2 -13472.4
105450 -13878.5 -13472.4
106856 -13873.9 -13472.4
108262 -13869.4 -13472.4
109668 -13865 -13472.4
111074 -13860.8 -13472.4
112480 -13856.7 -13472.4
113886 -13852.8 -13472.4
115292 -13848.9 -13472.4
116698 -13845.1 -13472.4
118104 -13841.4 -13472.4
119510 -13837.9 -13472.4
120916 -13834.4 -13472.4
122322 -13830.9 -13472.4
123728 -13828 -13472.4
125134 -13825.1 -13472.4
126540 -13822.1 -13472.4
127946 -13819.2 -13472.4
129352 -13816.3 -13472.4
130758 -13813.4 -13472.4
132164 -13810.5 -13472.4
133570 -13807.8 -13472.4
134976 -13805.5 -13472.4
136382 -13803.3 -13472.4
137788 -13801.1 -13472.4
139194 -13798.9 -13472.4
140600 -13796.8 -13472.4
142006 -13794.6 -13472.4
143412 -13792.5 -13472.4
144818 -13790.4 -13472.4
146224 -13788.4 -13472.4
147630 -13786.4 -13472.4
149036 -13784.4 -13472.4
150442 -13782.6 -13472.4
151848 -13780.7 -13472.4
153254 -13778.8 -13472.4
154660 -13777 -13472.4
156066 -13775.2 -13472.4
157472 -13773.3 -13472.4
158878 -13771.5 -13472.4
160284 -13769.7 -13472.4
161690 -13767.9 -13472.4
163096 -13766.2 -13472.4
164502 -13764.4 -13472.4
165908 -13762.6 -13472.4
167314 -13760.9 -13472.4
168720 -13759.2 -13472.4
170126 -13757.5 -13472.4
171532 -13755.8 -13472.4
172938 -13754.1 -13472.4
174344 -13752.4 -13472.4
175750 -13750.7 -13472.4
177156 -13749.1 -13472.4
178562 -13747.5 -13472.4
179968 -13745.8 -13472.4
181374 -13744.3 -13472.4
182780 -13742.8 -13472.4
184186 -13741.2 -13472.4
185592 -13739.7 -13472.4
186998 -13738.2 -13472.4
188404 -13736.7 -13472.4
189810 -13735.3 -13472.4
191216 -13733.8 -13472.4
192622 -13732.4 -13472.4
194028 -13730.9 -13472.4
195434 -13729.5 -13472.4
196840 -13728.1 -13472.4
198246 -13726.7 -13472.4
199652 -13725.3 -13472.4
201058 -13724 -13472.4
202464 -13722.7 -13472.4
203870 -13721.4 -13472.4
205276 -13720.3 -13472.4
206682 -13719.2 -13472.4
208088 -13718.2 -13472.4
209494 -13717.2 -13472.4
210900 -13716.2 -13472.4
212306 -13715.2 -13472.4
213712 -13714.2 -13472.4
215118 -13713.2 -13472.4
216524 -13712.2 -13472.4
217930 -13711.3 -13472.4
219336 -13710.3 -13472.4
220742 -13709.3 -13472.4
222148 -13708.4 -13472.4
223554 -13707.4 -13472.4
224960 -13706.5 -13472.4
226366 -13705.5 -13472.4
227772 -13704.6 -13472.4
229178 -13703.7 -13472.4
230584 -13702.8 -13472.4
231990 -13701.9 -13472.4
233396 -13701.1 -13472.4
234802 -13700.2 -13472.4
236208 -13699.3 -13472.4
237614 -13698.5 -13472.4
239020 -13697.6 -13472.4
240426 -13696.8 -13472.4
241832 -13695.9 -13472.4
243238 -13695.1 -13472.4
244644 -13694.2 -13472.4
246050 -13693.4 -13472.4
247456 -13692.6 -13472.4
248862 -13691.8 -13472.4
250268 -13691 -13472.4
251674 -13690.2 -13472.4
253080 -13689.4 -13472.4
254486 -13688.6 -13472.4
255892 -13687.8 -13472.4
257298 -13687.1 -13472.4
258704 -13686.3 -13472.4
260110 -13685.6 -13472.4
261516 -13684.8 -13472.4
262922 -13684.1 -13472.4
264328 -13683.4 -13472.4
265734 -13682.7 -13472.4
267140 -13681.9 -13472.4
268546 -13681.2 -13472.4
269952 -13680.5 -13472.4
271358 -13679.8 -13472.4
272764 -13679.1 -13472.4
274170 -13678.4 -13472.4
275576 -13677.8 -13472.4
276982 -13677.1 -13472.4
278388 -13676.5 -13472.4
279794 -13675.9 -13472.4
281200 -13675.3 -13472.4
282606 -13674.7 -13472.4
284012 -13674.1 -13472.4
285418 -13673.5 -13472.4
286824 -13672.9 -13472.4
288230 -13672.3 -13472.4
289636 -13671.7 -13472.4
291042 -13671.1 -13472.4
292448 -13670.6 -13472.4
293854 -13670 -13472.4
295260 -13669.4 -13472.4
296666 -13668.9 -13472.4
298072 -13668.3 -13472.4
299478 -13667.7 -13472.4
300884 -13667.2 -13472.4
302290 -13666.6 -13472.4
303696 -13666.1 -13472.4
305102 -13665.5 -13472.4
306508 -13665 -13472.4
307914 -13664.4 -13472.4
309320 -13663.9 -13472.4
310726 -13663.4 -13472.4
312132 -13662.8 -13472.4
313538 -13662.3 -13472.4
314944 -13661.8 -13472.4
316350 -13661.3 -13472.4
317756 -13660.7 -13472.4
319162 -13660.2 -13472.4
320568 -13659.7 -13472.4
321974 -13659.2 -13472.4
323380 -13658.7 -13472.4
324786 -13658.2 -13472.4
326192 -13657.7 -13472.4
327598 -13657.2 -13472.4
329004 -13656.7 -13472.4
330410 -13656.2 -13472.4
331816 -13655.8 -13472.4
333222 -13655.3 -13472.4
334628 -13654.8 -13472.4
336034 -13654.3 -13472.4
337440 -13653.9 -13472.4
338846 -13653.4 -13472.4
340252 -13653 -13472.4
341658 -13652.5 -13472.4
343064 -13652.1 -13472.4
344470 -13651.6 -13472.4
345876 -13651.2 -13472.4
347282 -13650.7 -13472.4
348688 -13650.3 -13472.4
350094 -13650 -13472.4
351500 -13649.6 -13472.4
352906 -13649.2 -13472.4
354312 -13648.8 -13472.4
355718 -13648.5 -13472.4
357124 -13648.1 -13472.4
358530 -13647.8 -13472.4
359936 -13647.4 -13472.4
361342 -13647.1 -13472.4
362748 -13646.8 -13472.4
364154 -13646.5 -13472.4
365560 -13646.1 -13472.5
366966 -13645.8 -13472.4
368372 -13645.5 -13472.4
369778 -13645.2 -13472.4
371184 -13644.8 -13472.4
372590 -13644.5 -13472.4
373996 -13644.2 -13472.4
375402 -13643.9 -13472.4
376808 -13643.6 -13472.4
378214 -13643.2 -13472.4
379620 -13642.9 -13472.4
381026 -13642.6 -13472.4
382432 -13642.3 -13472.4
383838 -13642 -13472.4
385244 -13641.7 -13472.4
386650 -13641.4 -13472.4
388056 -13641.1 -13472.4
389462 -13640.7 -13472.4
390868 -13640.4 -13472.4
392274 -13640.1 -13472.4
393680 -13639.8 -13472.4
395086 -13639.5 -13472.4
396492 -13639.2 -13472.4
397898 -13638.9 -13472.4
399304 -13638.6 -13472.4
400710 -13638.3 -13472.4
402116 -13638 -13472.4
403522 -13637.7 -13472.4
404928 -13637.4 -13472.4
406334 -13637.1 -13472.4
407740 -13636.8 -13472.4
409146 -13636.5 -13472.4
410552 -13636.2 -13472.4
411958 -13635.9 -13472.4
413364 -13635.6 -13472.4
414770 -13635.3 -13472.4
416176 -13635.1 -13472.4
417582 -13634.8 -13472.4
418988 -13634.5 -13472.4
420394 -13634.2 -13472.4
421800 -13633.9 -13472.4
/home/sid/Desktop/spam-code/txtFiles/protein-folding-txtFiles/3BXL.txt
1260 -18719.6 -12493.3
2520 -17957.6 -13373.9
3780 -17377.7 -13379.6
5040 -16941.9 -13848.3
6300 -16591.5 -13848.3
7560 -16340 -13848.3
8820 -16160.8 -13849.4
10080 -16022.5 -13881.6
11340 -15914 -13881.7
12600 -15817.9 -13881.6
13860 -15733.4 -14049.8
15120 -15657.6 -14053
16380 -15589 -14053
17640 -15530.9 -14053
18900 -15481.2 -14053
20160 -15436.8 -14053
21420 -15394.6 -14053
22680 -15357.2 -14053
23940 -15322.2 -14053.1
25200 -15288.5 -14053.1
26460 -15256.1 -14053
27720 -15225.5 -14053
28980 -15196.3 -14053
30240 -15168.2 -14053
31500 -15141.2 -14053
32760 -15115 -14053
34020 -15089.8 -14053
35280 -15065.5 -14053
36540 -15042.3 -14053
37800 -15019.8 -14053
39060 -14998.3 -14053
40320 -14977.3 -14053
41580 -14958.2 -14053
42840 -14940.6 -14053
44100 -14923.6 -14101.3
45360 -14907 -14101.3
46620 -14890.9 -14101.3
47880 -14875.3 -14101.3
49140 -14860.4 -14101.3
50400 -14845.9 -14101.3
51660 -14831.8 -14101.3
52920 -14818.1 -14101.3
54180 -14804.7 -14101.3
55440 -14791.5 -14101.3
56700 -14778.8 -14101.3
57960 -14766.9 -14101.3
59220 -14755.5 -14101.3
60480 -14744.4 -14101.3
61740 -14733.5 -14101.3
63000 -14722.9 -14101.3
64260 -14712.5 -14101.3
65520 -14702.5 -14101.3
66780 -14692.6 -14101.3
68040 -14683 -14101.3
69300 -14673.7 -14101.3
70560 -14664.8 -14101.3
71820 -14656.3 -14101.3
73080 -14647.9 -14101.3
74340 -14639.6 -14101.3
75600 -14631.5 -14101.3
76860 -14623.4 -14101.3
78120 -14615.5 -14101.3
79380 -14607.6 -14101.3
80640 -14599.8 -14101.3
81900 -14592.2 -14101.3
83160 -14584.6 -14101.3
84420 -14577 -14101.3
85680 -14569.6 -14101.3
86940 -14562.2 -14101.3
88200 -14554.9 -14101.3
89460 -14547.7 -14101.3
90720 -14540.6 -14101.3
91980 -14533.5 -14101.3
93240 -14526.4 -14101.3
94500 -14519.5 -14101.3
95760 -14512.6 -14101.3
97020 -14505.8 -14101.3
98280 -14499.2 -14101.3
99540 -14492.6 -14101.3
100800 -14486.1 -14101.3
102060 -14479.8 -14101.3
103320 -14473.5 -14101.3
104580 -14467.3 -14101.3
105840 -14461.2 -14101.3
107100 -14455.2 -14101.3
108360 -14449.3 -14101.3
109620 -14443.4 -14101.3
110880 -14437.6 -14101.3
112140 -14431.9 -14101.3
113400 -14426.3 -14101.3
114660 -14420.7 -14101.3
115920 -14415.2 -14101.3
117180 -14409.8 -14101.3
118440 -14404.7 -14101.3
119700 -14400.2 -14101.3
120960 -14395.6 -14101.3
122220 -14391.1 -14101.3
123480 -14386.7 -14101.3
124740 -14382.3 -14101.3
126000 -14378 -14101.3
127260 -14373.7 -14101.3
128520 -14369.4 -14101.3
129780 -14365.2 -14101.3
131040 -14361.2 -14101.3
132300 -14357.2 -14101.3
133560 -14353.2 -14101.3
134820 -14350.1 -14101.3
136080 -14347.3 -14101.3
137340 -14344.6 -14101.3
138600 -14342 -14101.3
139860 -14339.3 -14101.3
141120 -14336.7 -14101.3
142380 -14334.1 -14101.3
143640 -14331.5 -14101.3
144900 -14328.9 -14101.3
146160 -14326.3 -14101.3
147420 -14323.8 -14101.3
148680 -14321.3 -14101.3
149940 -14318.8 -14101.3
151200 -14316.3 -14101.3
152460 -14313.9 -14101.3
153720 -14311.5 -14101.3
154980 -14309.2 -14101.3
156240 -14306.9 -14101.3
157500 -14304.6 -14101.3
158760 -14302.4 -14101.3
160020 -14300.1 -14101.3
161280 -14298 -14101.3
162540 -14295.8 -14101.3
163800 -14293.7 -14101.3
165060 -14291.6 -14101.3
166320 -14289.5 -14101.3
167580 -14287.5 -14101.3
168840 -14285.7 -14101.3
170100 -14283.8 -14101.3
171360 -14282 -14101.3
172620 -14280.1 -14101.3
173880 -14278.3 -14101.3
175140 -14276.5 -14101.3
176400 -14274.8 -14101.3
177660 -14273 -14101.3
178920 -14271.2 -14101.3
180180 -14269.5 -14101.3
181440 -14267.8 -14101.3
182700 -14266.1 -14101.3
183960 -14264.4 -14101.3
185220 -14262.8 -14101.3
186480 -14261.1 -14101.3
187740 -14259.5 -14101.3
189000 -14257.9 -14101.3
190260 -14256.3 -14101.3
191520 -14254.8 -14101.3
192780 -14253.3 -14101.3
194040 -14251.8 -14101.3
195300 -14250.3 -14101.3
196560 -14248.8 -14101.3
197820 -14247.4 -14101.3
199080 -14245.9 -14101.3
200340 -14244.5 -14101.3
201600 -14243.1 -14101.3
202860 -14241.7 -14101.2
204120 -14240.3 -14101.2
205380 -14239 -14101.2
206640 -14237.6 -14101.2
207900 -14236.3 -14101.2
209160 -14235 -14101.2
210420 -14233.7 -14101.2
211680 -14232.5 -14101.2
212940 -14231.2 -14101.2
214200 -14230 -14101.3
215460 -14228.8 -14101.3
216720 -14227.7 -14101.3
217980 -14226.5 -14101.3
219240 -14225.4 -14101.3
220500 -14224.2 -14101.2
221760 -14223.1 -14101.3
223020 -14222.1 -14101.2
224280 -14221 -14101.3
225540 -14220 -14101.2
226800 -14218.9 -14101.3
228060 -14217.9 -14101.2
229320 -14216.9 -14101.2
230580 -14216 -14101.3
231840 -14215 -14101.3
233100 -14214 -14101.2
234360 -14213.1 -14101.2
235620 -14212.2 -14101.2
236880 -14211.3 -14101.2
238140 -14210.4 -14101.2
239400 -14209.5 -14101.3
240660 -14208.6 -14101.2
241920 -14207.7 -14101.3
243180 -14206.8 -14101.3
244440 -14206 -14101.2
245700 -14205.1 -14101.3
246960 -14204.3 -14101.3
248220 -14203.5 -14101.3
249480 -14202.7 -14101.3
250740 -14201.9 -14101.2
252000 -14201.1 -14101.3
253260 -14200.3 -14101.3
254520 -14199.5 -14101.3
255780 -14198.8 -14101.3
257040 -14198 -14101.3
258300 -14197.3 -14101.3
259560 -14196.5 -14101.3
260820 -14195.8 -14101.3
262080 -14195 -14101.2
263340 -14194.3 -14101.3
264600 -14193.6 -14101.3
265860 -14192.9 -14101.3
267120 -14192.2 -14101.3
268380 -14191.6 -14101.3
269640 -14190.9 -14101.3
270900 -14190.3 -14101.3
272160 -14189.6 -14101.2
273420 -14189 -14101.3
274680 -14188.4 -14101.2
275940 -14187.8 -14101.2
277200 -14187.1 -14101.3
278460 -14186.5 -14101.2
279720 -14185.9 -14101.3
280980 -14185.4 -14101.3
282240 -14184.8 -14101.3
283500 -14184.2 -14101.2
284760 -14183.6 -14101.3
286020 -14183 -14101.3
287280 -14182.5 -14101.3
288540 -14181.9 -14101.3
289800 -14181.4 -14101.3
291060 -14180.8 -14101.3
292320 -14180.3 -14101.3
293580 -14179.8 -14101.2
294840 -14179.2 -14101.2
296100 -14178.7 -14101.3
297360 -14178.2 -14101.2
298620 -14177.7 -14101.2
299880 -14177.2 -14101.2
301140 -14176.7 -14101.3
302400 -14176.2 -14101.2
303660 -14175.7 -14101.3
304920 -14175.3 -14101.2
306180 -14174.8 -14101.3
307440 -14174.3 -14101.2
308700 -14173.9 -14101.2
309960 -14173.4 -14101.2
311220 -14173 -14101.2
312480 -14172.5 -14101.2
313740 -14172.1 -14101.2
315000 -14171.7 -14101.2
316260 -14171.2 -14101.3
317520 -14170.8 -14101.2
318780 -14170.4 -14101.2
320040 -14170 -14101.2
321300 -14169.6 -14101.2
322560 -14169.2 -14101.2
323820 -14168.8 -14101.3
325080 -14168.4 -14101.2
326340 -14168 -14101.2
327600 -14167.6 -14101.2
328860 -14167.3 -14101.2
330120 -14166.9 -14101.3
331380 -14166.5 -14101.2
332640 -14166.2 -14101.2
333900 -14165.8 -14101.2
335160 -14165.5 -14101.2
336420 -14165.2 -14101.2
337680 -14164.8 -14101.2
338940 -14164.5 -14101.2
340200 -14164.2 -14101.2
341460 -14163.9 -14101.2
342720 -14163.6 -14101.3
343980 -14163.3 -14101.2
345240 -14163 -14101.2
346500 -14162.7 -14101.3
347760 -14162.5 -14101.2
349020 -14162.2 -14101.3
350280 -14161.9 -14101.3
351540 -14161.6 -14101.2
352800 -14161.4 -14101.3
354060 -14161.1 -14101.3
355320 -14160.9 -14101.2
356580 -14160.6 -14101.2
357840 -14160.3 -14101.3
359100 -14160.1 -14101.2
360360 -14159.9 -14101.3
361620 -14159.6 -14101.3
362880 -14159.5 -14101.2
364140 -14159.4 -14101.3
365400 -14159.2 -14101.3
366660 -14159.1 -14101.3
367920 -14159 -14101.2
369180 -14158.9 -14101.2
370440 -14158.7 -14101.2
371700 -14158.6 -14101.2
372960 -14158.5 -14101.2
374220 -14158.4 -14101.2
375480 -14158.3 -14101.2
376740 -14158.2 -14101.2
378000 -14158.2 -14101.2
