1 1472544 343250 530652
2 2945088 359963 433742
3 4417632 364264 453604
4 5890176 365825 398129
5 7362720 366824 388066
6 8835264 367373 395367
7 10307808 367835 384455
8 11780352 368219 383409
9 13252896 368326 383361
10 14725440 368529 384076
11 16197984 368561 383132
12 17670528 368615 381879
13 19143072 368635 376577
14 20615616 368643 376485
15 22088160 368645 375616
16 23560704 368650 374036
17 25033248 368667 374983
18 26505792 368670 375713
19 27978336 368680 374487
20 29450880 368683 372469
21 30923424 368737 373745
22 32395968 368737 374177
23 33868512 368737 372754
24 35341056 368741 373927
25 36813600 368742 372851
26 38286144 368743 371846
27 39758688 368743 373156
28 41231232 368759 371479
29 42703776 368760 373309
30 44176320 368760 371074
31 45648864 368761 371586
32 47121408 368762 371657
33 48593952 368762 370774
34 50066496 368762 371140
35 51539040 368766 370474
36 53011584 368767 371051
37 54484128 368768 371435
38 55956672 368768 371371
39 57429216 368768 371093
40 58901760 368767 370796
41 60374304 368770 372358
42 61846848 368770 371012
43 63319392 368772 371059
44 64791936 368776 371808
45 66264480 368778 370197
46 67737024 368780 371190
47 69209568 368791 370954
48 70682112 369024 371129
49 72154656 369024 374037
50 73627200 369024 370721
51 75099744 369024 370113
52 76572288 369024 371529
53 78044832 369024 370088
54 79517376 369024 370500
55 80989920 369024 369990
56 82462464 369024 371624
57 83935008 369024 370470
58 85407552 369025 371686
59 86880096 369025 370173
60 88352640 369025 370844
61 89825184 369025 371866
62 91297728 369026 372997
63 92770272 369026 371715
64 94242816 369026 370508
65 95715360 369026 371256
66 97187904 369026 370814
67 98660448 369026 369884
68 100132992 369026 371000
69 101605536 369026 370565
70 103078080 369026 370554
71 104550624 369026 370086
72 106023168 369026 370267
73 107495712 369026 370547
74 108968256 369026 370074
75 110440800 369026 370728
76 111913344 369026 370173
77 113385888 369030 372130
78 114858432 369030 370083
79 116330976 369030 370028
80 117803520 369030 369807
81 119276064 369030 370334
82 120748608 369030 369578
83 122221152 369030 369795
84 123693696 369030 369840
85 125166240 369030 369729
86 126638784 369030 370057
87 128111328 369030 370704
88 129583872 369030 370399
89 131056416 369030 369786
90 132528960 369030 369565
91 134001504 369030 369980
92 135474048 369030 369497
93 136946592 369030 369965
94 138419136 369030 369489
95 139891680 369030 369511
96 141364224 369030 370250
97 142836768 369030 369595
98 144309312 369030 369701
99 145781856 369030 369785
100 147254400 369030 370106