<mxfile host="app.diagrams.net" modified="2021-05-12T00:32:15.956Z" agent="5.0 (Windows NT 10.0; Win64; x64) AppleWebKit/537.36 (KHTML, like Gecko) Chrome/90.0.4430.93 Safari/537.36" etag="V32BI_H17R1HDw35GEo9" version="14.6.11" type="gitlab">
  <diagram id="ULZZuead4n8a6BoRtf3l" name="Page-1">
    <mxGraphModel dx="1117" dy="624" grid="0" gridSize="10" guides="1" tooltips="1" connect="1" arrows="1" fold="1" page="1" pageScale="1" pageWidth="1169" pageHeight="827" background="#FFFFFF" math="0" shadow="0">
      <root>
        <mxCell id="0" />
        <mxCell id="1" parent="0" />
        <mxCell id="mgUbWJ9iWevL1xQhJ-Dz-11" value="&lt;br&gt;" style="swimlane;html=1;childLayout=stackLayout;resizeParent=1;resizeParentMax=0;horizontal=0;startSize=20;horizontalStack=0;fillColor=#f5f5f5;strokeColor=#666666;fontColor=#333333;" vertex="1" parent="1">
          <mxGeometry x="14" y="80" width="1133" height="413" as="geometry" />
        </mxCell>
        <mxCell id="mgUbWJ9iWevL1xQhJ-Dz-12" value="Acteurs" style="swimlane;html=1;startSize=20;horizontal=0;" vertex="1" parent="mgUbWJ9iWevL1xQhJ-Dz-11">
          <mxGeometry x="20" width="1113" height="86" as="geometry" />
        </mxCell>
        <mxCell id="mgUbWJ9iWevL1xQhJ-Dz-17" value="" style="points=[[0.145,0.145,0],[0.5,0,0],[0.855,0.145,0],[1,0.5,0],[0.855,0.855,0],[0.5,1,0],[0.145,0.855,0],[0,0.5,0]];shape=mxgraph.bpmn.event;html=1;verticalLabelPosition=bottom;labelBackgroundColor=#ffffff;verticalAlign=top;align=center;perimeter=ellipsePerimeter;outlineConnect=0;aspect=fixed;outline=standard;symbol=general;fillColor=#d5e8d4;strokeColor=#82b366;" vertex="1" parent="mgUbWJ9iWevL1xQhJ-Dz-12">
          <mxGeometry x="46" y="10" width="24" height="24" as="geometry" />
        </mxCell>
        <mxCell id="mgUbWJ9iWevL1xQhJ-Dz-23" value="&lt;font style=&quot;font-size: 7px&quot;&gt;Valideur&lt;/font&gt;" style="text;html=1;strokeColor=none;fillColor=none;align=center;verticalAlign=middle;whiteSpace=wrap;rounded=0;" vertex="1" parent="mgUbWJ9iWevL1xQhJ-Dz-12">
          <mxGeometry x="103" y="24" width="29" height="10" as="geometry" />
        </mxCell>
        <mxCell id="mgUbWJ9iWevL1xQhJ-Dz-58" value="&lt;font style=&quot;font-size: 7px&quot;&gt;Valideur&lt;/font&gt;" style="text;html=1;strokeColor=none;fillColor=none;align=center;verticalAlign=middle;whiteSpace=wrap;rounded=0;" vertex="1" parent="mgUbWJ9iWevL1xQhJ-Dz-12">
          <mxGeometry x="429" y="33" width="29" height="10" as="geometry" />
        </mxCell>
        <mxCell id="mgUbWJ9iWevL1xQhJ-Dz-78" value="" style="points=[[0.145,0.145,0],[0.5,0,0],[0.855,0.145,0],[1,0.5,0],[0.855,0.855,0],[0.5,1,0],[0.145,0.855,0],[0,0.5,0]];shape=mxgraph.bpmn.event;html=1;verticalLabelPosition=bottom;labelBackgroundColor=#ffffff;verticalAlign=top;align=center;perimeter=ellipsePerimeter;outlineConnect=0;aspect=fixed;outline=throwing;symbol=link;fillColor=#cce5ff;strokeColor=#36393d;" vertex="1" parent="mgUbWJ9iWevL1xQhJ-Dz-12">
          <mxGeometry x="371.5" y="10" width="24" height="24" as="geometry" />
        </mxCell>
        <mxCell id="mgUbWJ9iWevL1xQhJ-Dz-79" value="&lt;font style=&quot;font-size: 7px&quot;&gt;Tasteur&lt;/font&gt;" style="text;html=1;strokeColor=none;fillColor=none;align=center;verticalAlign=middle;whiteSpace=wrap;rounded=0;" vertex="1" parent="mgUbWJ9iWevL1xQhJ-Dz-12">
          <mxGeometry x="396" y="10" width="29" height="10" as="geometry" />
        </mxCell>
        <mxCell id="mgUbWJ9iWevL1xQhJ-Dz-94" value="" style="points=[[0.145,0.145,0],[0.5,0,0],[0.855,0.145,0],[1,0.5,0],[0.855,0.855,0],[0.5,1,0],[0.145,0.855,0],[0,0.5,0]];shape=mxgraph.bpmn.event;html=1;verticalLabelPosition=bottom;labelBackgroundColor=#ffffff;verticalAlign=top;align=center;perimeter=ellipsePerimeter;outlineConnect=0;aspect=fixed;outline=throwing;symbol=link;fillColor=#cce5ff;strokeColor=#36393d;" vertex="1" parent="mgUbWJ9iWevL1xQhJ-Dz-12">
          <mxGeometry x="559" y="10" width="24" height="24" as="geometry" />
        </mxCell>
        <mxCell id="mgUbWJ9iWevL1xQhJ-Dz-95" value="&lt;font style=&quot;font-size: 7px&quot;&gt;Tasteur&lt;/font&gt;" style="text;html=1;strokeColor=none;fillColor=none;align=center;verticalAlign=middle;whiteSpace=wrap;rounded=0;" vertex="1" parent="mgUbWJ9iWevL1xQhJ-Dz-12">
          <mxGeometry x="583.5" y="10" width="29" height="10" as="geometry" />
        </mxCell>
        <mxCell id="mgUbWJ9iWevL1xQhJ-Dz-96" style="edgeStyle=orthogonalEdgeStyle;rounded=0;orthogonalLoop=1;jettySize=auto;html=1;entryX=0.25;entryY=0;entryDx=0;entryDy=0;" edge="1" parent="mgUbWJ9iWevL1xQhJ-Dz-12" source="mgUbWJ9iWevL1xQhJ-Dz-94">
          <mxGeometry relative="1" as="geometry">
            <mxPoint x="570.5" y="115" as="targetPoint" />
          </mxGeometry>
        </mxCell>
        <mxCell id="mgUbWJ9iWevL1xQhJ-Dz-106" value="" style="points=[[0.145,0.145,0],[0.5,0,0],[0.855,0.145,0],[1,0.5,0],[0.855,0.855,0],[0.5,1,0],[0.145,0.855,0],[0,0.5,0]];shape=mxgraph.bpmn.event;html=1;verticalLabelPosition=bottom;labelBackgroundColor=#ffffff;verticalAlign=top;align=center;perimeter=ellipsePerimeter;outlineConnect=0;aspect=fixed;outline=standard;symbol=general;strokeColor=#ae4132;fillColor=#fad9d5;" vertex="1" parent="mgUbWJ9iWevL1xQhJ-Dz-12">
          <mxGeometry x="1004" y="24" width="21" height="21" as="geometry" />
        </mxCell>
        <mxCell id="mgUbWJ9iWevL1xQhJ-Dz-108" value="" style="points=[[0.145,0.145,0],[0.5,0,0],[0.855,0.145,0],[1,0.5,0],[0.855,0.855,0],[0.5,1,0],[0.145,0.855,0],[0,0.5,0]];shape=mxgraph.bpmn.event;html=1;verticalLabelPosition=bottom;labelBackgroundColor=#ffffff;verticalAlign=top;align=center;perimeter=ellipsePerimeter;outlineConnect=0;aspect=fixed;outline=catching;symbol=link;fontColor=#ffffff;fillColor=#9E3DFF;strokeColor=#4D00BF;" vertex="1" parent="mgUbWJ9iWevL1xQhJ-Dz-12">
          <mxGeometry x="401" y="22.5" width="24" height="24" as="geometry" />
        </mxCell>
        <mxCell id="mgUbWJ9iWevL1xQhJ-Dz-110" value="" style="points=[[0.145,0.145,0],[0.5,0,0],[0.855,0.145,0],[1,0.5,0],[0.855,0.855,0],[0.5,1,0],[0.145,0.855,0],[0,0.5,0]];shape=mxgraph.bpmn.event;html=1;verticalLabelPosition=bottom;labelBackgroundColor=#ffffff;verticalAlign=top;align=center;perimeter=ellipsePerimeter;outlineConnect=0;aspect=fixed;outline=catching;symbol=link;fontColor=#ffffff;fillColor=#9E3DFF;strokeColor=#4D00BF;" vertex="1" parent="mgUbWJ9iWevL1xQhJ-Dz-12">
          <mxGeometry x="76" y="22.5" width="24" height="24" as="geometry" />
        </mxCell>
        <mxCell id="mgUbWJ9iWevL1xQhJ-Dz-27" value="" style="edgeStyle=orthogonalEdgeStyle;rounded=0;orthogonalLoop=1;jettySize=auto;html=1;entryX=0.5;entryY=0;entryDx=0;entryDy=0;" edge="1" parent="mgUbWJ9iWevL1xQhJ-Dz-11" source="mgUbWJ9iWevL1xQhJ-Dz-110" target="mgUbWJ9iWevL1xQhJ-Dz-25">
          <mxGeometry relative="1" as="geometry">
            <mxPoint x="108" y="48.000000000000114" as="sourcePoint" />
            <mxPoint x="116" y="96" as="targetPoint" />
          </mxGeometry>
        </mxCell>
        <mxCell id="mgUbWJ9iWevL1xQhJ-Dz-32" style="edgeStyle=orthogonalEdgeStyle;rounded=0;orthogonalLoop=1;jettySize=auto;html=1;entryX=0.25;entryY=0;entryDx=0;entryDy=0;" edge="1" parent="mgUbWJ9iWevL1xQhJ-Dz-11" source="mgUbWJ9iWevL1xQhJ-Dz-17" target="mgUbWJ9iWevL1xQhJ-Dz-25">
          <mxGeometry relative="1" as="geometry">
            <Array as="points">
              <mxPoint x="78" y="53" />
              <mxPoint x="78" y="53" />
            </Array>
          </mxGeometry>
        </mxCell>
        <mxCell id="mgUbWJ9iWevL1xQhJ-Dz-57" style="edgeStyle=orthogonalEdgeStyle;rounded=0;orthogonalLoop=1;jettySize=auto;html=1;entryX=0.5;entryY=0;entryDx=0;entryDy=0;" edge="1" parent="mgUbWJ9iWevL1xQhJ-Dz-11" target="mgUbWJ9iWevL1xQhJ-Dz-45">
          <mxGeometry relative="1" as="geometry">
            <mxPoint x="433" y="50" as="sourcePoint" />
          </mxGeometry>
        </mxCell>
        <mxCell id="mgUbWJ9iWevL1xQhJ-Dz-80" style="edgeStyle=orthogonalEdgeStyle;rounded=0;orthogonalLoop=1;jettySize=auto;html=1;entryX=0.25;entryY=0;entryDx=0;entryDy=0;" edge="1" parent="mgUbWJ9iWevL1xQhJ-Dz-11" source="mgUbWJ9iWevL1xQhJ-Dz-78" target="mgUbWJ9iWevL1xQhJ-Dz-45">
          <mxGeometry relative="1" as="geometry" />
        </mxCell>
        <mxCell id="mgUbWJ9iWevL1xQhJ-Dz-104" style="edgeStyle=orthogonalEdgeStyle;rounded=0;orthogonalLoop=1;jettySize=auto;html=1;exitX=0.5;exitY=1;exitDx=0;exitDy=0;exitPerimeter=0;" edge="1" parent="mgUbWJ9iWevL1xQhJ-Dz-11" source="mgUbWJ9iWevL1xQhJ-Dz-106" target="mgUbWJ9iWevL1xQhJ-Dz-97">
          <mxGeometry relative="1" as="geometry">
            <mxPoint x="1073" y="47" as="sourcePoint" />
          </mxGeometry>
        </mxCell>
        <mxCell id="mgUbWJ9iWevL1xQhJ-Dz-13" value="Activités" style="swimlane;html=1;startSize=20;horizontal=0;" vertex="1" parent="mgUbWJ9iWevL1xQhJ-Dz-11">
          <mxGeometry x="20" y="86" width="1113" height="327" as="geometry" />
        </mxCell>
        <mxCell id="mgUbWJ9iWevL1xQhJ-Dz-25" value="&lt;span style=&quot;text-align: left&quot;&gt;&lt;font&gt;&lt;font color=&quot;#202124&quot; face=&quot;google sans, arial, sans-serif&quot;&gt;&lt;span style=&quot;font-size: 14px&quot;&gt;Développement /I&lt;/span&gt;&lt;/font&gt;&lt;font color=&quot;#202124&quot; face=&quot;google sans, arial, sans-serif&quot;&gt;&lt;span style=&quot;font-size: 14px&quot;&gt;ntégration&lt;/span&gt;&lt;/font&gt;&lt;br&gt;&lt;/font&gt;&lt;/span&gt;" style="rounded=1;whiteSpace=wrap;html=1;fillColor=#ffe6cc;strokeColor=#d79b00;" vertex="1" parent="mgUbWJ9iWevL1xQhJ-Dz-13">
          <mxGeometry x="28" y="29" width="120" height="60" as="geometry" />
        </mxCell>
        <mxCell id="mgUbWJ9iWevL1xQhJ-Dz-47" style="edgeStyle=orthogonalEdgeStyle;rounded=0;orthogonalLoop=1;jettySize=auto;html=1;exitX=1;exitY=0.5;exitDx=0;exitDy=0;exitPerimeter=0;entryX=0;entryY=0.5;entryDx=0;entryDy=0;startArrow=none;" edge="1" parent="mgUbWJ9iWevL1xQhJ-Dz-13" source="mgUbWJ9iWevL1xQhJ-Dz-52" target="mgUbWJ9iWevL1xQhJ-Dz-45">
          <mxGeometry relative="1" as="geometry" />
        </mxCell>
        <mxCell id="mgUbWJ9iWevL1xQhJ-Dz-40" value="" style="points=[[0.25,0.25,0],[0.5,0,0],[0.75,0.25,0],[1,0.5,0],[0.75,0.75,0],[0.5,1,0],[0.25,0.75,0],[0,0.5,0]];shape=mxgraph.bpmn.gateway2;html=1;verticalLabelPosition=bottom;labelBackgroundColor=#ffffff;verticalAlign=top;align=center;perimeter=rhombusPerimeter;outlineConnect=0;outline=none;symbol=none;fontFamily=Helvetica;fontSize=12;strokeColor=#36393d;fillColor=#cdeb8b;" vertex="1" parent="mgUbWJ9iWevL1xQhJ-Dz-13">
          <mxGeometry x="248" y="35" width="44" height="48" as="geometry" />
        </mxCell>
        <mxCell id="mgUbWJ9iWevL1xQhJ-Dz-41" value="" style="edgeStyle=orthogonalEdgeStyle;rounded=0;orthogonalLoop=1;jettySize=auto;html=1;" edge="1" parent="mgUbWJ9iWevL1xQhJ-Dz-13" source="mgUbWJ9iWevL1xQhJ-Dz-25" target="mgUbWJ9iWevL1xQhJ-Dz-40">
          <mxGeometry relative="1" as="geometry" />
        </mxCell>
        <mxCell id="mgUbWJ9iWevL1xQhJ-Dz-42" value="Validation" style="text;html=1;strokeColor=none;fillColor=none;align=center;verticalAlign=middle;whiteSpace=wrap;rounded=0;" vertex="1" parent="mgUbWJ9iWevL1xQhJ-Dz-13">
          <mxGeometry x="253" y="9" width="40" height="20" as="geometry" />
        </mxCell>
        <mxCell id="mgUbWJ9iWevL1xQhJ-Dz-55" style="edgeStyle=orthogonalEdgeStyle;rounded=0;orthogonalLoop=1;jettySize=auto;html=1;entryX=0;entryY=0.5;entryDx=0;entryDy=0;" edge="1" parent="mgUbWJ9iWevL1xQhJ-Dz-13" source="mgUbWJ9iWevL1xQhJ-Dz-45" target="mgUbWJ9iWevL1xQhJ-Dz-54">
          <mxGeometry relative="1" as="geometry" />
        </mxCell>
        <mxCell id="mgUbWJ9iWevL1xQhJ-Dz-45" value="plan de test&lt;br&gt;scénarii de test&lt;br&gt;jeux d&#39;essai" style="rounded=1;whiteSpace=wrap;html=1;fillColor=#ffe6cc;strokeColor=#d79b00;" vertex="1" parent="mgUbWJ9iWevL1xQhJ-Dz-13">
          <mxGeometry x="353" y="29" width="120" height="60" as="geometry" />
        </mxCell>
        <mxCell id="mgUbWJ9iWevL1xQhJ-Dz-62" style="edgeStyle=orthogonalEdgeStyle;rounded=0;orthogonalLoop=1;jettySize=auto;html=1;entryX=1;entryY=0.5;entryDx=0;entryDy=0;" edge="1" parent="mgUbWJ9iWevL1xQhJ-Dz-13" source="mgUbWJ9iWevL1xQhJ-Dz-48" target="mgUbWJ9iWevL1xQhJ-Dz-61">
          <mxGeometry relative="1" as="geometry" />
        </mxCell>
        <mxCell id="mgUbWJ9iWevL1xQhJ-Dz-48" value="Mis a jour JIRA" style="rounded=1;whiteSpace=wrap;html=1;fillColor=#ffe6cc;strokeColor=#d79b00;" vertex="1" parent="mgUbWJ9iWevL1xQhJ-Dz-13">
          <mxGeometry x="177" y="142" width="71" height="60" as="geometry" />
        </mxCell>
        <mxCell id="mgUbWJ9iWevL1xQhJ-Dz-60" style="edgeStyle=orthogonalEdgeStyle;rounded=0;orthogonalLoop=1;jettySize=auto;html=1;entryX=1;entryY=0.5;entryDx=0;entryDy=0;" edge="1" parent="mgUbWJ9iWevL1xQhJ-Dz-13" source="mgUbWJ9iWevL1xQhJ-Dz-50" target="mgUbWJ9iWevL1xQhJ-Dz-48">
          <mxGeometry relative="1" as="geometry">
            <Array as="points">
              <mxPoint x="268" y="172" />
            </Array>
          </mxGeometry>
        </mxCell>
        <mxCell id="mgUbWJ9iWevL1xQhJ-Dz-50" value="NON" style="text;html=1;strokeColor=none;fillColor=none;align=center;verticalAlign=middle;whiteSpace=wrap;rounded=0;" vertex="1" parent="mgUbWJ9iWevL1xQhJ-Dz-13">
          <mxGeometry x="255" y="103" width="29" height="12" as="geometry" />
        </mxCell>
        <mxCell id="mgUbWJ9iWevL1xQhJ-Dz-51" value="" style="edgeStyle=orthogonalEdgeStyle;rounded=0;orthogonalLoop=1;jettySize=auto;html=1;exitX=0.5;exitY=1;exitDx=0;exitDy=0;exitPerimeter=0;entryX=0.5;entryY=0;entryDx=0;entryDy=0;endArrow=none;" edge="1" parent="mgUbWJ9iWevL1xQhJ-Dz-13" source="mgUbWJ9iWevL1xQhJ-Dz-40" target="mgUbWJ9iWevL1xQhJ-Dz-50">
          <mxGeometry relative="1" as="geometry">
            <mxPoint x="303.5" y="179" as="sourcePoint" />
            <mxPoint x="387" y="244" as="targetPoint" />
          </mxGeometry>
        </mxCell>
        <mxCell id="mgUbWJ9iWevL1xQhJ-Dz-52" value="OUI" style="text;html=1;strokeColor=none;fillColor=none;align=center;verticalAlign=middle;whiteSpace=wrap;rounded=0;" vertex="1" parent="mgUbWJ9iWevL1xQhJ-Dz-13">
          <mxGeometry x="305" y="53.5" width="27" height="11" as="geometry" />
        </mxCell>
        <mxCell id="mgUbWJ9iWevL1xQhJ-Dz-53" value="" style="edgeStyle=orthogonalEdgeStyle;rounded=0;orthogonalLoop=1;jettySize=auto;html=1;exitX=1;exitY=0.5;exitDx=0;exitDy=0;exitPerimeter=0;entryX=0;entryY=0.5;entryDx=0;entryDy=0;endArrow=none;" edge="1" parent="mgUbWJ9iWevL1xQhJ-Dz-13" source="mgUbWJ9iWevL1xQhJ-Dz-40" target="mgUbWJ9iWevL1xQhJ-Dz-52">
          <mxGeometry relative="1" as="geometry">
            <mxPoint x="324.9999999999999" y="155" as="sourcePoint" />
            <mxPoint x="387" y="155" as="targetPoint" />
          </mxGeometry>
        </mxCell>
        <mxCell id="mgUbWJ9iWevL1xQhJ-Dz-65" style="edgeStyle=orthogonalEdgeStyle;rounded=0;orthogonalLoop=1;jettySize=auto;html=1;entryX=0;entryY=0.5;entryDx=0;entryDy=0;entryPerimeter=0;" edge="1" parent="mgUbWJ9iWevL1xQhJ-Dz-13" source="mgUbWJ9iWevL1xQhJ-Dz-54" target="mgUbWJ9iWevL1xQhJ-Dz-64">
          <mxGeometry relative="1" as="geometry" />
        </mxCell>
        <mxCell id="mgUbWJ9iWevL1xQhJ-Dz-54" value="Exécution des tests" style="rounded=1;whiteSpace=wrap;html=1;fillColor=#ffe6cc;strokeColor=#d79b00;" vertex="1" parent="mgUbWJ9iWevL1xQhJ-Dz-13">
          <mxGeometry x="517" y="29" width="120" height="60" as="geometry" />
        </mxCell>
        <mxCell id="mgUbWJ9iWevL1xQhJ-Dz-63" style="edgeStyle=orthogonalEdgeStyle;rounded=0;orthogonalLoop=1;jettySize=auto;html=1;entryX=0.5;entryY=1;entryDx=0;entryDy=0;" edge="1" parent="mgUbWJ9iWevL1xQhJ-Dz-13" source="mgUbWJ9iWevL1xQhJ-Dz-61" target="mgUbWJ9iWevL1xQhJ-Dz-25">
          <mxGeometry relative="1" as="geometry" />
        </mxCell>
        <mxCell id="mgUbWJ9iWevL1xQhJ-Dz-61" value="Correction" style="rounded=1;whiteSpace=wrap;html=1;fillColor=#ffe6cc;strokeColor=#d79b00;" vertex="1" parent="mgUbWJ9iWevL1xQhJ-Dz-13">
          <mxGeometry x="52.5" y="142" width="71" height="60" as="geometry" />
        </mxCell>
        <mxCell id="mgUbWJ9iWevL1xQhJ-Dz-64" value="" style="points=[[0.25,0.25,0],[0.5,0,0],[0.75,0.25,0],[1,0.5,0],[0.75,0.75,0],[0.5,1,0],[0.25,0.75,0],[0,0.5,0]];shape=mxgraph.bpmn.gateway2;html=1;verticalLabelPosition=bottom;labelBackgroundColor=#ffffff;verticalAlign=top;align=center;perimeter=rhombusPerimeter;outlineConnect=0;outline=none;symbol=none;fontFamily=Helvetica;fontSize=12;strokeColor=#36393d;fillColor=#cce5ff;" vertex="1" parent="mgUbWJ9iWevL1xQhJ-Dz-13">
          <mxGeometry x="685" y="35" width="43" height="48" as="geometry" />
        </mxCell>
        <mxCell id="mgUbWJ9iWevL1xQhJ-Dz-66" value="Résultats" style="text;html=1;strokeColor=none;fillColor=none;align=center;verticalAlign=middle;whiteSpace=wrap;rounded=0;" vertex="1" parent="mgUbWJ9iWevL1xQhJ-Dz-13">
          <mxGeometry x="685" y="9" width="40" height="20" as="geometry" />
        </mxCell>
        <mxCell id="mgUbWJ9iWevL1xQhJ-Dz-75" style="edgeStyle=orthogonalEdgeStyle;rounded=0;orthogonalLoop=1;jettySize=auto;html=1;exitX=1;exitY=0.5;exitDx=0;exitDy=0;entryX=0;entryY=0.5;entryDx=0;entryDy=0;" edge="1" parent="mgUbWJ9iWevL1xQhJ-Dz-13" source="mgUbWJ9iWevL1xQhJ-Dz-69" target="mgUbWJ9iWevL1xQhJ-Dz-74">
          <mxGeometry relative="1" as="geometry">
            <mxPoint x="898" y="57.999999999999886" as="sourcePoint" />
          </mxGeometry>
        </mxCell>
        <mxCell id="mgUbWJ9iWevL1xQhJ-Dz-69" value="OK" style="text;html=1;strokeColor=none;fillColor=none;align=center;verticalAlign=middle;whiteSpace=wrap;rounded=0;" vertex="1" parent="mgUbWJ9iWevL1xQhJ-Dz-13">
          <mxGeometry x="753" y="53.5" width="27" height="11" as="geometry" />
        </mxCell>
        <mxCell id="mgUbWJ9iWevL1xQhJ-Dz-70" value="" style="edgeStyle=orthogonalEdgeStyle;rounded=0;orthogonalLoop=1;jettySize=auto;html=1;exitX=1;exitY=0.5;exitDx=0;exitDy=0;exitPerimeter=0;entryX=0;entryY=0.5;entryDx=0;entryDy=0;endArrow=none;" edge="1" parent="mgUbWJ9iWevL1xQhJ-Dz-13" source="mgUbWJ9iWevL1xQhJ-Dz-64" target="mgUbWJ9iWevL1xQhJ-Dz-69">
          <mxGeometry relative="1" as="geometry">
            <mxPoint x="762" y="155" as="sourcePoint" />
            <mxPoint x="806" y="155" as="targetPoint" />
          </mxGeometry>
        </mxCell>
        <mxCell id="mgUbWJ9iWevL1xQhJ-Dz-73" style="edgeStyle=orthogonalEdgeStyle;rounded=0;orthogonalLoop=1;jettySize=auto;html=1;entryX=1;entryY=0.5;entryDx=0;entryDy=0;" edge="1" parent="mgUbWJ9iWevL1xQhJ-Dz-13" source="mgUbWJ9iWevL1xQhJ-Dz-71" target="mgUbWJ9iWevL1xQhJ-Dz-48">
          <mxGeometry relative="1" as="geometry" />
        </mxCell>
        <mxCell id="mgUbWJ9iWevL1xQhJ-Dz-71" value="&lt;font style=&quot;font-size: 18px ; background-color: rgb(255 , 255 , 255)&quot; color=&quot;#ff3333&quot;&gt;Alerte&lt;/font&gt;" style="points=[[0.145,0.145,0],[0.5,0,0],[0.855,0.145,0],[1,0.5,0],[0.855,0.855,0],[0.5,1,0],[0.145,0.855,0],[0,0.5,0]];shape=mxgraph.bpmn.event;html=1;verticalLabelPosition=bottom;labelBackgroundColor=#ffffff;verticalAlign=top;align=center;perimeter=ellipsePerimeter;outlineConnect=0;aspect=fixed;outline=boundInt;symbol=cancel;shadow=0;dashed=0;fontFamily=Helvetica;fontSize=12;fontColor=#000000;fillColor=#E6E6E6;strokeColor=#FF1303;" vertex="1" parent="mgUbWJ9iWevL1xQhJ-Dz-13">
          <mxGeometry x="680.5" y="152.5" width="51.32" height="38.5" as="geometry" />
        </mxCell>
        <mxCell id="mgUbWJ9iWevL1xQhJ-Dz-72" value="" style="edgeStyle=orthogonalEdgeStyle;rounded=0;orthogonalLoop=1;jettySize=auto;html=1;startArrow=none;" edge="1" parent="mgUbWJ9iWevL1xQhJ-Dz-13" source="mgUbWJ9iWevL1xQhJ-Dz-76" target="mgUbWJ9iWevL1xQhJ-Dz-71">
          <mxGeometry relative="1" as="geometry" />
        </mxCell>
        <mxCell id="mgUbWJ9iWevL1xQhJ-Dz-74" value="Mis a jour JIRA" style="rounded=1;whiteSpace=wrap;html=1;fillColor=#ffe6cc;strokeColor=#d79b00;" vertex="1" parent="mgUbWJ9iWevL1xQhJ-Dz-13">
          <mxGeometry x="833" y="29" width="71" height="60" as="geometry" />
        </mxCell>
        <mxCell id="mgUbWJ9iWevL1xQhJ-Dz-76" value="KO" style="text;html=1;strokeColor=none;fillColor=none;align=center;verticalAlign=middle;whiteSpace=wrap;rounded=0;" vertex="1" parent="mgUbWJ9iWevL1xQhJ-Dz-13">
          <mxGeometry x="693" y="106" width="27" height="11" as="geometry" />
        </mxCell>
        <mxCell id="mgUbWJ9iWevL1xQhJ-Dz-77" value="" style="edgeStyle=orthogonalEdgeStyle;rounded=0;orthogonalLoop=1;jettySize=auto;html=1;endArrow=none;" edge="1" parent="mgUbWJ9iWevL1xQhJ-Dz-13" source="mgUbWJ9iWevL1xQhJ-Dz-64" target="mgUbWJ9iWevL1xQhJ-Dz-76">
          <mxGeometry relative="1" as="geometry">
            <mxPoint x="740.4999999999998" y="179.0000000000001" as="sourcePoint" />
            <mxPoint x="740.4999999999998" y="248.5" as="targetPoint" />
          </mxGeometry>
        </mxCell>
        <mxCell id="mgUbWJ9iWevL1xQhJ-Dz-97" value="Rapport" style="ellipse;whiteSpace=wrap;html=1;rounded=1;fillColor=#ffe6cc;strokeColor=#d79b00;" vertex="1" parent="mgUbWJ9iWevL1xQhJ-Dz-13">
          <mxGeometry x="968" y="29" width="93" height="60" as="geometry" />
        </mxCell>
        <mxCell id="mgUbWJ9iWevL1xQhJ-Dz-98" value="" style="edgeStyle=orthogonalEdgeStyle;rounded=0;orthogonalLoop=1;jettySize=auto;html=1;" edge="1" parent="mgUbWJ9iWevL1xQhJ-Dz-13" source="mgUbWJ9iWevL1xQhJ-Dz-74" target="mgUbWJ9iWevL1xQhJ-Dz-97">
          <mxGeometry relative="1" as="geometry" />
        </mxCell>
      </root>
    </mxGraphModel>
  </diagram>
</mxfile>
