{
  "use_state": {
    "prefix": ["use", "sta"],
    "body": "const [$NAME, set$NAME] = useState($DEFAULT);",
    "description": "useState hook"
  },
  "use_effect": {
    "prefix": ["use", "eff"],
    "body": ["useEffect(() => {",
      "$EFFECT",
    "}, [$DEPENDENCIES])"],
    "description": "useEffect hook"
  },
  "react_native": {
    "prefix": ["rfc", "imp"],
    "body": [
      "import React from 'react' ;",  
      "import PropTypes from 'prop-types';\n",
      "const ${TM_FILENAME_BASE} = props => {",
      "\treturn ($)",
      "};\n",
      "${TM_FILENAME_BASE}.propTypes = {",
      "\t$",
      "};"  
    ],
    "description": "React component"
  }
}